{"text_format":"1","workbook":"xlsx","n_sheets":4,"sheets":["Accueil","Evaluation","Barèmes & Options","Présentation des profils"],"not_rendered":{"charts":0,"images":1,"macros":1,"external_links":0,"defined_names":393,"comments":1,"pivot_tables":0},"unopened":[],"bounds":{"document_bytes":16777216,"sheet_cells":100000,"rows_first":2000,"rows_last":500,"rows_between":2000,"halvings":0,"cell_chars":16384,"cell_head_chars":4096},"cells_cut":0,"cells_raw":0,"read":"whole","date_system":"1900"}

{"sheet":"Accueil","index":0,"n_rows":0,"n_cols":0,"rows_kept":0,"cut":false,"hidden":false,"merged":[]}

{"sheet":"Evaluation","index":1,"n_rows":101,"n_cols":43,"rows_kept":101,"cut":false,"hidden":false,"merged":[[0,0,0,34]]}
["Course de demi-fond Bac GT - N4 - 2018"]
[]
["Nom","Prénom","Sexe F ou M","Classe","Profil","Projet C1","500-1","Profil si régulation","500-2","500-3","Points echauff. / 2","Temps Total","Ecart Projet","profil choisi","Projet C1","500-1","500-2","500-3","c2-c1","c3-c2","c3-c1","respect c1-c2=","respect c1-c2+","respect c1-c2-","respect C2-C3=","respect C2-C3+","respect C2-C3-","Respect Profile 9","points respect","Respect C1","Respect C2","points profil / 3","Point projet C1 / 1","Points perf / 14","Note / 20",null,null,null,null,null,"Sexe"]
[null,null,null,null,null,null,null,null,null,null,null,{"$f":"IF(AND(R4<>\"\",Q4<>\"\",P4<>\"\"),(INT(((INT($P4)*60)+(($P4-INT($P4))*100)+(INT($Q4)*60)+(($Q4-INT($Q4))*100)+(INT($R4)*60)+(($R4-INT($R4))*100))/60)+MOD(((INT($P4)*60)+(($P4-INT($P4))*100)+(INT($Q4)*60)+(($Q4-INT($Q4))*100)+(INT($R4)*60)+(($R4-INT($R4))*100)),60)/100)*100,\"\")","v":""},{"$f":"IF(OR(O4=\"\",P4=\"\"),\"\",ABS((INT(P4)*60)+((P4-INT(P4))*100)-((INT(O4)*60)+((O4-INT(O4))*100))))","v":""},{"$f":"IF(AND(E4=\"\",H4=\"\"),\"\",IF(H4=\"\",E4,H4))","v":""},{"$f":"IF(F4=\"\",\"\",F4/100)","v":""},{"$f":"IF(G4=\"\",\"\",G4/100)","v":""},{"$f":"IF(I4=\"\",\"\",I4/100)","v":""},{"$f":"IF(J4=\"\",\"\",J4/100)","v":""},{"$f":"ROUND((INT(Q4)*60)+((Q4-INT(Q4))*100)-((INT(P4)*60)+((P4-INT(P4))*100)),0)","v":{"$error":"#VALUE!"}},{"$f":"ROUND((INT(R4)*60)+((R4-INT(R4))*100)-((INT(Q4)*60)+((Q4-INT(Q4))*100)),0)","v":{"$error":"#VALUE!"}},{"$f":"ROUND((INT(R4)*60)+((R4-INT(R4))*100)-((INT(P4)*60)+((P4-INT(P4))*100)),0)","v":{"$error":"#VALUE!"}},{"$f":"IF(AND(Q4<>0,P4<>0),IF(OR(N4=1,N4=3,N4=4),IF(OR(S4=0,ABS(S4)<='Barèmes & Options'!H$2),1,0)),\"\")","v":false},{"$f":"IF(AND(Q4<>\"\",P4<>\"\"),IF(OR(N4=5,N4=7),IF(S4>0,1,0)),\"\")","v":""},{"$f":"IF(AND(Q4<>\"\",P4<>\"\"),IF(OR(N4=2,N4=6,N4=8),IF(S4<0,1,0)),\"\")","v":""},{"$f":"IF(AND(Q4<>0,R4<>0),IF(OR(N4=1,N4=5,N4=6),IF(OR(T4=0,ABS(T4)<='Barèmes & Options'!H$2),1,0)),\"\")","v":false},{"$f":"IF(AND(Q4<>\"\",R4<>\"\"),IF(OR(N4=4,N4=8),IF(T4>0,1,0)),\"\")","v":""},{"$f":"IF(AND(Q4<>\"\",R4<>\"\"),IF(OR(N4=2,N4=3,N4=7),IF(T4<0,1,0)),\"\")","v":""},{"$f":"IF(SUM(V4:AA4)=2,IF(N4=2,IF(N4=2,IF(U4-'Barèmes & Options'!H$2<-1,0,1)),\"\"),0)","v":0},{"$f":"IF(OR(N4=2,N4=9),SUM(V4:AA4)-AB4,SUM(V4:AA4))","v":0},{"$f":"IF(OR(V4=1,W4=1,X4=1),TRUE,FALSE)","v":false},{"$f":"IF(OR(Y4=1,Z4=1,AA4=1),TRUE,FALSE)","v":false},{"$f":"IF(N4<>\"\",IF(AND(N4>=1,N4<=8,N4=ABS(N4)),IF(AND(N4<=9,N4>=1),IF(AND(AC4=1,H4<>\"\"),1,IF(AND(AC4=1,H4=\"\"),1.5,IF(AND(AC4=2,H4<>\"\"),2,IF(AND(AC4=2,H4=\"\"),3,0)))),\"\"),\"Err. Profil\"),\"\")","v":""},{"$f":"IF(O4<>\"\",IF(ROUND(M4,0)<=3,1,0),\"\")","v":""},{"$f":"IF(AND(R4<>\"\",Q4<>\"\",P4<>\"\"),IF($C4=\"\",\"SX\",IF($C4=\"F\",VLOOKUP(ROUND($L4,0)/100,Barème500,3),VLOOKUP(ROUND($L4,0)/100,Barème500,2))),\"\")","v":""},{"$f":"IF(OR(K4=\"\",K4=\"\",AH4=\"\",AG4=\"\",AF4=\"\"),\"\",IF(OR(K4<0,K4>2),\"Err ech.\",SUM(K4,AH4,AG4,AF4)))","v":""},null,"Moyenne F. :",{"$f":"IF(ISERROR(AP4),\"\",AP4)","v":""},null,null,{"$f":"IF(C4<>\"f\",\"m\",\"f\")","v":"m"},{"$f":"AVERAGEIF(AO4:AO101,\"f\",AI4:AI101)","v":{"$error":"#DIV/0!"}},"filles"]
[null,null,null,null,null,null,null,null,null,null,null,{"$f":"IF(AND(R5<>\"\",Q5<>\"\",P5<>\"\"),(INT(((INT($P5)*60)+(($P5-INT($P5))*100)+(INT($Q5)*60)+(($Q5-INT($Q5))*100)+(INT($R5)*60)+(($R5-INT($R5))*100))/60)+MOD(((INT($P5)*60)+(($P5-INT($P5))*100)+(INT($Q5)*60)+(($Q5-INT($Q5))*100)+(INT($R5)*60)+(($R5-INT($R5))*100)),60)/100)*100,\"\")","v":""},{"$f":"IF(OR(O5=\"\",P5=\"\"),\"\",ABS((INT(P5)*60)+((P5-INT(P5))*100)-((INT(O5)*60)+((O5-INT(O5))*100))))","v":""},{"$f":"IF(AND(E5=\"\",H5=\"\"),\"\",IF(H5=\"\",E5,H5))","v":""},{"$f":"IF(F5=\"\",\"\",F5/100)","v":""},{"$f":"IF(G5=\"\",\"\",G5/100)","v":""},{"$f":"IF(I5=\"\",\"\",I5/100)","v":""},{"$f":"IF(J5=\"\",\"\",J5/100)","v":""},{"$f":"ROUND((INT(Q5)*60)+((Q5-INT(Q5))*100)-((INT(P5)*60)+((P5-INT(P5))*100)),0)","v":{"$error":"#VALUE!"}},{"$f":"ROUND((INT(R5)*60)+((R5-INT(R5))*100)-((INT(Q5)*60)+((Q5-INT(Q5))*100)),0)","v":{"$error":"#VALUE!"}},{"$f":"ROUND((INT(R5)*60)+((R5-INT(R5))*100)-((INT(P5)*60)+((P5-INT(P5))*100)),0)","v":{"$error":"#VALUE!"}},{"$f":"IF(AND(Q5<>0,P5<>0),IF(OR(N5=1,N5=3,N5=4),IF(OR(S5=0,ABS(S5)<='Barèmes & Options'!H$2),1,0)),\"\")","v":false},{"$f":"IF(AND(Q5<>\"\",P5<>\"\"),IF(OR(N5=5,N5=7),IF(S5>0,1,0)),\"\")","v":""},{"$f":"IF(AND(Q5<>\"\",P5<>\"\"),IF(OR(N5=2,N5=6,N5=8),IF(S5<0,1,0)),\"\")","v":""},{"$f":"IF(AND(Q5<>0,R5<>0),IF(OR(N5=1,N5=5,N5=6),IF(OR(T5=0,ABS(T5)<='Barèmes & Options'!H$2),1,0)),\"\")","v":false},{"$f":"IF(AND(Q5<>\"\",R5<>\"\"),IF(OR(N5=4,N5=8),IF(T5>0,1,0)),\"\")","v":""},{"$f":"IF(AND(Q5<>\"\",R5<>\"\"),IF(OR(N5=2,N5=3,N5=7),IF(T5<0,1,0)),\"\")","v":""},{"$f":"IF(SUM(V5:AA5)=2,IF(N5=2,IF(N5=2,IF(U5-'Barèmes & Options'!H$2<-1,0,1)),\"\"),0)","v":0},{"$f":"IF(OR(N5=2,N5=9),SUM(V5:AA5)-AB5,SUM(V5:AA5))","v":0},{"$f":"IF(OR(V5=1,W5=1,X5=1),TRUE,FALSE)","v":false},{"$f":"IF(OR(Y5=1,Z5=1,AA5=1),TRUE,FALSE)","v":false},{"$f":"IF(N5<>\"\",IF(AND(N5>=1,N5<=8,N5=ABS(N5)),IF(AND(N5<=9,N5>=1),IF(AND(AC5=1,H5<>\"\"),1,IF(AND(AC5=1,H5=\"\"),1.5,IF(AND(AC5=2,H5<>\"\"),2,IF(AND(AC5=2,H5=\"\"),3,0)))),\"\"),\"Err. Profil\"),\"\")","v":""},{"$f":"IF(O5<>\"\",IF(ROUND(M5,0)<=3,1,0),\"\")","v":""},{"$f":"IF(AND(R5<>\"\",Q5<>\"\",P5<>\"\"),IF($C5=\"\",\"SX\",IF($C5=\"F\",VLOOKUP(ROUND($L5,0)/100,Barème500,3),VLOOKUP(ROUND($L5,0)/100,Barème500,2))),\"\")","v":""},{"$f":"IF(OR(K5=\"\",K5=\"\",AH5=\"\",AG5=\"\",AF5=\"\"),\"\",IF(OR(K5<0,K5>2),\"Err ech.\",SUM(K5,AH5,AG5,AF5)))","v":""},null,"moyenne G. :",{"$f":"IF(ISERROR(AP5),\"\",AP5)","v":""},null,null,{"$f":"IF(C5<>\"f\",\"m\",\"f\")","v":"m"},{"$f":"AVERAGEIF(AO4:AO101,\"m\",AI4:AI101)","v":{"$error":"#DIV/0!"}},"garçons"]
[null,null,null,null,null,null,null,null,null,null,null,{"$f":"IF(AND(R6<>\"\",Q6<>\"\",P6<>\"\"),(INT(((INT($P6)*60)+(($P6-INT($P6))*100)+(INT($Q6)*60)+(($Q6-INT($Q6))*100)+(INT($R6)*60)+(($R6-INT($R6))*100))/60)+MOD(((INT($P6)*60)+(($P6-INT($P6))*100)+(INT($Q6)*60)+(($Q6-INT($Q6))*100)+(INT($R6)*60)+(($R6-INT($R6))*100)),60)/100)*100,\"\")","v":""},{"$f":"IF(OR(O6=\"\",P6=\"\"),\"\",ABS((INT(P6)*60)+((P6-INT(P6))*100)-((INT(O6)*60)+((O6-INT(O6))*100))))","v":""},{"$f":"IF(AND(E6=\"\",H6=\"\"),\"\",IF(H6=\"\",E6,H6))","v":""},{"$f":"IF(F6=\"\",\"\",F6/100)","v":""},{"$f":"IF(G6=\"\",\"\",G6/100)","v":""},{"$f":"IF(I6=\"\",\"\",I6/100)","v":""},{"$f":"IF(J6=\"\",\"\",J6/100)","v":""},{"$f":"ROUND((INT(Q6)*60)+((Q6-INT(Q6))*100)-((INT(P6)*60)+((P6-INT(P6))*100)),0)","v":{"$error":"#VALUE!"}},{"$f":"ROUND((INT(R6)*60)+((R6-INT(R6))*100)-((INT(Q6)*60)+((Q6-INT(Q6))*100)),0)","v":{"$error":"#VALUE!"}},{"$f":"ROUND((INT(R6)*60)+((R6-INT(R6))*100)-((INT(P6)*60)+((P6-INT(P6))*100)),0)","v":{"$error":"#VALUE!"}},{"$f":"IF(AND(Q6<>0,P6<>0),IF(OR(N6=1,N6=3,N6=4),IF(OR(S6=0,ABS(S6)<='Barèmes & Options'!H$2),1,0)),\"\")","v":false},{"$f":"IF(AND(Q6<>\"\",P6<>\"\"),IF(OR(N6=5,N6=7),IF(S6>0,1,0)),\"\")","v":""},{"$f":"IF(AND(Q6<>\"\",P6<>\"\"),IF(OR(N6=2,N6=6,N6=8),IF(S6<0,1,0)),\"\")","v":""},{"$f":"IF(AND(Q6<>0,R6<>0),IF(OR(N6=1,N6=5,N6=6),IF(OR(T6=0,ABS(T6)<='Barèmes & Options'!H$2),1,0)),\"\")","v":false},{"$f":"IF(AND(Q6<>\"\",R6<>\"\"),IF(OR(N6=4,N6=8),IF(T6>0,1,0)),\"\")","v":""},{"$f":"IF(AND(Q6<>\"\",R6<>\"\"),IF(OR(N6=2,N6=3,N6=7),IF(T6<0,1,0)),\"\")","v":""},{"$f":"IF(SUM(V6:AA6)=2,IF(N6=2,IF(N6=2,IF(U6-'Barèmes & Options'!H$2<-1,0,1)),\"\"),0)","v":0},{"$f":"IF(OR(N6=2,N6=9),SUM(V6:AA6)-AB6,SUM(V6:AA6))","v":0},{"$f":"IF(OR(V6=1,W6=1,X6=1),TRUE,FALSE)","v":false},{"$f":"IF(OR(Y6=1,Z6=1,AA6=1),TRUE,FALSE)","v":false},{"$f":"IF(N6<>\"\",IF(AND(N6>=1,N6<=8,N6=ABS(N6)),IF(AND(N6<=9,N6>=1),IF(AND(AC6=1,H6<>\"\"),1,IF(AND(AC6=1,H6=\"\"),1.5,IF(AND(AC6=2,H6<>\"\"),2,IF(AND(AC6=2,H6=\"\"),3,0)))),\"\"),\"Err. Profil\"),\"\")","v":""},{"$f":"IF(O6<>\"\",IF(ROUND(M6,0)<=3,1,0),\"\")","v":""},{"$f":"IF(AND(R6<>\"\",Q6<>\"\",P6<>\"\"),IF($C6=\"\",\"SX\",IF($C6=\"F\",VLOOKUP(ROUND($L6,0)/100,Barème500,3),VLOOKUP(ROUND($L6,0)/100,Barème500,2))),\"\")","v":""},{"$f":"IF(OR(K6=\"\",K6=\"\",AH6=\"\",AG6=\"\",AF6=\"\"),\"\",IF(OR(K6<0,K6>2),\"Err ech.\",SUM(K6,AH6,AG6,AF6)))","v":""},null,"Moyenne :",{"$f":"IF(ISERROR(AP6),\"\",AP6)","v":""},null,null,{"$f":"IF(C6<>\"f\",\"m\",\"f\")","v":"m"},{"$f":"AVERAGE(AI4:AI101)","v":{"$error":"#DIV/0!"}},"géné"]
[null,null,null,null,null,null,null,null,null,null,null,{"$f":"IF(AND(R7<>\"\",Q7<>\"\",P7<>\"\"),(INT(((INT($P7)*60)+(($P7-INT($P7))*100)+(INT($Q7)*60)+(($Q7-INT($Q7))*100)+(INT($R7)*60)+(($R7-INT($R7))*100))/60)+MOD(((INT($P7)*60)+(($P7-INT($P7))*100)+(INT($Q7)*60)+(($Q7-INT($Q7))*100)+(INT($R7)*60)+(($R7-INT($R7))*100)),60)/100)*100,\"\")","v":""},{"$f":"IF(OR(O7=\"\",P7=\"\"),\"\",ABS((INT(P7)*60)+((P7-INT(P7))*100)-((INT(O7)*60)+((O7-INT(O7))*100))))","v":""},{"$f":"IF(AND(E7=\"\",H7=\"\"),\"\",IF(H7=\"\",E7,H7))","v":""},{"$f":"IF(F7=\"\",\"\",F7/100)","v":""},{"$f":"IF(G7=\"\",\"\",G7/100)","v":""},{"$f":"IF(I7=\"\",\"\",I7/100)","v":""},{"$f":"IF(J7=\"\",\"\",J7/100)","v":""},{"$f":"ROUND((INT(Q7)*60)+((Q7-INT(Q7))*100)-((INT(P7)*60)+((P7-INT(P7))*100)),0)","v":{"$error":"#VALUE!"}},{"$f":"ROUND((INT(R7)*60)+((R7-INT(R7))*100)-((INT(Q7)*60)+((Q7-INT(Q7))*100)),0)","v":{"$error":"#VALUE!"}},{"$f":"ROUND((INT(R7)*60)+((R7-INT(R7))*100)-((INT(P7)*60)+((P7-INT(P7))*100)),0)","v":{"$error":"#VALUE!"}},{"$f":"IF(AND(Q7<>0,P7<>0),IF(OR(N7=1,N7=3,N7=4),IF(OR(S7=0,ABS(S7)<='Barèmes & Options'!H$2),1,0)),\"\")","v":false},{"$f":"IF(AND(Q7<>\"\",P7<>\"\"),IF(OR(N7=5,N7=7),IF(S7>0,1,0)),\"\")","v":""},{"$f":"IF(AND(Q7<>\"\",P7<>\"\"),IF(OR(N7=2,N7=6,N7=8),IF(S7<0,1,0)),\"\")","v":""},{"$f":"IF(AND(Q7<>0,R7<>0),IF(OR(N7=1,N7=5,N7=6),IF(OR(T7=0,ABS(T7)<='Barèmes & Options'!H$2),1,0)),\"\")","v":false},{"$f":"IF(AND(Q7<>\"\",R7<>\"\"),IF(OR(N7=4,N7=8),IF(T7>0,1,0)),\"\")","v":""},{"$f":"IF(AND(Q7<>\"\",R7<>\"\"),IF(OR(N7=2,N7=3,N7=7),IF(T7<0,1,0)),\"\")","v":""},{"$f":"IF(SUM(V7:AA7)=2,IF(N7=2,IF(N7=2,IF(U7-'Barèmes & Options'!H$2<-1,0,1)),\"\"),0)","v":0},{"$f":"IF(OR(N7=2,N7=9),SUM(V7:AA7)-AB7,SUM(V7:AA7))","v":0},{"$f":"IF(OR(V7=1,W7=1,X7=1),TRUE,FALSE)","v":false},{"$f":"IF(OR(Y7=1,Z7=1,AA7=1),TRUE,FALSE)","v":false},{"$f":"IF(N7<>\"\",IF(AND(N7>=1,N7<=8,N7=ABS(N7)),IF(AND(N7<=9,N7>=1),IF(AND(AC7=1,H7<>\"\"),1,IF(AND(AC7=1,H7=\"\"),1.5,IF(AND(AC7=2,H7<>\"\"),2,IF(AND(AC7=2,H7=\"\"),3,0)))),\"\"),\"Err. Profil\"),\"\")","v":""},{"$f":"IF(O7<>\"\",IF(ROUND(M7,0)<=3,1,0),\"\")","v":""},{"$f":"IF(AND(R7<>\"\",Q7<>\"\",P7<>\"\"),IF($C7=\"\",\"SX\",IF($C7=\"F\",VLOOKUP(ROUND($L7,0)/100,Barème500,3),VLOOKUP(ROUND($L7,0)/100,Barème500,2))),\"\")","v":""},{"$f":"IF(OR(K7=\"\",K7=\"\",AH7=\"\",AG7=\"\",AF7=\"\"),\"\",IF(OR(K7<0,K7>2),\"Err ech.\",SUM(K7,AH7,AG7,AF7)))","v":""},null,"Note max :",{"$f":"IF(COUNT(AI4:AI101)>0,MAX(AI4:AI101),\"\")","v":""},null,null,{"$f":"IF(C7<>\"f\",\"m\",\"f\")","v":"m"}]
[null,null,null,null,null,null,null,null,null,null,null,{"$f":"IF(AND(R8<>\"\",Q8<>\"\",P8<>\"\"),(INT(((INT($P8)*60)+(($P8-INT($P8))*100)+(INT($Q8)*60)+(($Q8-INT($Q8))*100)+(INT($R8)*60)+(($R8-INT($R8))*100))/60)+MOD(((INT($P8)*60)+(($P8-INT($P8))*100)+(INT($Q8)*60)+(($Q8-INT($Q8))*100)+(INT($R8)*60)+(($R8-INT($R8))*100)),60)/100)*100,\"\")","v":""},{"$f":"IF(OR(O8=\"\",P8=\"\"),\"\",ABS((INT(P8)*60)+((P8-INT(P8))*100)-((INT(O8)*60)+((O8-INT(O8))*100))))","v":""},{"$f":"IF(AND(E8=\"\",H8=\"\"),\"\",IF(H8=\"\",E8,H8))","v":""},{"$f":"IF(F8=\"\",\"\",F8/100)","v":""},{"$f":"IF(G8=\"\",\"\",G8/100)","v":""},{"$f":"IF(I8=\"\",\"\",I8/100)","v":""},{"$f":"IF(J8=\"\",\"\",J8/100)","v":""},{"$f":"ROUND((INT(Q8)*60)+((Q8-INT(Q8))*100)-((INT(P8)*60)+((P8-INT(P8))*100)),0)","v":{"$error":"#VALUE!"}},{"$f":"ROUND((INT(R8)*60)+((R8-INT(R8))*100)-((INT(Q8)*60)+((Q8-INT(Q8))*100)),0)","v":{"$error":"#VALUE!"}},{"$f":"ROUND((INT(R8)*60)+((R8-INT(R8))*100)-((INT(P8)*60)+((P8-INT(P8))*100)),0)","v":{"$error":"#VALUE!"}},{"$f":"IF(AND(Q8<>0,P8<>0),IF(OR(N8=1,N8=3,N8=4),IF(OR(S8=0,ABS(S8)<='Barèmes & Options'!H$2),1,0)),\"\")","v":false},{"$f":"IF(AND(Q8<>\"\",P8<>\"\"),IF(OR(N8=5,N8=7),IF(S8>0,1,0)),\"\")","v":""},{"$f":"IF(AND(Q8<>\"\",P8<>\"\"),IF(OR(N8=2,N8=6,N8=8),IF(S8<0,1,0)),\"\")","v":""},{"$f":"IF(AND(Q8<>0,R8<>0),IF(OR(N8=1,N8=5,N8=6),IF(OR(T8=0,ABS(T8)<='Barèmes & Options'!H$2),1,0)),\"\")","v":false},{"$f":"IF(AND(Q8<>\"\",R8<>\"\"),IF(OR(N8=4,N8=8),IF(T8>0,1,0)),\"\")","v":""},{"$f":"IF(AND(Q8<>\"\",R8<>\"\"),IF(OR(N8=2,N8=3,N8=7),IF(T8<0,1,0)),\"\")","v":""},{"$f":"IF(SUM(V8:AA8)=2,IF(N8=2,IF(N8=2,IF(U8-'Barèmes & Options'!H$2<-1,0,1)),\"\"),0)","v":0},{"$f":"IF(OR(N8=2,N8=9),SUM(V8:AA8)-AB8,SUM(V8:AA8))","v":0},{"$f":"IF(OR(V8=1,W8=1,X8=1),TRUE,FALSE)","v":false},{"$f":"IF(OR(Y8=1,Z8=1,AA8=1),TRUE,FALSE)","v":false},{"$f":"IF(N8<>\"\",IF(AND(N8>=1,N8<=8,N8=ABS(N8)),IF(AND(N8<=9,N8>=1),IF(AND(AC8=1,H8<>\"\"),1,IF(AND(AC8=1,H8=\"\"),1.5,IF(AND(AC8=2,H8<>\"\"),2,IF(AND(AC8=2,H8=\"\"),3,0)))),\"\"),\"Err. Profil\"),\"\")","v":""},{"$f":"IF(O8<>\"\",IF(ROUND(M8,0)<=3,1,0),\"\")","v":""},{"$f":"IF(AND(R8<>\"\",Q8<>\"\",P8<>\"\"),IF($C8=\"\",\"SX\",IF($C8=\"F\",VLOOKUP(ROUND($L8,0)/100,Barème500,3),VLOOKUP(ROUND($L8,0)/100,Barème500,2))),\"\")","v":""},{"$f":"IF(OR(K8=\"\",K8=\"\",AH8=\"\",AG8=\"\",AF8=\"\"),\"\",IF(OR(K8<0,K8>2),\"Err ech.\",SUM(K8,AH8,AG8,AF8)))","v":""},null,"Note min :",{"$f":"IF(COUNT(AI4:AI101)>0,MIN(AI4:AI101),\"\")","v":""},null,null,{"$f":"IF(C8<>\"f\",\"m\",\"f\")","v":"m"}]
[null,null,null,null,null,null,null,null,null,null,null,{"$f":"IF(AND(R9<>\"\",Q9<>\"\",P9<>\"\"),(INT(((INT($P9)*60)+(($P9-INT($P9))*100)+(INT($Q9)*60)+(($Q9-INT($Q9))*100)+(INT($R9)*60)+(($R9-INT($R9))*100))/60)+MOD(((INT($P9)*60)+(($P9-INT($P9))*100)+(INT($Q9)*60)+(($Q9-INT($Q9))*100)+(INT($R9)*60)+(($R9-INT($R9))*100)),60)/100)*100,\"\")","v":""},{"$f":"IF(OR(O9=\"\",P9=\"\"),\"\",ABS((INT(P9)*60)+((P9-INT(P9))*100)-((INT(O9)*60)+((O9-INT(O9))*100))))","v":""},{"$f":"IF(AND(E9=\"\",H9=\"\"),\"\",IF(H9=\"\",E9,H9))","v":""},{"$f":"IF(F9=\"\",\"\",F9/100)","v":""},{"$f":"IF(G9=\"\",\"\",G9/100)","v":""},{"$f":"IF(I9=\"\",\"\",I9/100)","v":""},{"$f":"IF(J9=\"\",\"\",J9/100)","v":""},{"$f":"ROUND((INT(Q9)*60)+((Q9-INT(Q9))*100)-((INT(P9)*60)+((P9-INT(P9))*100)),0)","v":{"$error":"#VALUE!"}},{"$f":"ROUND((INT(R9)*60)+((R9-INT(R9))*100)-((INT(Q9)*60)+((Q9-INT(Q9))*100)),0)","v":{"$error":"#VALUE!"}},{"$f":"ROUND((INT(R9)*60)+((R9-INT(R9))*100)-((INT(P9)*60)+((P9-INT(P9))*100)),0)","v":{"$error":"#VALUE!"}},{"$f":"IF(AND(Q9<>0,P9<>0),IF(OR(N9=1,N9=3,N9=4),IF(OR(S9=0,ABS(S9)<='Barèmes & Options'!H$2),1,0)),\"\")","v":false},{"$f":"IF(AND(Q9<>\"\",P9<>\"\"),IF(OR(N9=5,N9=7),IF(S9>0,1,0)),\"\")","v":""},{"$f":"IF(AND(Q9<>\"\",P9<>\"\"),IF(OR(N9=2,N9=6,N9=8),IF(S9<0,1,0)),\"\")","v":""},{"$f":"IF(AND(Q9<>0,R9<>0),IF(OR(N9=1,N9=5,N9=6),IF(OR(T9=0,ABS(T9)<='Barèmes & Options'!H$2),1,0)),\"\")","v":false},{"$f":"IF(AND(Q9<>\"\",R9<>\"\"),IF(OR(N9=4,N9=8),IF(T9>0,1,0)),\"\")","v":""},{"$f":"IF(AND(Q9<>\"\",R9<>\"\"),IF(OR(N9=2,N9=3,N9=7),IF(T9<0,1,0)),\"\")","v":""},{"$f":"IF(SUM(V9:AA9)=2,IF(N9=2,IF(N9=2,IF(U9-'Barèmes & Options'!H$2<-1,0,1)),\"\"),0)","v":0},{"$f":"IF(OR(N9=2,N9=9),SUM(V9:AA9)-AB9,SUM(V9:AA9))","v":0},{"$f":"IF(OR(V9=1,W9=1,X9=1),TRUE,FALSE)","v":false},{"$f":"IF(OR(Y9=1,Z9=1,AA9=1),TRUE,FALSE)","v":false},{"$f":"IF(N9<>\"\",IF(AND(N9>=1,N9<=8,N9=ABS(N9)),IF(AND(N9<=9,N9>=1),IF(AND(AC9=1,H9<>\"\"),1,IF(AND(AC9=1,H9=\"\"),1.5,IF(AND(AC9=2,H9<>\"\"),2,IF(AND(AC9=2,H9=\"\"),3,0)))),\"\"),\"Err. Profil\"),\"\")","v":""},{"$f":"IF(O9<>\"\",IF(ROUND(M9,0)<=3,1,0),\"\")","v":""},{"$f":"IF(AND(R9<>\"\",Q9<>\"\",P9<>\"\"),IF($C9=\"\",\"SX\",IF($C9=\"F\",VLOOKUP(ROUND($L9,0)/100,Barème500,3),VLOOKUP(ROUND($L9,0)/100,Barème500,2))),\"\")","v":""},{"$f":"IF(OR(K9=\"\",K9=\"\",AH9=\"\",AG9=\"\",AF9=\"\"),\"\",IF(OR(K9<0,K9>2),\"Err ech.\",SUM(K9,AH9,AG9,AF9)))","v":""},null,null,null,null,null,{"$f":"IF(C9<>\"f\",\"m\",\"f\")","v":"m"}]
[null,null,null,null,null,null,null,null,null,null,null,{"$f":"IF(AND(R10<>\"\",Q10<>\"\",P10<>\"\"),(INT(((INT($P10)*60)+(($P10-INT($P10))*100)+(INT($Q10)*60)+(($Q10-INT($Q10))*100)+(INT($R10)*60)+(($R10-INT($R10))*100))/60)+MOD(((INT($P10)*60)+(($P10-INT($P10))*100)+(INT($Q10)*60)+(($Q10-INT($Q10))*100)+(INT($R10)*60)+(($R10-INT($R10))*100)),60)/100)*100,\"\")","v":""},{"$f":"IF(OR(O10=\"\",P10=\"\"),\"\",ABS((INT(P10)*60)+((P10-INT(P10))*100)-((INT(O10)*60)+((O10-INT(O10))*100))))","v":""},{"$f":"IF(AND(E10=\"\",H10=\"\"),\"\",IF(H10=\"\",E10,H10))","v":""},{"$f":"IF(F10=\"\",\"\",F10/100)","v":""},{"$f":"IF(G10=\"\",\"\",G10/100)","v":""},{"$f":"IF(I10=\"\",\"\",I10/100)","v":""},{"$f":"IF(J10=\"\",\"\",J10/100)","v":""},{"$f":"ROUND((INT(Q10)*60)+((Q10-INT(Q10))*100)-((INT(P10)*60)+((P10-INT(P10))*100)),0)","v":{"$error":"#VALUE!"}},{"$f":"ROUND((INT(R10)*60)+((R10-INT(R10))*100)-((INT(Q10)*60)+((Q10-INT(Q10))*100)),0)","v":{"$error":"#VALUE!"}},{"$f":"ROUND((INT(R10)*60)+((R10-INT(R10))*100)-((INT(P10)*60)+((P10-INT(P10))*100)),0)","v":{"$error":"#VALUE!"}},{"$f":"IF(AND(Q10<>0,P10<>0),IF(OR(N10=1,N10=3,N10=4),IF(OR(S10=0,ABS(S10)<='Barèmes & Options'!H$2),1,0)),\"\")","v":false},{"$f":"IF(AND(Q10<>\"\",P10<>\"\"),IF(OR(N10=5,N10=7),IF(S10>0,1,0)),\"\")","v":""},{"$f":"IF(AND(Q10<>\"\",P10<>\"\"),IF(OR(N10=2,N10=6,N10=8),IF(S10<0,1,0)),\"\")","v":""},{"$f":"IF(AND(Q10<>0,R10<>0),IF(OR(N10=1,N10=5,N10=6),IF(OR(T10=0,ABS(T10)<='Barèmes & Options'!H$2),1,0)),\"\")","v":false},{"$f":"IF(AND(Q10<>\"\",R10<>\"\"),IF(OR(N10=4,N10=8),IF(T10>0,1,0)),\"\")","v":""},{"$f":"IF(AND(Q10<>\"\",R10<>\"\"),IF(OR(N10=2,N10=3,N10=7),IF(T10<0,1,0)),\"\")","v":""},{"$f":"IF(SUM(V10:AA10)=2,IF(N10=2,IF(N10=2,IF(U10-'Barèmes & Options'!H$2<-1,0,1)),\"\"),0)","v":0},{"$f":"IF(OR(N10=2,N10=9),SUM(V10:AA10)-AB10,SUM(V10:AA10))","v":0},{"$f":"IF(OR(V10=1,W10=1,X10=1),TRUE,FALSE)","v":false},{"$f":"IF(OR(Y10=1,Z10=1,AA10=1),TRUE,FALSE)","v":false},{"$f":"IF(N10<>\"\",IF(AND(N10>=1,N10<=8,N10=ABS(N10)),IF(AND(N10<=9,N10>=1),IF(AND(AC10=1,H10<>\"\"),1,IF(AND(AC10=1,H10=\"\"),1.5,IF(AND(AC10=2,H10<>\"\"),2,IF(AND(AC10=2,H10=\"\"),3,0)))),\"\"),\"Err. Profil\"),\"\")","v":""},{"$f":"IF(O10<>\"\",IF(ROUND(M10,0)<=3,1,0),\"\")","v":""},{"$f":"IF(AND(R10<>\"\",Q10<>\"\",P10<>\"\"),IF($C10=\"\",\"SX\",IF($C10=\"F\",VLOOKUP(ROUND($L10,0)/100,Barème500,3),VLOOKUP(ROUND($L10,0)/100,Barème500,2))),\"\")","v":""},{"$f":"IF(OR(K10=\"\",K10=\"\",AH10=\"\",AG10=\"\",AF10=\"\"),\"\",IF(OR(K10<0,K10>2),\"Err ech.\",SUM(K10,AH10,AG10,AF10)))","v":""},null,"Date :",null,null,null,{"$f":"IF(C10<>\"f\",\"m\",\"f\")","v":"m"}]
[null,null,null,null,null,null,null,null,null,null,null,{"$f":"IF(AND(R11<>\"\",Q11<>\"\",P11<>\"\"),(INT(((INT($P11)*60)+(($P11-INT($P11))*100)+(INT($Q11)*60)+(($Q11-INT($Q11))*100)+(INT($R11)*60)+(($R11-INT($R11))*100))/60)+MOD(((INT($P11)*60)+(($P11-INT($P11))*100)+(INT($Q11)*60)+(($Q11-INT($Q11))*100)+(INT($R11)*60)+(($R11-INT($R11))*100)),60)/100)*100,\"\")","v":""},{"$f":"IF(OR(O11=\"\",P11=\"\"),\"\",ABS((INT(P11)*60)+((P11-INT(P11))*100)-((INT(O11)*60)+((O11-INT(O11))*100))))","v":""},{"$f":"IF(AND(E11=\"\",H11=\"\"),\"\",IF(H11=\"\",E11,H11))","v":""},{"$f":"IF(F11=\"\",\"\",F11/100)","v":""},{"$f":"IF(G11=\"\",\"\",G11/100)","v":""},{"$f":"IF(I11=\"\",\"\",I11/100)","v":""},{"$f":"IF(J11=\"\",\"\",J11/100)","v":""},{"$f":"ROUND((INT(Q11)*60)+((Q11-INT(Q11))*100)-((INT(P11)*60)+((P11-INT(P11))*100)),0)","v":{"$error":"#VALUE!"}},{"$f":"ROUND((INT(R11)*60)+((R11-INT(R11))*100)-((INT(Q11)*60)+((Q11-INT(Q11))*100)),0)","v":{"$error":"#VALUE!"}},{"$f":"ROUND((INT(R11)*60)+((R11-INT(R11))*100)-((INT(P11)*60)+((P11-INT(P11))*100)),0)","v":{"$error":"#VALUE!"}},{"$f":"IF(AND(Q11<>0,P11<>0),IF(OR(N11=1,N11=3,N11=4),IF(OR(S11=0,ABS(S11)<='Barèmes & Options'!H$2),1,0)),\"\")","v":false},{"$f":"IF(AND(Q11<>\"\",P11<>\"\"),IF(OR(N11=5,N11=7),IF(S11>0,1,0)),\"\")","v":""},{"$f":"IF(AND(Q11<>\"\",P11<>\"\"),IF(OR(N11=2,N11=6,N11=8),IF(S11<0,1,0)),\"\")","v":""},{"$f":"IF(AND(Q11<>0,R11<>0),IF(OR(N11=1,N11=5,N11=6),IF(OR(T11=0,ABS(T11)<='Barèmes & Options'!H$2),1,0)),\"\")","v":false},{"$f":"IF(AND(Q11<>\"\",R11<>\"\"),IF(OR(N11=4,N11=8),IF(T11>0,1,0)),\"\")","v":""},{"$f":"IF(AND(Q11<>\"\",R11<>\"\"),IF(OR(N11=2,N11=3,N11=7),IF(T11<0,1,0)),\"\")","v":""},{"$f":"IF(SUM(V11:AA11)=2,IF(N11=2,IF(N11=2,IF(U11-'Barèmes & Options'!H$2<-1,0,1)),\"\"),0)","v":0},{"$f":"IF(OR(N11=2,N11=9),SUM(V11:AA11)-AB11,SUM(V11:AA11))","v":0},{"$f":"IF(OR(V11=1,W11=1,X11=1),TRUE,FALSE)","v":false},{"$f":"IF(OR(Y11=1,Z11=1,AA11=1),TRUE,FALSE)","v":false},{"$f":"IF(N11<>\"\",IF(AND(N11>=1,N11<=8,N11=ABS(N11)),IF(AND(N11<=9,N11>=1),IF(AND(AC11=1,H11<>\"\"),1,IF(AND(AC11=1,H11=\"\"),1.5,IF(AND(AC11=2,H11<>\"\"),2,IF(AND(AC11=2,H11=\"\"),3,0)))),\"\"),\"Err. Profil\"),\"\")","v":""},{"$f":"IF(O11<>\"\",IF(ROUND(M11,0)<=3,1,0),\"\")","v":""},{"$f":"IF(AND(R11<>\"\",Q11<>\"\",P11<>\"\"),IF($C11=\"\",\"SX\",IF($C11=\"F\",VLOOKUP(ROUND($L11,0)/100,Barème500,3),VLOOKUP(ROUND($L11,0)/100,Barème500,2))),\"\")","v":""},{"$f":"IF(OR(K11=\"\",K11=\"\",AH11=\"\",AG11=\"\",AF11=\"\"),\"\",IF(OR(K11<0,K11>2),\"Err ech.\",SUM(K11,AH11,AG11,AF11)))","v":""},null,null,null,null,null,{"$f":"IF(C11<>\"f\",\"m\",\"f\")","v":"m"}]
[null,null,null,null,null,null,null,null,null,null,null,{"$f":"IF(AND(R12<>\"\",Q12<>\"\",P12<>\"\"),(INT(((INT($P12)*60)+(($P12-INT($P12))*100)+(INT($Q12)*60)+(($Q12-INT($Q12))*100)+(INT($R12)*60)+(($R12-INT($R12))*100))/60)+MOD(((INT($P12)*60)+(($P12-INT($P12))*100)+(INT($Q12)*60)+(($Q12-INT($Q12))*100)+(INT($R12)*60)+(($R12-INT($R12))*100)),60)/100)*100,\"\")","v":""},{"$f":"IF(OR(O12=\"\",P12=\"\"),\"\",ABS((INT(P12)*60)+((P12-INT(P12))*100)-((INT(O12)*60)+((O12-INT(O12))*100))))","v":""},{"$f":"IF(AND(E12=\"\",H12=\"\"),\"\",IF(H12=\"\",E12,H12))","v":""},{"$f":"IF(F12=\"\",\"\",F12/100)","v":""},{"$f":"IF(G12=\"\",\"\",G12/100)","v":""},{"$f":"IF(I12=\"\",\"\",I12/100)","v":""},{"$f":"IF(J12=\"\",\"\",J12/100)","v":""},{"$f":"ROUND((INT(Q12)*60)+((Q12-INT(Q12))*100)-((INT(P12)*60)+((P12-INT(P12))*100)),0)","v":{"$error":"#VALUE!"}},{"$f":"ROUND((INT(R12)*60)+((R12-INT(R12))*100)-((INT(Q12)*60)+((Q12-INT(Q12))*100)),0)","v":{"$error":"#VALUE!"}},{"$f":"ROUND((INT(R12)*60)+((R12-INT(R12))*100)-((INT(P12)*60)+((P12-INT(P12))*100)),0)","v":{"$error":"#VALUE!"}},{"$f":"IF(AND(Q12<>0,P12<>0),IF(OR(N12=1,N12=3,N12=4),IF(OR(S12=0,ABS(S12)<='Barèmes & Options'!H$2),1,0)),\"\")","v":false},{"$f":"IF(AND(Q12<>\"\",P12<>\"\"),IF(OR(N12=5,N12=7),IF(S12>0,1,0)),\"\")","v":""},{"$f":"IF(AND(Q12<>\"\",P12<>\"\"),IF(OR(N12=2,N12=6,N12=8),IF(S12<0,1,0)),\"\")","v":""},{"$f":"IF(AND(Q12<>0,R12<>0),IF(OR(N12=1,N12=5,N12=6),IF(OR(T12=0,ABS(T12)<='Barèmes & Options'!H$2),1,0)),\"\")","v":false},{"$f":"IF(AND(Q12<>\"\",R12<>\"\"),IF(OR(N12=4,N12=8),IF(T12>0,1,0)),\"\")","v":""},{"$f":"IF(AND(Q12<>\"\",R12<>\"\"),IF(OR(N12=2,N12=3,N12=7),IF(T12<0,1,0)),\"\")","v":""},{"$f":"IF(SUM(V12:AA12)=2,IF(N12=2,IF(N12=2,IF(U12-'Barèmes & Options'!H$2<-1,0,1)),\"\"),0)","v":0},{"$f":"IF(OR(N12=2,N12=9),SUM(V12:AA12)-AB12,SUM(V12:AA12))","v":0},{"$f":"IF(OR(V12=1,W12=1,X12=1),TRUE,FALSE)","v":false},{"$f":"IF(OR(Y12=1,Z12=1,AA12=1),TRUE,FALSE)","v":false},{"$f":"IF(N12<>\"\",IF(AND(N12>=1,N12<=8,N12=ABS(N12)),IF(AND(N12<=9,N12>=1),IF(AND(AC12=1,H12<>\"\"),1,IF(AND(AC12=1,H12=\"\"),1.5,IF(AND(AC12=2,H12<>\"\"),2,IF(AND(AC12=2,H12=\"\"),3,0)))),\"\"),\"Err. Profil\"),\"\")","v":""},{"$f":"IF(O12<>\"\",IF(ROUND(M12,0)<=3,1,0),\"\")","v":""},{"$f":"IF(AND(R12<>\"\",Q12<>\"\",P12<>\"\"),IF($C12=\"\",\"SX\",IF($C12=\"F\",VLOOKUP(ROUND($L12,0)/100,Barème500,3),VLOOKUP(ROUND($L12,0)/100,Barème500,2))),\"\")","v":""},{"$f":"IF(OR(K12=\"\",K12=\"\",AH12=\"\",AG12=\"\",AF12=\"\"),\"\",IF(OR(K12<0,K12>2),\"Err ech.\",SUM(K12,AH12,AG12,AF12)))","v":""},null,null,null,null,null,{"$f":"IF(C12<>\"f\",\"m\",\"f\")","v":"m"}]
[null,null,null,null,null,null,null,null,null,null,null,{"$f":"IF(AND(R13<>\"\",Q13<>\"\",P13<>\"\"),(INT(((INT($P13)*60)+(($P13-INT($P13))*100)+(INT($Q13)*60)+(($Q13-INT($Q13))*100)+(INT($R13)*60)+(($R13-INT($R13))*100))/60)+MOD(((INT($P13)*60)+(($P13-INT($P13))*100)+(INT($Q13)*60)+(($Q13-INT($Q13))*100)+(INT($R13)*60)+(($R13-INT($R13))*100)),60)/100)*100,\"\")","v":""},{"$f":"IF(OR(O13=\"\",P13=\"\"),\"\",ABS((INT(P13)*60)+((P13-INT(P13))*100)-((INT(O13)*60)+((O13-INT(O13))*100))))","v":""},{"$f":"IF(AND(E13=\"\",H13=\"\"),\"\",IF(H13=\"\",E13,H13))","v":""},{"$f":"IF(F13=\"\",\"\",F13/100)","v":""},{"$f":"IF(G13=\"\",\"\",G13/100)","v":""},{"$f":"IF(I13=\"\",\"\",I13/100)","v":""},{"$f":"IF(J13=\"\",\"\",J13/100)","v":""},{"$f":"ROUND((INT(Q13)*60)+((Q13-INT(Q13))*100)-((INT(P13)*60)+((P13-INT(P13))*100)),0)","v":{"$error":"#VALUE!"}},{"$f":"ROUND((INT(R13)*60)+((R13-INT(R13))*100)-((INT(Q13)*60)+((Q13-INT(Q13))*100)),0)","v":{"$error":"#VALUE!"}},{"$f":"ROUND((INT(R13)*60)+((R13-INT(R13))*100)-((INT(P13)*60)+((P13-INT(P13))*100)),0)","v":{"$error":"#VALUE!"}},{"$f":"IF(AND(Q13<>0,P13<>0),IF(OR(N13=1,N13=3,N13=4),IF(OR(S13=0,ABS(S13)<='Barèmes & Options'!H$2),1,0)),\"\")","v":false},{"$f":"IF(AND(Q13<>\"\",P13<>\"\"),IF(OR(N13=5,N13=7),IF(S13>0,1,0)),\"\")","v":""},{"$f":"IF(AND(Q13<>\"\",P13<>\"\"),IF(OR(N13=2,N13=6,N13=8),IF(S13<0,1,0)),\"\")","v":""},{"$f":"IF(AND(Q13<>0,R13<>0),IF(OR(N13=1,N13=5,N13=6),IF(OR(T13=0,ABS(T13)<='Barèmes & Options'!H$2),1,0)),\"\")","v":false},{"$f":"IF(AND(Q13<>\"\",R13<>\"\"),IF(OR(N13=4,N13=8),IF(T13>0,1,0)),\"\")","v":""},{"$f":"IF(AND(Q13<>\"\",R13<>\"\"),IF(OR(N13=2,N13=3,N13=7),IF(T13<0,1,0)),\"\")","v":""},{"$f":"IF(SUM(V13:AA13)=2,IF(N13=2,IF(N13=2,IF(U13-'Barèmes & Options'!H$2<-1,0,1)),\"\"),0)","v":0},{"$f":"IF(OR(N13=2,N13=9),SUM(V13:AA13)-AB13,SUM(V13:AA13))","v":0},{"$f":"IF(OR(V13=1,W13=1,X13=1),TRUE,FALSE)","v":false},{"$f":"IF(OR(Y13=1,Z13=1,AA13=1),TRUE,FALSE)","v":false},{"$f":"IF(N13<>\"\",IF(AND(N13>=1,N13<=8,N13=ABS(N13)),IF(AND(N13<=9,N13>=1),IF(AND(AC13=1,H13<>\"\"),1,IF(AND(AC13=1,H13=\"\"),1.5,IF(AND(AC13=2,H13<>\"\"),2,IF(AND(AC13=2,H13=\"\"),3,0)))),\"\"),\"Err. Profil\"),\"\")","v":""},{"$f":"IF(O13<>\"\",IF(ROUND(M13,0)<=3,1,0),\"\")","v":""},{"$f":"IF(AND(R13<>\"\",Q13<>\"\",P13<>\"\"),IF($C13=\"\",\"SX\",IF($C13=\"F\",VLOOKUP(ROUND($L13,0)/100,Barème500,3),VLOOKUP(ROUND($L13,0)/100,Barème500,2))),\"\")","v":""},{"$f":"IF(OR(K13=\"\",K13=\"\",AH13=\"\",AG13=\"\",AF13=\"\"),\"\",IF(OR(K13<0,K13>2),\"Err ech.\",SUM(K13,AH13,AG13,AF13)))","v":""},null,null,null,null,null,{"$f":"IF(C13<>\"f\",\"m\",\"f\")","v":"m"}]
[null,null,null,null,null,null,null,null,null,null,null,{"$f":"IF(AND(R14<>\"\",Q14<>\"\",P14<>\"\"),(INT(((INT($P14)*60)+(($P14-INT($P14))*100)+(INT($Q14)*60)+(($Q14-INT($Q14))*100)+(INT($R14)*60)+(($R14-INT($R14))*100))/60)+MOD(((INT($P14)*60)+(($P14-INT($P14))*100)+(INT($Q14)*60)+(($Q14-INT($Q14))*100)+(INT($R14)*60)+(($R14-INT($R14))*100)),60)/100)*100,\"\")","v":""},{"$f":"IF(OR(O14=\"\",P14=\"\"),\"\",ABS((INT(P14)*60)+((P14-INT(P14))*100)-((INT(O14)*60)+((O14-INT(O14))*100))))","v":""},{"$f":"IF(AND(E14=\"\",H14=\"\"),\"\",IF(H14=\"\",E14,H14))","v":""},{"$f":"IF(F14=\"\",\"\",F14/100)","v":""},{"$f":"IF(G14=\"\",\"\",G14/100)","v":""},{"$f":"IF(I14=\"\",\"\",I14/100)","v":""},{"$f":"IF(J14=\"\",\"\",J14/100)","v":""},{"$f":"ROUND((INT(Q14)*60)+((Q14-INT(Q14))*100)-((INT(P14)*60)+((P14-INT(P14))*100)),0)","v":{"$error":"#VALUE!"}},{"$f":"ROUND((INT(R14)*60)+((R14-INT(R14))*100)-((INT(Q14)*60)+((Q14-INT(Q14))*100)),0)","v":{"$error":"#VALUE!"}},{"$f":"ROUND((INT(R14)*60)+((R14-INT(R14))*100)-((INT(P14)*60)+((P14-INT(P14))*100)),0)","v":{"$error":"#VALUE!"}},{"$f":"IF(AND(Q14<>0,P14<>0),IF(OR(N14=1,N14=3,N14=4),IF(OR(S14=0,ABS(S14)<='Barèmes & Options'!H$2),1,0)),\"\")","v":false},{"$f":"IF(AND(Q14<>\"\",P14<>\"\"),IF(OR(N14=5,N14=7),IF(S14>0,1,0)),\"\")","v":""},{"$f":"IF(AND(Q14<>\"\",P14<>\"\"),IF(OR(N14=2,N14=6,N14=8),IF(S14<0,1,0)),\"\")","v":""},{"$f":"IF(AND(Q14<>0,R14<>0),IF(OR(N14=1,N14=5,N14=6),IF(OR(T14=0,ABS(T14)<='Barèmes & Options'!H$2),1,0)),\"\")","v":false},{"$f":"IF(AND(Q14<>\"\",R14<>\"\"),IF(OR(N14=4,N14=8),IF(T14>0,1,0)),\"\")","v":""},{"$f":"IF(AND(Q14<>\"\",R14<>\"\"),IF(OR(N14=2,N14=3,N14=7),IF(T14<0,1,0)),\"\")","v":""},{"$f":"IF(SUM(V14:AA14)=2,IF(N14=2,IF(N14=2,IF(U14-'Barèmes & Options'!H$2<-1,0,1)),\"\"),0)","v":0},{"$f":"IF(OR(N14=2,N14=9),SUM(V14:AA14)-AB14,SUM(V14:AA14))","v":0},{"$f":"IF(OR(V14=1,W14=1,X14=1),TRUE,FALSE)","v":false},{"$f":"IF(OR(Y14=1,Z14=1,AA14=1),TRUE,FALSE)","v":false},{"$f":"IF(N14<>\"\",IF(AND(N14>=1,N14<=8,N14=ABS(N14)),IF(AND(N14<=9,N14>=1),IF(AND(AC14=1,H14<>\"\"),1,IF(AND(AC14=1,H14=\"\"),1.5,IF(AND(AC14=2,H14<>\"\"),2,IF(AND(AC14=2,H14=\"\"),3,0)))),\"\"),\"Err. Profil\"),\"\")","v":""},{"$f":"IF(O14<>\"\",IF(ROUND(M14,0)<=3,1,0),\"\")","v":""},{"$f":"IF(AND(R14<>\"\",Q14<>\"\",P14<>\"\"),IF($C14=\"\",\"SX\",IF($C14=\"F\",VLOOKUP(ROUND($L14,0)/100,Barème500,3),VLOOKUP(ROUND($L14,0)/100,Barème500,2))),\"\")","v":""},{"$f":"IF(OR(K14=\"\",K14=\"\",AH14=\"\",AG14=\"\",AF14=\"\"),\"\",IF(OR(K14<0,K14>2),\"Err ech.\",SUM(K14,AH14,AG14,AF14)))","v":""},null,null,null,null,null,{"$f":"IF(C14<>\"f\",\"m\",\"f\")","v":"m"}]
[null,null,null,null,null,null,null,null,null,null,null,{"$f":"IF(AND(R15<>\"\",Q15<>\"\",P15<>\"\"),(INT(((INT($P15)*60)+(($P15-INT($P15))*100)+(INT($Q15)*60)+(($Q15-INT($Q15))*100)+(INT($R15)*60)+(($R15-INT($R15))*100))/60)+MOD(((INT($P15)*60)+(($P15-INT($P15))*100)+(INT($Q15)*60)+(($Q15-INT($Q15))*100)+(INT($R15)*60)+(($R15-INT($R15))*100)),60)/100)*100,\"\")","v":""},{"$f":"IF(OR(O15=\"\",P15=\"\"),\"\",ABS((INT(P15)*60)+((P15-INT(P15))*100)-((INT(O15)*60)+((O15-INT(O15))*100))))","v":""},{"$f":"IF(AND(E15=\"\",H15=\"\"),\"\",IF(H15=\"\",E15,H15))","v":""},{"$f":"IF(F15=\"\",\"\",F15/100)","v":""},{"$f":"IF(G15=\"\",\"\",G15/100)","v":""},{"$f":"IF(I15=\"\",\"\",I15/100)","v":""},{"$f":"IF(J15=\"\",\"\",J15/100)","v":""},{"$f":"ROUND((INT(Q15)*60)+((Q15-INT(Q15))*100)-((INT(P15)*60)+((P15-INT(P15))*100)),0)","v":{"$error":"#VALUE!"}},{"$f":"ROUND((INT(R15)*60)+((R15-INT(R15))*100)-((INT(Q15)*60)+((Q15-INT(Q15))*100)),0)","v":{"$error":"#VALUE!"}},{"$f":"ROUND((INT(R15)*60)+((R15-INT(R15))*100)-((INT(P15)*60)+((P15-INT(P15))*100)),0)","v":{"$error":"#VALUE!"}},{"$f":"IF(AND(Q15<>0,P15<>0),IF(OR(N15=1,N15=3,N15=4),IF(OR(S15=0,ABS(S15)<='Barèmes & Options'!H$2),1,0)),\"\")","v":false},{"$f":"IF(AND(Q15<>\"\",P15<>\"\"),IF(OR(N15=5,N15=7),IF(S15>0,1,0)),\"\")","v":""},{"$f":"IF(AND(Q15<>\"\",P15<>\"\"),IF(OR(N15=2,N15=6,N15=8),IF(S15<0,1,0)),\"\")","v":""},{"$f":"IF(AND(Q15<>0,R15<>0),IF(OR(N15=1,N15=5,N15=6),IF(OR(T15=0,ABS(T15)<='Barèmes & Options'!H$2),1,0)),\"\")","v":false},{"$f":"IF(AND(Q15<>\"\",R15<>\"\"),IF(OR(N15=4,N15=8),IF(T15>0,1,0)),\"\")","v":""},{"$f":"IF(AND(Q15<>\"\",R15<>\"\"),IF(OR(N15=2,N15=3,N15=7),IF(T15<0,1,0)),\"\")","v":""},{"$f":"IF(SUM(V15:AA15)=2,IF(N15=2,IF(N15=2,IF(U15-'Barèmes & Options'!H$2<-1,0,1)),\"\"),0)","v":0},{"$f":"IF(OR(N15=2,N15=9),SUM(V15:AA15)-AB15,SUM(V15:AA15))","v":0},{"$f":"IF(OR(V15=1,W15=1,X15=1),TRUE,FALSE)","v":false},{"$f":"IF(OR(Y15=1,Z15=1,AA15=1),TRUE,FALSE)","v":false},{"$f":"IF(N15<>\"\",IF(AND(N15>=1,N15<=8,N15=ABS(N15)),IF(AND(N15<=9,N15>=1),IF(AND(AC15=1,H15<>\"\"),1,IF(AND(AC15=1,H15=\"\"),1.5,IF(AND(AC15=2,H15<>\"\"),2,IF(AND(AC15=2,H15=\"\"),3,0)))),\"\"),\"Err. Profil\"),\"\")","v":""},{"$f":"IF(O15<>\"\",IF(ROUND(M15,0)<=3,1,0),\"\")","v":""},{"$f":"IF(AND(R15<>\"\",Q15<>\"\",P15<>\"\"),IF($C15=\"\",\"SX\",IF($C15=\"F\",VLOOKUP(ROUND($L15,0)/100,Barème500,3),VLOOKUP(ROUND($L15,0)/100,Barème500,2))),\"\")","v":""},{"$f":"IF(OR(K15=\"\",K15=\"\",AH15=\"\",AG15=\"\",AF15=\"\"),\"\",IF(OR(K15<0,K15>2),\"Err ech.\",SUM(K15,AH15,AG15,AF15)))","v":""},null,null,null,null,null,{"$f":"IF(C15<>\"f\",\"m\",\"f\")","v":"m"}]
[null,null,null,null,null,null,null,null,null,null,null,{"$f":"IF(AND(R16<>\"\",Q16<>\"\",P16<>\"\"),(INT(((INT($P16)*60)+(($P16-INT($P16))*100)+(INT($Q16)*60)+(($Q16-INT($Q16))*100)+(INT($R16)*60)+(($R16-INT($R16))*100))/60)+MOD(((INT($P16)*60)+(($P16-INT($P16))*100)+(INT($Q16)*60)+(($Q16-INT($Q16))*100)+(INT($R16)*60)+(($R16-INT($R16))*100)),60)/100)*100,\"\")","v":""},{"$f":"IF(OR(O16=\"\",P16=\"\"),\"\",ABS((INT(P16)*60)+((P16-INT(P16))*100)-((INT(O16)*60)+((O16-INT(O16))*100))))","v":""},{"$f":"IF(AND(E16=\"\",H16=\"\"),\"\",IF(H16=\"\",E16,H16))","v":""},{"$f":"IF(F16=\"\",\"\",F16/100)","v":""},{"$f":"IF(G16=\"\",\"\",G16/100)","v":""},{"$f":"IF(I16=\"\",\"\",I16/100)","v":""},{"$f":"IF(J16=\"\",\"\",J16/100)","v":""},{"$f":"ROUND((INT(Q16)*60)+((Q16-INT(Q16))*100)-((INT(P16)*60)+((P16-INT(P16))*100)),0)","v":{"$error":"#VALUE!"}},{"$f":"ROUND((INT(R16)*60)+((R16-INT(R16))*100)-((INT(Q16)*60)+((Q16-INT(Q16))*100)),0)","v":{"$error":"#VALUE!"}},{"$f":"ROUND((INT(R16)*60)+((R16-INT(R16))*100)-((INT(P16)*60)+((P16-INT(P16))*100)),0)","v":{"$error":"#VALUE!"}},{"$f":"IF(AND(Q16<>0,P16<>0),IF(OR(N16=1,N16=3,N16=4),IF(OR(S16=0,ABS(S16)<='Barèmes & Options'!H$2),1,0)),\"\")","v":false},{"$f":"IF(AND(Q16<>\"\",P16<>\"\"),IF(OR(N16=5,N16=7),IF(S16>0,1,0)),\"\")","v":""},{"$f":"IF(AND(Q16<>\"\",P16<>\"\"),IF(OR(N16=2,N16=6,N16=8),IF(S16<0,1,0)),\"\")","v":""},{"$f":"IF(AND(Q16<>0,R16<>0),IF(OR(N16=1,N16=5,N16=6),IF(OR(T16=0,ABS(T16)<='Barèmes & Options'!H$2),1,0)),\"\")","v":false},{"$f":"IF(AND(Q16<>\"\",R16<>\"\"),IF(OR(N16=4,N16=8),IF(T16>0,1,0)),\"\")","v":""},{"$f":"IF(AND(Q16<>\"\",R16<>\"\"),IF(OR(N16=2,N16=3,N16=7),IF(T16<0,1,0)),\"\")","v":""},{"$f":"IF(SUM(V16:AA16)=2,IF(N16=2,IF(N16=2,IF(U16-'Barèmes & Options'!H$2<-1,0,1)),\"\"),0)","v":0},{"$f":"IF(OR(N16=2,N16=9),SUM(V16:AA16)-AB16,SUM(V16:AA16))","v":0},{"$f":"IF(OR(V16=1,W16=1,X16=1),TRUE,FALSE)","v":false},{"$f":"IF(OR(Y16=1,Z16=1,AA16=1),TRUE,FALSE)","v":false},{"$f":"IF(N16<>\"\",IF(AND(N16>=1,N16<=8,N16=ABS(N16)),IF(AND(N16<=9,N16>=1),IF(AND(AC16=1,H16<>\"\"),1,IF(AND(AC16=1,H16=\"\"),1.5,IF(AND(AC16=2,H16<>\"\"),2,IF(AND(AC16=2,H16=\"\"),3,0)))),\"\"),\"Err. Profil\"),\"\")","v":""},{"$f":"IF(O16<>\"\",IF(ROUND(M16,0)<=3,1,0),\"\")","v":""},{"$f":"IF(AND(R16<>\"\",Q16<>\"\",P16<>\"\"),IF($C16=\"\",\"SX\",IF($C16=\"F\",VLOOKUP(ROUND($L16,0)/100,Barème500,3),VLOOKUP(ROUND($L16,0)/100,Barème500,2))),\"\")","v":""},{"$f":"IF(OR(K16=\"\",K16=\"\",AH16=\"\",AG16=\"\",AF16=\"\"),\"\",IF(OR(K16<0,K16>2),\"Err ech.\",SUM(K16,AH16,AG16,AF16)))","v":""},null,null,null,null,null,{"$f":"IF(C16<>\"f\",\"m\",\"f\")","v":"m"}]
[null,null,null,null,null,null,null,null,null,null,null,{"$f":"IF(AND(R17<>\"\",Q17<>\"\",P17<>\"\"),(INT(((INT($P17)*60)+(($P17-INT($P17))*100)+(INT($Q17)*60)+(($Q17-INT($Q17))*100)+(INT($R17)*60)+(($R17-INT($R17))*100))/60)+MOD(((INT($P17)*60)+(($P17-INT($P17))*100)+(INT($Q17)*60)+(($Q17-INT($Q17))*100)+(INT($R17)*60)+(($R17-INT($R17))*100)),60)/100)*100,\"\")","v":""},{"$f":"IF(OR(O17=\"\",P17=\"\"),\"\",ABS((INT(P17)*60)+((P17-INT(P17))*100)-((INT(O17)*60)+((O17-INT(O17))*100))))","v":""},{"$f":"IF(AND(E17=\"\",H17=\"\"),\"\",IF(H17=\"\",E17,H17))","v":""},{"$f":"IF(F17=\"\",\"\",F17/100)","v":""},{"$f":"IF(G17=\"\",\"\",G17/100)","v":""},{"$f":"IF(I17=\"\",\"\",I17/100)","v":""},{"$f":"IF(J17=\"\",\"\",J17/100)","v":""},{"$f":"ROUND((INT(Q17)*60)+((Q17-INT(Q17))*100)-((INT(P17)*60)+((P17-INT(P17))*100)),0)","v":{"$error":"#VALUE!"}},{"$f":"ROUND((INT(R17)*60)+((R17-INT(R17))*100)-((INT(Q17)*60)+((Q17-INT(Q17))*100)),0)","v":{"$error":"#VALUE!"}},{"$f":"ROUND((INT(R17)*60)+((R17-INT(R17))*100)-((INT(P17)*60)+((P17-INT(P17))*100)),0)","v":{"$error":"#VALUE!"}},{"$f":"IF(AND(Q17<>0,P17<>0),IF(OR(N17=1,N17=3,N17=4),IF(OR(S17=0,ABS(S17)<='Barèmes & Options'!H$2),1,0)),\"\")","v":false},{"$f":"IF(AND(Q17<>\"\",P17<>\"\"),IF(OR(N17=5,N17=7),IF(S17>0,1,0)),\"\")","v":""},{"$f":"IF(AND(Q17<>\"\",P17<>\"\"),IF(OR(N17=2,N17=6,N17=8),IF(S17<0,1,0)),\"\")","v":""},{"$f":"IF(AND(Q17<>0,R17<>0),IF(OR(N17=1,N17=5,N17=6),IF(OR(T17=0,ABS(T17)<='Barèmes & Options'!H$2),1,0)),\"\")","v":false},{"$f":"IF(AND(Q17<>\"\",R17<>\"\"),IF(OR(N17=4,N17=8),IF(T17>0,1,0)),\"\")","v":""},{"$f":"IF(AND(Q17<>\"\",R17<>\"\"),IF(OR(N17=2,N17=3,N17=7),IF(T17<0,1,0)),\"\")","v":""},{"$f":"IF(SUM(V17:AA17)=2,IF(N17=2,IF(N17=2,IF(U17-'Barèmes & Options'!H$2<-1,0,1)),\"\"),0)","v":0},{"$f":"IF(OR(N17=2,N17=9),SUM(V17:AA17)-AB17,SUM(V17:AA17))","v":0},{"$f":"IF(OR(V17=1,W17=1,X17=1),TRUE,FALSE)","v":false},{"$f":"IF(OR(Y17=1,Z17=1,AA17=1),TRUE,FALSE)","v":false},{"$f":"IF(N17<>\"\",IF(AND(N17>=1,N17<=8,N17=ABS(N17)),IF(AND(N17<=9,N17>=1),IF(AND(AC17=1,H17<>\"\"),1,IF(AND(AC17=1,H17=\"\"),1.5,IF(AND(AC17=2,H17<>\"\"),2,IF(AND(AC17=2,H17=\"\"),3,0)))),\"\"),\"Err. Profil\"),\"\")","v":""},{"$f":"IF(O17<>\"\",IF(ROUND(M17,0)<=3,1,0),\"\")","v":""},{"$f":"IF(AND(R17<>\"\",Q17<>\"\",P17<>\"\"),IF($C17=\"\",\"SX\",IF($C17=\"F\",VLOOKUP(ROUND($L17,0)/100,Barème500,3),VLOOKUP(ROUND($L17,0)/100,Barème500,2))),\"\")","v":""},{"$f":"IF(OR(K17=\"\",K17=\"\",AH17=\"\",AG17=\"\",AF17=\"\"),\"\",IF(OR(K17<0,K17>2),\"Err ech.\",SUM(K17,AH17,AG17,AF17)))","v":""},null,null,null,null,null,{"$f":"IF(C17<>\"f\",\"m\",\"f\")","v":"m"}]
[null,null,null,null,null,null,null,null,null,null,null,{"$f":"IF(AND(R18<>\"\",Q18<>\"\",P18<>\"\"),(INT(((INT($P18)*60)+(($P18-INT($P18))*100)+(INT($Q18)*60)+(($Q18-INT($Q18))*100)+(INT($R18)*60)+(($R18-INT($R18))*100))/60)+MOD(((INT($P18)*60)+(($P18-INT($P18))*100)+(INT($Q18)*60)+(($Q18-INT($Q18))*100)+(INT($R18)*60)+(($R18-INT($R18))*100)),60)/100)*100,\"\")","v":""},{"$f":"IF(OR(O18=\"\",P18=\"\"),\"\",ABS((INT(P18)*60)+((P18-INT(P18))*100)-((INT(O18)*60)+((O18-INT(O18))*100))))","v":""},{"$f":"IF(AND(E18=\"\",H18=\"\"),\"\",IF(H18=\"\",E18,H18))","v":""},{"$f":"IF(F18=\"\",\"\",F18/100)","v":""},{"$f":"IF(G18=\"\",\"\",G18/100)","v":""},{"$f":"IF(I18=\"\",\"\",I18/100)","v":""},{"$f":"IF(J18=\"\",\"\",J18/100)","v":""},{"$f":"ROUND((INT(Q18)*60)+((Q18-INT(Q18))*100)-((INT(P18)*60)+((P18-INT(P18))*100)),0)","v":{"$error":"#VALUE!"}},{"$f":"ROUND((INT(R18)*60)+((R18-INT(R18))*100)-((INT(Q18)*60)+((Q18-INT(Q18))*100)),0)","v":{"$error":"#VALUE!"}},{"$f":"ROUND((INT(R18)*60)+((R18-INT(R18))*100)-((INT(P18)*60)+((P18-INT(P18))*100)),0)","v":{"$error":"#VALUE!"}},{"$f":"IF(AND(Q18<>0,P18<>0),IF(OR(N18=1,N18=3,N18=4),IF(OR(S18=0,ABS(S18)<='Barèmes & Options'!H$2),1,0)),\"\")","v":false},{"$f":"IF(AND(Q18<>\"\",P18<>\"\"),IF(OR(N18=5,N18=7),IF(S18>0,1,0)),\"\")","v":""},{"$f":"IF(AND(Q18<>\"\",P18<>\"\"),IF(OR(N18=2,N18=6,N18=8),IF(S18<0,1,0)),\"\")","v":""},{"$f":"IF(AND(Q18<>0,R18<>0),IF(OR(N18=1,N18=5,N18=6),IF(OR(T18=0,ABS(T18)<='Barèmes & Options'!H$2),1,0)),\"\")","v":false},{"$f":"IF(AND(Q18<>\"\",R18<>\"\"),IF(OR(N18=4,N18=8),IF(T18>0,1,0)),\"\")","v":""},{"$f":"IF(AND(Q18<>\"\",R18<>\"\"),IF(OR(N18=2,N18=3,N18=7),IF(T18<0,1,0)),\"\")","v":""},{"$f":"IF(SUM(V18:AA18)=2,IF(N18=2,IF(N18=2,IF(U18-'Barèmes & Options'!H$2<-1,0,1)),\"\"),0)","v":0},{"$f":"IF(OR(N18=2,N18=9),SUM(V18:AA18)-AB18,SUM(V18:AA18))","v":0},{"$f":"IF(OR(V18=1,W18=1,X18=1),TRUE,FALSE)","v":false},{"$f":"IF(OR(Y18=1,Z18=1,AA18=1),TRUE,FALSE)","v":false},{"$f":"IF(N18<>\"\",IF(AND(N18>=1,N18<=8,N18=ABS(N18)),IF(AND(N18<=9,N18>=1),IF(AND(AC18=1,H18<>\"\"),1,IF(AND(AC18=1,H18=\"\"),1.5,IF(AND(AC18=2,H18<>\"\"),2,IF(AND(AC18=2,H18=\"\"),3,0)))),\"\"),\"Err. Profil\"),\"\")","v":""},{"$f":"IF(O18<>\"\",IF(ROUND(M18,0)<=3,1,0),\"\")","v":""},{"$f":"IF(AND(R18<>\"\",Q18<>\"\",P18<>\"\"),IF($C18=\"\",\"SX\",IF($C18=\"F\",VLOOKUP(ROUND($L18,0)/100,Barème500,3),VLOOKUP(ROUND($L18,0)/100,Barème500,2))),\"\")","v":""},{"$f":"IF(OR(K18=\"\",K18=\"\",AH18=\"\",AG18=\"\",AF18=\"\"),\"\",IF(OR(K18<0,K18>2),\"Err ech.\",SUM(K18,AH18,AG18,AF18)))","v":""},null,null,null,null,null,{"$f":"IF(C18<>\"f\",\"m\",\"f\")","v":"m"}]
[null,null,null,null,null,null,null,null,null,null,null,{"$f":"IF(AND(R19<>\"\",Q19<>\"\",P19<>\"\"),(INT(((INT($P19)*60)+(($P19-INT($P19))*100)+(INT($Q19)*60)+(($Q19-INT($Q19))*100)+(INT($R19)*60)+(($R19-INT($R19))*100))/60)+MOD(((INT($P19)*60)+(($P19-INT($P19))*100)+(INT($Q19)*60)+(($Q19-INT($Q19))*100)+(INT($R19)*60)+(($R19-INT($R19))*100)),60)/100)*100,\"\")","v":""},{"$f":"IF(OR(O19=\"\",P19=\"\"),\"\",ABS((INT(P19)*60)+((P19-INT(P19))*100)-((INT(O19)*60)+((O19-INT(O19))*100))))","v":""},{"$f":"IF(AND(E19=\"\",H19=\"\"),\"\",IF(H19=\"\",E19,H19))","v":""},{"$f":"IF(F19=\"\",\"\",F19/100)","v":""},{"$f":"IF(G19=\"\",\"\",G19/100)","v":""},{"$f":"IF(I19=\"\",\"\",I19/100)","v":""},{"$f":"IF(J19=\"\",\"\",J19/100)","v":""},{"$f":"ROUND((INT(Q19)*60)+((Q19-INT(Q19))*100)-((INT(P19)*60)+((P19-INT(P19))*100)),0)","v":{"$error":"#VALUE!"}},{"$f":"ROUND((INT(R19)*60)+((R19-INT(R19))*100)-((INT(Q19)*60)+((Q19-INT(Q19))*100)),0)","v":{"$error":"#VALUE!"}},{"$f":"ROUND((INT(R19)*60)+((R19-INT(R19))*100)-((INT(P19)*60)+((P19-INT(P19))*100)),0)","v":{"$error":"#VALUE!"}},{"$f":"IF(AND(Q19<>0,P19<>0),IF(OR(N19=1,N19=3,N19=4),IF(OR(S19=0,ABS(S19)<='Barèmes & Options'!H$2),1,0)),\"\")","v":false},{"$f":"IF(AND(Q19<>\"\",P19<>\"\"),IF(OR(N19=5,N19=7),IF(S19>0,1,0)),\"\")","v":""},{"$f":"IF(AND(Q19<>\"\",P19<>\"\"),IF(OR(N19=2,N19=6,N19=8),IF(S19<0,1,0)),\"\")","v":""},{"$f":"IF(AND(Q19<>0,R19<>0),IF(OR(N19=1,N19=5,N19=6),IF(OR(T19=0,ABS(T19)<='Barèmes & Options'!H$2),1,0)),\"\")","v":false},{"$f":"IF(AND(Q19<>\"\",R19<>\"\"),IF(OR(N19=4,N19=8),IF(T19>0,1,0)),\"\")","v":""},{"$f":"IF(AND(Q19<>\"\",R19<>\"\"),IF(OR(N19=2,N19=3,N19=7),IF(T19<0,1,0)),\"\")","v":""},{"$f":"IF(SUM(V19:AA19)=2,IF(N19=2,IF(N19=2,IF(U19-'Barèmes & Options'!H$2<-1,0,1)),\"\"),0)","v":0},{"$f":"IF(OR(N19=2,N19=9),SUM(V19:AA19)-AB19,SUM(V19:AA19))","v":0},{"$f":"IF(OR(V19=1,W19=1,X19=1),TRUE,FALSE)","v":false},{"$f":"IF(OR(Y19=1,Z19=1,AA19=1),TRUE,FALSE)","v":false},{"$f":"IF(N19<>\"\",IF(AND(N19>=1,N19<=8,N19=ABS(N19)),IF(AND(N19<=9,N19>=1),IF(AND(AC19=1,H19<>\"\"),1,IF(AND(AC19=1,H19=\"\"),1.5,IF(AND(AC19=2,H19<>\"\"),2,IF(AND(AC19=2,H19=\"\"),3,0)))),\"\"),\"Err. Profil\"),\"\")","v":""},{"$f":"IF(O19<>\"\",IF(ROUND(M19,0)<=3,1,0),\"\")","v":""},{"$f":"IF(AND(R19<>\"\",Q19<>\"\",P19<>\"\"),IF($C19=\"\",\"SX\",IF($C19=\"F\",VLOOKUP(ROUND($L19,0)/100,Barème500,3),VLOOKUP(ROUND($L19,0)/100,Barème500,2))),\"\")","v":""},{"$f":"IF(OR(K19=\"\",K19=\"\",AH19=\"\",AG19=\"\",AF19=\"\"),\"\",IF(OR(K19<0,K19>2),\"Err ech.\",SUM(K19,AH19,AG19,AF19)))","v":""},null,null,null,null,null,{"$f":"IF(C19<>\"f\",\"m\",\"f\")","v":"m"}]
[null,null,null,null,null,null,null,null,null,null,null,{"$f":"IF(AND(R20<>\"\",Q20<>\"\",P20<>\"\"),(INT(((INT($P20)*60)+(($P20-INT($P20))*100)+(INT($Q20)*60)+(($Q20-INT($Q20))*100)+(INT($R20)*60)+(($R20-INT($R20))*100))/60)+MOD(((INT($P20)*60)+(($P20-INT($P20))*100)+(INT($Q20)*60)+(($Q20-INT($Q20))*100)+(INT($R20)*60)+(($R20-INT($R20))*100)),60)/100)*100,\"\")","v":""},{"$f":"IF(OR(O20=\"\",P20=\"\"),\"\",ABS((INT(P20)*60)+((P20-INT(P20))*100)-((INT(O20)*60)+((O20-INT(O20))*100))))","v":""},{"$f":"IF(AND(E20=\"\",H20=\"\"),\"\",IF(H20=\"\",E20,H20))","v":""},{"$f":"IF(F20=\"\",\"\",F20/100)","v":""},{"$f":"IF(G20=\"\",\"\",G20/100)","v":""},{"$f":"IF(I20=\"\",\"\",I20/100)","v":""},{"$f":"IF(J20=\"\",\"\",J20/100)","v":""},{"$f":"ROUND((INT(Q20)*60)+((Q20-INT(Q20))*100)-((INT(P20)*60)+((P20-INT(P20))*100)),0)","v":{"$error":"#VALUE!"}},{"$f":"ROUND((INT(R20)*60)+((R20-INT(R20))*100)-((INT(Q20)*60)+((Q20-INT(Q20))*100)),0)","v":{"$error":"#VALUE!"}},{"$f":"ROUND((INT(R20)*60)+((R20-INT(R20))*100)-((INT(P20)*60)+((P20-INT(P20))*100)),0)","v":{"$error":"#VALUE!"}},{"$f":"IF(AND(Q20<>0,P20<>0),IF(OR(N20=1,N20=3,N20=4),IF(OR(S20=0,ABS(S20)<='Barèmes & Options'!H$2),1,0)),\"\")","v":false},{"$f":"IF(AND(Q20<>\"\",P20<>\"\"),IF(OR(N20=5,N20=7),IF(S20>0,1,0)),\"\")","v":""},{"$f":"IF(AND(Q20<>\"\",P20<>\"\"),IF(OR(N20=2,N20=6,N20=8),IF(S20<0,1,0)),\"\")","v":""},{"$f":"IF(AND(Q20<>0,R20<>0),IF(OR(N20=1,N20=5,N20=6),IF(OR(T20=0,ABS(T20)<='Barèmes & Options'!H$2),1,0)),\"\")","v":false},{"$f":"IF(AND(Q20<>\"\",R20<>\"\"),IF(OR(N20=4,N20=8),IF(T20>0,1,0)),\"\")","v":""},{"$f":"IF(AND(Q20<>\"\",R20<>\"\"),IF(OR(N20=2,N20=3,N20=7),IF(T20<0,1,0)),\"\")","v":""},{"$f":"IF(SUM(V20:AA20)=2,IF(N20=2,IF(N20=2,IF(U20-'Barèmes & Options'!H$2<-1,0,1)),\"\"),0)","v":0},{"$f":"IF(OR(N20=2,N20=9),SUM(V20:AA20)-AB20,SUM(V20:AA20))","v":0},{"$f":"IF(OR(V20=1,W20=1,X20=1),TRUE,FALSE)","v":false},{"$f":"IF(OR(Y20=1,Z20=1,AA20=1),TRUE,FALSE)","v":false},{"$f":"IF(N20<>\"\",IF(AND(N20>=1,N20<=8,N20=ABS(N20)),IF(AND(N20<=9,N20>=1),IF(AND(AC20=1,H20<>\"\"),1,IF(AND(AC20=1,H20=\"\"),1.5,IF(AND(AC20=2,H20<>\"\"),2,IF(AND(AC20=2,H20=\"\"),3,0)))),\"\"),\"Err. Profil\"),\"\")","v":""},{"$f":"IF(O20<>\"\",IF(ROUND(M20,0)<=3,1,0),\"\")","v":""},{"$f":"IF(AND(R20<>\"\",Q20<>\"\",P20<>\"\"),IF($C20=\"\",\"SX\",IF($C20=\"F\",VLOOKUP(ROUND($L20,0)/100,Barème500,3),VLOOKUP(ROUND($L20,0)/100,Barème500,2))),\"\")","v":""},{"$f":"IF(OR(K20=\"\",K20=\"\",AH20=\"\",AG20=\"\",AF20=\"\"),\"\",IF(OR(K20<0,K20>2),\"Err ech.\",SUM(K20,AH20,AG20,AF20)))","v":""},null,null,null,null,null,{"$f":"IF(C20<>\"f\",\"m\",\"f\")","v":"m"}]
[null,null,null,null,null,null,null,null,null,null,null,{"$f":"IF(AND(R21<>\"\",Q21<>\"\",P21<>\"\"),(INT(((INT($P21)*60)+(($P21-INT($P21))*100)+(INT($Q21)*60)+(($Q21-INT($Q21))*100)+(INT($R21)*60)+(($R21-INT($R21))*100))/60)+MOD(((INT($P21)*60)+(($P21-INT($P21))*100)+(INT($Q21)*60)+(($Q21-INT($Q21))*100)+(INT($R21)*60)+(($R21-INT($R21))*100)),60)/100)*100,\"\")","v":""},{"$f":"IF(OR(O21=\"\",P21=\"\"),\"\",ABS((INT(P21)*60)+((P21-INT(P21))*100)-((INT(O21)*60)+((O21-INT(O21))*100))))","v":""},{"$f":"IF(AND(E21=\"\",H21=\"\"),\"\",IF(H21=\"\",E21,H21))","v":""},{"$f":"IF(F21=\"\",\"\",F21/100)","v":""},{"$f":"IF(G21=\"\",\"\",G21/100)","v":""},{"$f":"IF(I21=\"\",\"\",I21/100)","v":""},{"$f":"IF(J21=\"\",\"\",J21/100)","v":""},{"$f":"ROUND((INT(Q21)*60)+((Q21-INT(Q21))*100)-((INT(P21)*60)+((P21-INT(P21))*100)),0)","v":{"$error":"#VALUE!"}},{"$f":"ROUND((INT(R21)*60)+((R21-INT(R21))*100)-((INT(Q21)*60)+((Q21-INT(Q21))*100)),0)","v":{"$error":"#VALUE!"}},{"$f":"ROUND((INT(R21)*60)+((R21-INT(R21))*100)-((INT(P21)*60)+((P21-INT(P21))*100)),0)","v":{"$error":"#VALUE!"}},{"$f":"IF(AND(Q21<>0,P21<>0),IF(OR(N21=1,N21=3,N21=4),IF(OR(S21=0,ABS(S21)<='Barèmes & Options'!H$2),1,0)),\"\")","v":false},{"$f":"IF(AND(Q21<>\"\",P21<>\"\"),IF(OR(N21=5,N21=7),IF(S21>0,1,0)),\"\")","v":""},{"$f":"IF(AND(Q21<>\"\",P21<>\"\"),IF(OR(N21=2,N21=6,N21=8),IF(S21<0,1,0)),\"\")","v":""},{"$f":"IF(AND(Q21<>0,R21<>0),IF(OR(N21=1,N21=5,N21=6),IF(OR(T21=0,ABS(T21)<='Barèmes & Options'!H$2),1,0)),\"\")","v":false},{"$f":"IF(AND(Q21<>\"\",R21<>\"\"),IF(OR(N21=4,N21=8),IF(T21>0,1,0)),\"\")","v":""},{"$f":"IF(AND(Q21<>\"\",R21<>\"\"),IF(OR(N21=2,N21=3,N21=7),IF(T21<0,1,0)),\"\")","v":""},{"$f":"IF(SUM(V21:AA21)=2,IF(N21=2,IF(N21=2,IF(U21-'Barèmes & Options'!H$2<-1,0,1)),\"\"),0)","v":0},{"$f":"IF(OR(N21=2,N21=9),SUM(V21:AA21)-AB21,SUM(V21:AA21))","v":0},{"$f":"IF(OR(V21=1,W21=1,X21=1),TRUE,FALSE)","v":false},{"$f":"IF(OR(Y21=1,Z21=1,AA21=1),TRUE,FALSE)","v":false},{"$f":"IF(N21<>\"\",IF(AND(N21>=1,N21<=8,N21=ABS(N21)),IF(AND(N21<=9,N21>=1),IF(AND(AC21=1,H21<>\"\"),1,IF(AND(AC21=1,H21=\"\"),1.5,IF(AND(AC21=2,H21<>\"\"),2,IF(AND(AC21=2,H21=\"\"),3,0)))),\"\"),\"Err. Profil\"),\"\")","v":""},{"$f":"IF(O21<>\"\",IF(ROUND(M21,0)<=3,1,0),\"\")","v":""},{"$f":"IF(AND(R21<>\"\",Q21<>\"\",P21<>\"\"),IF($C21=\"\",\"SX\",IF($C21=\"F\",VLOOKUP(ROUND($L21,0)/100,Barème500,3),VLOOKUP(ROUND($L21,0)/100,Barème500,2))),\"\")","v":""},{"$f":"IF(OR(K21=\"\",K21=\"\",AH21=\"\",AG21=\"\",AF21=\"\"),\"\",IF(OR(K21<0,K21>2),\"Err ech.\",SUM(K21,AH21,AG21,AF21)))","v":""},null,null,null,null,null,{"$f":"IF(C21<>\"f\",\"m\",\"f\")","v":"m"}]
[null,null,null,null,null,null,null,null,null,null,null,{"$f":"IF(AND(R22<>\"\",Q22<>\"\",P22<>\"\"),(INT(((INT($P22)*60)+(($P22-INT($P22))*100)+(INT($Q22)*60)+(($Q22-INT($Q22))*100)+(INT($R22)*60)+(($R22-INT($R22))*100))/60)+MOD(((INT($P22)*60)+(($P22-INT($P22))*100)+(INT($Q22)*60)+(($Q22-INT($Q22))*100)+(INT($R22)*60)+(($R22-INT($R22))*100)),60)/100)*100,\"\")","v":""},{"$f":"IF(OR(O22=\"\",P22=\"\"),\"\",ABS((INT(P22)*60)+((P22-INT(P22))*100)-((INT(O22)*60)+((O22-INT(O22))*100))))","v":""},{"$f":"IF(AND(E22=\"\",H22=\"\"),\"\",IF(H22=\"\",E22,H22))","v":""},{"$f":"IF(F22=\"\",\"\",F22/100)","v":""},{"$f":"IF(G22=\"\",\"\",G22/100)","v":""},{"$f":"IF(I22=\"\",\"\",I22/100)","v":""},{"$f":"IF(J22=\"\",\"\",J22/100)","v":""},{"$f":"ROUND((INT(Q22)*60)+((Q22-INT(Q22))*100)-((INT(P22)*60)+((P22-INT(P22))*100)),0)","v":{"$error":"#VALUE!"}},{"$f":"ROUND((INT(R22)*60)+((R22-INT(R22))*100)-((INT(Q22)*60)+((Q22-INT(Q22))*100)),0)","v":{"$error":"#VALUE!"}},{"$f":"ROUND((INT(R22)*60)+((R22-INT(R22))*100)-((INT(P22)*60)+((P22-INT(P22))*100)),0)","v":{"$error":"#VALUE!"}},{"$f":"IF(AND(Q22<>0,P22<>0),IF(OR(N22=1,N22=3,N22=4),IF(OR(S22=0,ABS(S22)<='Barèmes & Options'!H$2),1,0)),\"\")","v":false},{"$f":"IF(AND(Q22<>\"\",P22<>\"\"),IF(OR(N22=5,N22=7),IF(S22>0,1,0)),\"\")","v":""},{"$f":"IF(AND(Q22<>\"\",P22<>\"\"),IF(OR(N22=2,N22=6,N22=8),IF(S22<0,1,0)),\"\")","v":""},{"$f":"IF(AND(Q22<>0,R22<>0),IF(OR(N22=1,N22=5,N22=6),IF(OR(T22=0,ABS(T22)<='Barèmes & Options'!H$2),1,0)),\"\")","v":false},{"$f":"IF(AND(Q22<>\"\",R22<>\"\"),IF(OR(N22=4,N22=8),IF(T22>0,1,0)),\"\")","v":""},{"$f":"IF(AND(Q22<>\"\",R22<>\"\"),IF(OR(N22=2,N22=3,N22=7),IF(T22<0,1,0)),\"\")","v":""},{"$f":"IF(SUM(V22:AA22)=2,IF(N22=2,IF(N22=2,IF(U22-'Barèmes & Options'!H$2<-1,0,1)),\"\"),0)","v":0},{"$f":"IF(OR(N22=2,N22=9),SUM(V22:AA22)-AB22,SUM(V22:AA22))","v":0},{"$f":"IF(OR(V22=1,W22=1,X22=1),TRUE,FALSE)","v":false},{"$f":"IF(OR(Y22=1,Z22=1,AA22=1),TRUE,FALSE)","v":false},{"$f":"IF(N22<>\"\",IF(AND(N22>=1,N22<=8,N22=ABS(N22)),IF(AND(N22<=9,N22>=1),IF(AND(AC22=1,H22<>\"\"),1,IF(AND(AC22=1,H22=\"\"),1.5,IF(AND(AC22=2,H22<>\"\"),2,IF(AND(AC22=2,H22=\"\"),3,0)))),\"\"),\"Err. Profil\"),\"\")","v":""},{"$f":"IF(O22<>\"\",IF(ROUND(M22,0)<=3,1,0),\"\")","v":""},{"$f":"IF(AND(R22<>\"\",Q22<>\"\",P22<>\"\"),IF($C22=\"\",\"SX\",IF($C22=\"F\",VLOOKUP(ROUND($L22,0)/100,Barème500,3),VLOOKUP(ROUND($L22,0)/100,Barème500,2))),\"\")","v":""},{"$f":"IF(OR(K22=\"\",K22=\"\",AH22=\"\",AG22=\"\",AF22=\"\"),\"\",IF(OR(K22<0,K22>2),\"Err ech.\",SUM(K22,AH22,AG22,AF22)))","v":""},null,null,null,null,null,{"$f":"IF(C22<>\"f\",\"m\",\"f\")","v":"m"}]
[null,null,null,null,null,null,null,null,null,null,null,{"$f":"IF(AND(R23<>\"\",Q23<>\"\",P23<>\"\"),(INT(((INT($P23)*60)+(($P23-INT($P23))*100)+(INT($Q23)*60)+(($Q23-INT($Q23))*100)+(INT($R23)*60)+(($R23-INT($R23))*100))/60)+MOD(((INT($P23)*60)+(($P23-INT($P23))*100)+(INT($Q23)*60)+(($Q23-INT($Q23))*100)+(INT($R23)*60)+(($R23-INT($R23))*100)),60)/100)*100,\"\")","v":""},{"$f":"IF(OR(O23=\"\",P23=\"\"),\"\",ABS((INT(P23)*60)+((P23-INT(P23))*100)-((INT(O23)*60)+((O23-INT(O23))*100))))","v":""},{"$f":"IF(AND(E23=\"\",H23=\"\"),\"\",IF(H23=\"\",E23,H23))","v":""},{"$f":"IF(F23=\"\",\"\",F23/100)","v":""},{"$f":"IF(G23=\"\",\"\",G23/100)","v":""},{"$f":"IF(I23=\"\",\"\",I23/100)","v":""},{"$f":"IF(J23=\"\",\"\",J23/100)","v":""},{"$f":"ROUND((INT(Q23)*60)+((Q23-INT(Q23))*100)-((INT(P23)*60)+((P23-INT(P23))*100)),0)","v":{"$error":"#VALUE!"}},{"$f":"ROUND((INT(R23)*60)+((R23-INT(R23))*100)-((INT(Q23)*60)+((Q23-INT(Q23))*100)),0)","v":{"$error":"#VALUE!"}},{"$f":"ROUND((INT(R23)*60)+((R23-INT(R23))*100)-((INT(P23)*60)+((P23-INT(P23))*100)),0)","v":{"$error":"#VALUE!"}},{"$f":"IF(AND(Q23<>0,P23<>0),IF(OR(N23=1,N23=3,N23=4),IF(OR(S23=0,ABS(S23)<='Barèmes & Options'!H$2),1,0)),\"\")","v":false},{"$f":"IF(AND(Q23<>\"\",P23<>\"\"),IF(OR(N23=5,N23=7),IF(S23>0,1,0)),\"\")","v":""},{"$f":"IF(AND(Q23<>\"\",P23<>\"\"),IF(OR(N23=2,N23=6,N23=8),IF(S23<0,1,0)),\"\")","v":""},{"$f":"IF(AND(Q23<>0,R23<>0),IF(OR(N23=1,N23=5,N23=6),IF(OR(T23=0,ABS(T23)<='Barèmes & Options'!H$2),1,0)),\"\")","v":false},{"$f":"IF(AND(Q23<>\"\",R23<>\"\"),IF(OR(N23=4,N23=8),IF(T23>0,1,0)),\"\")","v":""},{"$f":"IF(AND(Q23<>\"\",R23<>\"\"),IF(OR(N23=2,N23=3,N23=7),IF(T23<0,1,0)),\"\")","v":""},{"$f":"IF(SUM(V23:AA23)=2,IF(N23=2,IF(N23=2,IF(U23-'Barèmes & Options'!H$2<-1,0,1)),\"\"),0)","v":0},{"$f":"IF(OR(N23=2,N23=9),SUM(V23:AA23)-AB23,SUM(V23:AA23))","v":0},{"$f":"IF(OR(V23=1,W23=1,X23=1),TRUE,FALSE)","v":false},{"$f":"IF(OR(Y23=1,Z23=1,AA23=1),TRUE,FALSE)","v":false},{"$f":"IF(N23<>\"\",IF(AND(N23>=1,N23<=8,N23=ABS(N23)),IF(AND(N23<=9,N23>=1),IF(AND(AC23=1,H23<>\"\"),1,IF(AND(AC23=1,H23=\"\"),1.5,IF(AND(AC23=2,H23<>\"\"),2,IF(AND(AC23=2,H23=\"\"),3,0)))),\"\"),\"Err. Profil\"),\"\")","v":""},{"$f":"IF(O23<>\"\",IF(ROUND(M23,0)<=3,1,0),\"\")","v":""},{"$f":"IF(AND(R23<>\"\",Q23<>\"\",P23<>\"\"),IF($C23=\"\",\"SX\",IF($C23=\"F\",VLOOKUP(ROUND($L23,0)/100,Barème500,3),VLOOKUP(ROUND($L23,0)/100,Barème500,2))),\"\")","v":""},{"$f":"IF(OR(K23=\"\",K23=\"\",AH23=\"\",AG23=\"\",AF23=\"\"),\"\",IF(OR(K23<0,K23>2),\"Err ech.\",SUM(K23,AH23,AG23,AF23)))","v":""},null,null,null,null,null,{"$f":"IF(C23<>\"f\",\"m\",\"f\")","v":"m"}]
[null,null,null,null,null,null,null,null,null,null,null,{"$f":"IF(AND(R24<>\"\",Q24<>\"\",P24<>\"\"),(INT(((INT($P24)*60)+(($P24-INT($P24))*100)+(INT($Q24)*60)+(($Q24-INT($Q24))*100)+(INT($R24)*60)+(($R24-INT($R24))*100))/60)+MOD(((INT($P24)*60)+(($P24-INT($P24))*100)+(INT($Q24)*60)+(($Q24-INT($Q24))*100)+(INT($R24)*60)+(($R24-INT($R24))*100)),60)/100)*100,\"\")","v":""},{"$f":"IF(OR(O24=\"\",P24=\"\"),\"\",ABS((INT(P24)*60)+((P24-INT(P24))*100)-((INT(O24)*60)+((O24-INT(O24))*100))))","v":""},{"$f":"IF(AND(E24=\"\",H24=\"\"),\"\",IF(H24=\"\",E24,H24))","v":""},{"$f":"IF(F24=\"\",\"\",F24/100)","v":""},{"$f":"IF(G24=\"\",\"\",G24/100)","v":""},{"$f":"IF(I24=\"\",\"\",I24/100)","v":""},{"$f":"IF(J24=\"\",\"\",J24/100)","v":""},{"$f":"ROUND((INT(Q24)*60)+((Q24-INT(Q24))*100)-((INT(P24)*60)+((P24-INT(P24))*100)),0)","v":{"$error":"#VALUE!"}},{"$f":"ROUND((INT(R24)*60)+((R24-INT(R24))*100)-((INT(Q24)*60)+((Q24-INT(Q24))*100)),0)","v":{"$error":"#VALUE!"}},{"$f":"ROUND((INT(R24)*60)+((R24-INT(R24))*100)-((INT(P24)*60)+((P24-INT(P24))*100)),0)","v":{"$error":"#VALUE!"}},{"$f":"IF(AND(Q24<>0,P24<>0),IF(OR(N24=1,N24=3,N24=4),IF(OR(S24=0,ABS(S24)<='Barèmes & Options'!H$2),1,0)),\"\")","v":false},{"$f":"IF(AND(Q24<>\"\",P24<>\"\"),IF(OR(N24=5,N24=7),IF(S24>0,1,0)),\"\")","v":""},{"$f":"IF(AND(Q24<>\"\",P24<>\"\"),IF(OR(N24=2,N24=6,N24=8),IF(S24<0,1,0)),\"\")","v":""},{"$f":"IF(AND(Q24<>0,R24<>0),IF(OR(N24=1,N24=5,N24=6),IF(OR(T24=0,ABS(T24)<='Barèmes & Options'!H$2),1,0)),\"\")","v":false},{"$f":"IF(AND(Q24<>\"\",R24<>\"\"),IF(OR(N24=4,N24=8),IF(T24>0,1,0)),\"\")","v":""},{"$f":"IF(AND(Q24<>\"\",R24<>\"\"),IF(OR(N24=2,N24=3,N24=7),IF(T24<0,1,0)),\"\")","v":""},{"$f":"IF(SUM(V24:AA24)=2,IF(N24=2,IF(N24=2,IF(U24-'Barèmes & Options'!H$2<-1,0,1)),\"\"),0)","v":0},{"$f":"IF(OR(N24=2,N24=9),SUM(V24:AA24)-AB24,SUM(V24:AA24))","v":0},{"$f":"IF(OR(V24=1,W24=1,X24=1),TRUE,FALSE)","v":false},{"$f":"IF(OR(Y24=1,Z24=1,AA24=1),TRUE,FALSE)","v":false},{"$f":"IF(N24<>\"\",IF(AND(N24>=1,N24<=8,N24=ABS(N24)),IF(AND(N24<=9,N24>=1),IF(AND(AC24=1,H24<>\"\"),1,IF(AND(AC24=1,H24=\"\"),1.5,IF(AND(AC24=2,H24<>\"\"),2,IF(AND(AC24=2,H24=\"\"),3,0)))),\"\"),\"Err. Profil\"),\"\")","v":""},{"$f":"IF(O24<>\"\",IF(ROUND(M24,0)<=3,1,0),\"\")","v":""},{"$f":"IF(AND(R24<>\"\",Q24<>\"\",P24<>\"\"),IF($C24=\"\",\"SX\",IF($C24=\"F\",VLOOKUP(ROUND($L24,0)/100,Barème500,3),VLOOKUP(ROUND($L24,0)/100,Barème500,2))),\"\")","v":""},{"$f":"IF(OR(K24=\"\",K24=\"\",AH24=\"\",AG24=\"\",AF24=\"\"),\"\",IF(OR(K24<0,K24>2),\"Err ech.\",SUM(K24,AH24,AG24,AF24)))","v":""},null,null,null,null,null,{"$f":"IF(C24<>\"f\",\"m\",\"f\")","v":"m"}]
[null,null,null,null,null,null,null,null,null,null,null,{"$f":"IF(AND(R25<>\"\",Q25<>\"\",P25<>\"\"),(INT(((INT($P25)*60)+(($P25-INT($P25))*100)+(INT($Q25)*60)+(($Q25-INT($Q25))*100)+(INT($R25)*60)+(($R25-INT($R25))*100))/60)+MOD(((INT($P25)*60)+(($P25-INT($P25))*100)+(INT($Q25)*60)+(($Q25-INT($Q25))*100)+(INT($R25)*60)+(($R25-INT($R25))*100)),60)/100)*100,\"\")","v":""},{"$f":"IF(OR(O25=\"\",P25=\"\"),\"\",ABS((INT(P25)*60)+((P25-INT(P25))*100)-((INT(O25)*60)+((O25-INT(O25))*100))))","v":""},{"$f":"IF(AND(E25=\"\",H25=\"\"),\"\",IF(H25=\"\",E25,H25))","v":""},{"$f":"IF(F25=\"\",\"\",F25/100)","v":""},{"$f":"IF(G25=\"\",\"\",G25/100)","v":""},{"$f":"IF(I25=\"\",\"\",I25/100)","v":""},{"$f":"IF(J25=\"\",\"\",J25/100)","v":""},{"$f":"ROUND((INT(Q25)*60)+((Q25-INT(Q25))*100)-((INT(P25)*60)+((P25-INT(P25))*100)),0)","v":{"$error":"#VALUE!"}},{"$f":"ROUND((INT(R25)*60)+((R25-INT(R25))*100)-((INT(Q25)*60)+((Q25-INT(Q25))*100)),0)","v":{"$error":"#VALUE!"}},{"$f":"ROUND((INT(R25)*60)+((R25-INT(R25))*100)-((INT(P25)*60)+((P25-INT(P25))*100)),0)","v":{"$error":"#VALUE!"}},{"$f":"IF(AND(Q25<>0,P25<>0),IF(OR(N25=1,N25=3,N25=4),IF(OR(S25=0,ABS(S25)<='Barèmes & Options'!H$2),1,0)),\"\")","v":false},{"$f":"IF(AND(Q25<>\"\",P25<>\"\"),IF(OR(N25=5,N25=7),IF(S25>0,1,0)),\"\")","v":""},{"$f":"IF(AND(Q25<>\"\",P25<>\"\"),IF(OR(N25=2,N25=6,N25=8),IF(S25<0,1,0)),\"\")","v":""},{"$f":"IF(AND(Q25<>0,R25<>0),IF(OR(N25=1,N25=5,N25=6),IF(OR(T25=0,ABS(T25)<='Barèmes & Options'!H$2),1,0)),\"\")","v":false},{"$f":"IF(AND(Q25<>\"\",R25<>\"\"),IF(OR(N25=4,N25=8),IF(T25>0,1,0)),\"\")","v":""},{"$f":"IF(AND(Q25<>\"\",R25<>\"\"),IF(OR(N25=2,N25=3,N25=7),IF(T25<0,1,0)),\"\")","v":""},{"$f":"IF(SUM(V25:AA25)=2,IF(N25=2,IF(N25=2,IF(U25-'Barèmes & Options'!H$2<-1,0,1)),\"\"),0)","v":0},{"$f":"IF(OR(N25=2,N25=9),SUM(V25:AA25)-AB25,SUM(V25:AA25))","v":0},{"$f":"IF(OR(V25=1,W25=1,X25=1),TRUE,FALSE)","v":false},{"$f":"IF(OR(Y25=1,Z25=1,AA25=1),TRUE,FALSE)","v":false},{"$f":"IF(N25<>\"\",IF(AND(N25>=1,N25<=8,N25=ABS(N25)),IF(AND(N25<=9,N25>=1),IF(AND(AC25=1,H25<>\"\"),1,IF(AND(AC25=1,H25=\"\"),1.5,IF(AND(AC25=2,H25<>\"\"),2,IF(AND(AC25=2,H25=\"\"),3,0)))),\"\"),\"Err. Profil\"),\"\")","v":""},{"$f":"IF(O25<>\"\",IF(ROUND(M25,0)<=3,1,0),\"\")","v":""},{"$f":"IF(AND(R25<>\"\",Q25<>\"\",P25<>\"\"),IF($C25=\"\",\"SX\",IF($C25=\"F\",VLOOKUP(ROUND($L25,0)/100,Barème500,3),VLOOKUP(ROUND($L25,0)/100,Barème500,2))),\"\")","v":""},{"$f":"IF(OR(K25=\"\",K25=\"\",AH25=\"\",AG25=\"\",AF25=\"\"),\"\",IF(OR(K25<0,K25>2),\"Err ech.\",SUM(K25,AH25,AG25,AF25)))","v":""},null,null,null,null,null,{"$f":"IF(C25<>\"f\",\"m\",\"f\")","v":"m"}]
[null,null,null,null,null,null,null,null,null,null,null,{"$f":"IF(AND(R26<>\"\",Q26<>\"\",P26<>\"\"),(INT(((INT($P26)*60)+(($P26-INT($P26))*100)+(INT($Q26)*60)+(($Q26-INT($Q26))*100)+(INT($R26)*60)+(($R26-INT($R26))*100))/60)+MOD(((INT($P26)*60)+(($P26-INT($P26))*100)+(INT($Q26)*60)+(($Q26-INT($Q26))*100)+(INT($R26)*60)+(($R26-INT($R26))*100)),60)/100)*100,\"\")","v":""},{"$f":"IF(OR(O26=\"\",P26=\"\"),\"\",ABS((INT(P26)*60)+((P26-INT(P26))*100)-((INT(O26)*60)+((O26-INT(O26))*100))))","v":""},{"$f":"IF(AND(E26=\"\",H26=\"\"),\"\",IF(H26=\"\",E26,H26))","v":""},{"$f":"IF(F26=\"\",\"\",F26/100)","v":""},{"$f":"IF(G26=\"\",\"\",G26/100)","v":""},{"$f":"IF(I26=\"\",\"\",I26/100)","v":""},{"$f":"IF(J26=\"\",\"\",J26/100)","v":""},{"$f":"ROUND((INT(Q26)*60)+((Q26-INT(Q26))*100)-((INT(P26)*60)+((P26-INT(P26))*100)),0)","v":{"$error":"#VALUE!"}},{"$f":"ROUND((INT(R26)*60)+((R26-INT(R26))*100)-((INT(Q26)*60)+((Q26-INT(Q26))*100)),0)","v":{"$error":"#VALUE!"}},{"$f":"ROUND((INT(R26)*60)+((R26-INT(R26))*100)-((INT(P26)*60)+((P26-INT(P26))*100)),0)","v":{"$error":"#VALUE!"}},{"$f":"IF(AND(Q26<>0,P26<>0),IF(OR(N26=1,N26=3,N26=4),IF(OR(S26=0,ABS(S26)<='Barèmes & Options'!H$2),1,0)),\"\")","v":false},{"$f":"IF(AND(Q26<>\"\",P26<>\"\"),IF(OR(N26=5,N26=7),IF(S26>0,1,0)),\"\")","v":""},{"$f":"IF(AND(Q26<>\"\",P26<>\"\"),IF(OR(N26=2,N26=6,N26=8),IF(S26<0,1,0)),\"\")","v":""},{"$f":"IF(AND(Q26<>0,R26<>0),IF(OR(N26=1,N26=5,N26=6),IF(OR(T26=0,ABS(T26)<='Barèmes & Options'!H$2),1,0)),\"\")","v":false},{"$f":"IF(AND(Q26<>\"\",R26<>\"\"),IF(OR(N26=4,N26=8),IF(T26>0,1,0)),\"\")","v":""},{"$f":"IF(AND(Q26<>\"\",R26<>\"\"),IF(OR(N26=2,N26=3,N26=7),IF(T26<0,1,0)),\"\")","v":""},{"$f":"IF(SUM(V26:AA26)=2,IF(N26=2,IF(N26=2,IF(U26-'Barèmes & Options'!H$2<-1,0,1)),\"\"),0)","v":0},{"$f":"IF(OR(N26=2,N26=9),SUM(V26:AA26)-AB26,SUM(V26:AA26))","v":0},{"$f":"IF(OR(V26=1,W26=1,X26=1),TRUE,FALSE)","v":false},{"$f":"IF(OR(Y26=1,Z26=1,AA26=1),TRUE,FALSE)","v":false},{"$f":"IF(N26<>\"\",IF(AND(N26>=1,N26<=8,N26=ABS(N26)),IF(AND(N26<=9,N26>=1),IF(AND(AC26=1,H26<>\"\"),1,IF(AND(AC26=1,H26=\"\"),1.5,IF(AND(AC26=2,H26<>\"\"),2,IF(AND(AC26=2,H26=\"\"),3,0)))),\"\"),\"Err. Profil\"),\"\")","v":""},{"$f":"IF(O26<>\"\",IF(ROUND(M26,0)<=3,1,0),\"\")","v":""},{"$f":"IF(AND(R26<>\"\",Q26<>\"\",P26<>\"\"),IF($C26=\"\",\"SX\",IF($C26=\"F\",VLOOKUP(ROUND($L26,0)/100,Barème500,3),VLOOKUP(ROUND($L26,0)/100,Barème500,2))),\"\")","v":""},{"$f":"IF(OR(K26=\"\",K26=\"\",AH26=\"\",AG26=\"\",AF26=\"\"),\"\",IF(OR(K26<0,K26>2),\"Err ech.\",SUM(K26,AH26,AG26,AF26)))","v":""},null,null,null,null,null,{"$f":"IF(C26<>\"f\",\"m\",\"f\")","v":"m"}]
[null,null,null,null,null,null,null,null,null,null,null,{"$f":"IF(AND(R27<>\"\",Q27<>\"\",P27<>\"\"),(INT(((INT($P27)*60)+(($P27-INT($P27))*100)+(INT($Q27)*60)+(($Q27-INT($Q27))*100)+(INT($R27)*60)+(($R27-INT($R27))*100))/60)+MOD(((INT($P27)*60)+(($P27-INT($P27))*100)+(INT($Q27)*60)+(($Q27-INT($Q27))*100)+(INT($R27)*60)+(($R27-INT($R27))*100)),60)/100)*100,\"\")","v":""},{"$f":"IF(OR(O27=\"\",P27=\"\"),\"\",ABS((INT(P27)*60)+((P27-INT(P27))*100)-((INT(O27)*60)+((O27-INT(O27))*100))))","v":""},{"$f":"IF(AND(E27=\"\",H27=\"\"),\"\",IF(H27=\"\",E27,H27))","v":""},{"$f":"IF(F27=\"\",\"\",F27/100)","v":""},{"$f":"IF(G27=\"\",\"\",G27/100)","v":""},{"$f":"IF(I27=\"\",\"\",I27/100)","v":""},{"$f":"IF(J27=\"\",\"\",J27/100)","v":""},{"$f":"ROUND((INT(Q27)*60)+((Q27-INT(Q27))*100)-((INT(P27)*60)+((P27-INT(P27))*100)),0)","v":{"$error":"#VALUE!"}},{"$f":"ROUND((INT(R27)*60)+((R27-INT(R27))*100)-((INT(Q27)*60)+((Q27-INT(Q27))*100)),0)","v":{"$error":"#VALUE!"}},{"$f":"ROUND((INT(R27)*60)+((R27-INT(R27))*100)-((INT(P27)*60)+((P27-INT(P27))*100)),0)","v":{"$error":"#VALUE!"}},{"$f":"IF(AND(Q27<>0,P27<>0),IF(OR(N27=1,N27=3,N27=4),IF(OR(S27=0,ABS(S27)<='Barèmes & Options'!H$2),1,0)),\"\")","v":false},{"$f":"IF(AND(Q27<>\"\",P27<>\"\"),IF(OR(N27=5,N27=7),IF(S27>0,1,0)),\"\")","v":""},{"$f":"IF(AND(Q27<>\"\",P27<>\"\"),IF(OR(N27=2,N27=6,N27=8),IF(S27<0,1,0)),\"\")","v":""},{"$f":"IF(AND(Q27<>0,R27<>0),IF(OR(N27=1,N27=5,N27=6),IF(OR(T27=0,ABS(T27)<='Barèmes & Options'!H$2),1,0)),\"\")","v":false},{"$f":"IF(AND(Q27<>\"\",R27<>\"\"),IF(OR(N27=4,N27=8),IF(T27>0,1,0)),\"\")","v":""},{"$f":"IF(AND(Q27<>\"\",R27<>\"\"),IF(OR(N27=2,N27=3,N27=7),IF(T27<0,1,0)),\"\")","v":""},{"$f":"IF(SUM(V27:AA27)=2,IF(N27=2,IF(N27=2,IF(U27-'Barèmes & Options'!H$2<-1,0,1)),\"\"),0)","v":0},{"$f":"IF(OR(N27=2,N27=9),SUM(V27:AA27)-AB27,SUM(V27:AA27))","v":0},{"$f":"IF(OR(V27=1,W27=1,X27=1),TRUE,FALSE)","v":false},{"$f":"IF(OR(Y27=1,Z27=1,AA27=1),TRUE,FALSE)","v":false},{"$f":"IF(N27<>\"\",IF(AND(N27>=1,N27<=8,N27=ABS(N27)),IF(AND(N27<=9,N27>=1),IF(AND(AC27=1,H27<>\"\"),1,IF(AND(AC27=1,H27=\"\"),1.5,IF(AND(AC27=2,H27<>\"\"),2,IF(AND(AC27=2,H27=\"\"),3,0)))),\"\"),\"Err. Profil\"),\"\")","v":""},{"$f":"IF(O27<>\"\",IF(ROUND(M27,0)<=3,1,0),\"\")","v":""},{"$f":"IF(AND(R27<>\"\",Q27<>\"\",P27<>\"\"),IF($C27=\"\",\"SX\",IF($C27=\"F\",VLOOKUP(ROUND($L27,0)/100,Barème500,3),VLOOKUP(ROUND($L27,0)/100,Barème500,2))),\"\")","v":""},{"$f":"IF(OR(K27=\"\",K27=\"\",AH27=\"\",AG27=\"\",AF27=\"\"),\"\",IF(OR(K27<0,K27>2),\"Err ech.\",SUM(K27,AH27,AG27,AF27)))","v":""},null,null,null,null,null,{"$f":"IF(C27<>\"f\",\"m\",\"f\")","v":"m"}]
[null,null,null,null,null,null,null,null,null,null,null,{"$f":"IF(AND(R28<>\"\",Q28<>\"\",P28<>\"\"),(INT(((INT($P28)*60)+(($P28-INT($P28))*100)+(INT($Q28)*60)+(($Q28-INT($Q28))*100)+(INT($R28)*60)+(($R28-INT($R28))*100))/60)+MOD(((INT($P28)*60)+(($P28-INT($P28))*100)+(INT($Q28)*60)+(($Q28-INT($Q28))*100)+(INT($R28)*60)+(($R28-INT($R28))*100)),60)/100)*100,\"\")","v":""},{"$f":"IF(OR(O28=\"\",P28=\"\"),\"\",ABS((INT(P28)*60)+((P28-INT(P28))*100)-((INT(O28)*60)+((O28-INT(O28))*100))))","v":""},{"$f":"IF(AND(E28=\"\",H28=\"\"),\"\",IF(H28=\"\",E28,H28))","v":""},{"$f":"IF(F28=\"\",\"\",F28/100)","v":""},{"$f":"IF(G28=\"\",\"\",G28/100)","v":""},{"$f":"IF(I28=\"\",\"\",I28/100)","v":""},{"$f":"IF(J28=\"\",\"\",J28/100)","v":""},{"$f":"ROUND((INT(Q28)*60)+((Q28-INT(Q28))*100)-((INT(P28)*60)+((P28-INT(P28))*100)),0)","v":{"$error":"#VALUE!"}},{"$f":"ROUND((INT(R28)*60)+((R28-INT(R28))*100)-((INT(Q28)*60)+((Q28-INT(Q28))*100)),0)","v":{"$error":"#VALUE!"}},{"$f":"ROUND((INT(R28)*60)+((R28-INT(R28))*100)-((INT(P28)*60)+((P28-INT(P28))*100)),0)","v":{"$error":"#VALUE!"}},{"$f":"IF(AND(Q28<>0,P28<>0),IF(OR(N28=1,N28=3,N28=4),IF(OR(S28=0,ABS(S28)<='Barèmes & Options'!H$2),1,0)),\"\")","v":false},{"$f":"IF(AND(Q28<>\"\",P28<>\"\"),IF(OR(N28=5,N28=7),IF(S28>0,1,0)),\"\")","v":""},{"$f":"IF(AND(Q28<>\"\",P28<>\"\"),IF(OR(N28=2,N28=6,N28=8),IF(S28<0,1,0)),\"\")","v":""},{"$f":"IF(AND(Q28<>0,R28<>0),IF(OR(N28=1,N28=5,N28=6),IF(OR(T28=0,ABS(T28)<='Barèmes & Options'!H$2),1,0)),\"\")","v":false},{"$f":"IF(AND(Q28<>\"\",R28<>\"\"),IF(OR(N28=4,N28=8),IF(T28>0,1,0)),\"\")","v":""},{"$f":"IF(AND(Q28<>\"\",R28<>\"\"),IF(OR(N28=2,N28=3,N28=7),IF(T28<0,1,0)),\"\")","v":""},{"$f":"IF(SUM(V28:AA28)=2,IF(N28=2,IF(N28=2,IF(U28-'Barèmes & Options'!H$2<-1,0,1)),\"\"),0)","v":0},{"$f":"IF(OR(N28=2,N28=9),SUM(V28:AA28)-AB28,SUM(V28:AA28))","v":0},{"$f":"IF(OR(V28=1,W28=1,X28=1),TRUE,FALSE)","v":false},{"$f":"IF(OR(Y28=1,Z28=1,AA28=1),TRUE,FALSE)","v":false},{"$f":"IF(N28<>\"\",IF(AND(N28>=1,N28<=8,N28=ABS(N28)),IF(AND(N28<=9,N28>=1),IF(AND(AC28=1,H28<>\"\"),1,IF(AND(AC28=1,H28=\"\"),1.5,IF(AND(AC28=2,H28<>\"\"),2,IF(AND(AC28=2,H28=\"\"),3,0)))),\"\"),\"Err. Profil\"),\"\")","v":""},{"$f":"IF(O28<>\"\",IF(ROUND(M28,0)<=3,1,0),\"\")","v":""},{"$f":"IF(AND(R28<>\"\",Q28<>\"\",P28<>\"\"),IF($C28=\"\",\"SX\",IF($C28=\"F\",VLOOKUP(ROUND($L28,0)/100,Barème500,3),VLOOKUP(ROUND($L28,0)/100,Barème500,2))),\"\")","v":""},{"$f":"IF(OR(K28=\"\",K28=\"\",AH28=\"\",AG28=\"\",AF28=\"\"),\"\",IF(OR(K28<0,K28>2),\"Err ech.\",SUM(K28,AH28,AG28,AF28)))","v":""},null,null,null,null,null,{"$f":"IF(C28<>\"f\",\"m\",\"f\")","v":"m"}]
[null,null,null,null,null,null,null,null,null,null,null,{"$f":"IF(AND(R29<>\"\",Q29<>\"\",P29<>\"\"),(INT(((INT($P29)*60)+(($P29-INT($P29))*100)+(INT($Q29)*60)+(($Q29-INT($Q29))*100)+(INT($R29)*60)+(($R29-INT($R29))*100))/60)+MOD(((INT($P29)*60)+(($P29-INT($P29))*100)+(INT($Q29)*60)+(($Q29-INT($Q29))*100)+(INT($R29)*60)+(($R29-INT($R29))*100)),60)/100)*100,\"\")","v":""},{"$f":"IF(OR(O29=\"\",P29=\"\"),\"\",ABS((INT(P29)*60)+((P29-INT(P29))*100)-((INT(O29)*60)+((O29-INT(O29))*100))))","v":""},{"$f":"IF(AND(E29=\"\",H29=\"\"),\"\",IF(H29=\"\",E29,H29))","v":""},{"$f":"IF(F29=\"\",\"\",F29/100)","v":""},{"$f":"IF(G29=\"\",\"\",G29/100)","v":""},{"$f":"IF(I29=\"\",\"\",I29/100)","v":""},{"$f":"IF(J29=\"\",\"\",J29/100)","v":""},{"$f":"ROUND((INT(Q29)*60)+((Q29-INT(Q29))*100)-((INT(P29)*60)+((P29-INT(P29))*100)),0)","v":{"$error":"#VALUE!"}},{"$f":"ROUND((INT(R29)*60)+((R29-INT(R29))*100)-((INT(Q29)*60)+((Q29-INT(Q29))*100)),0)","v":{"$error":"#VALUE!"}},{"$f":"ROUND((INT(R29)*60)+((R29-INT(R29))*100)-((INT(P29)*60)+((P29-INT(P29))*100)),0)","v":{"$error":"#VALUE!"}},{"$f":"IF(AND(Q29<>0,P29<>0),IF(OR(N29=1,N29=3,N29=4),IF(OR(S29=0,ABS(S29)<='Barèmes & Options'!H$2),1,0)),\"\")","v":false},{"$f":"IF(AND(Q29<>\"\",P29<>\"\"),IF(OR(N29=5,N29=7),IF(S29>0,1,0)),\"\")","v":""},{"$f":"IF(AND(Q29<>\"\",P29<>\"\"),IF(OR(N29=2,N29=6,N29=8),IF(S29<0,1,0)),\"\")","v":""},{"$f":"IF(AND(Q29<>0,R29<>0),IF(OR(N29=1,N29=5,N29=6),IF(OR(T29=0,ABS(T29)<='Barèmes & Options'!H$2),1,0)),\"\")","v":false},{"$f":"IF(AND(Q29<>\"\",R29<>\"\"),IF(OR(N29=4,N29=8),IF(T29>0,1,0)),\"\")","v":""},{"$f":"IF(AND(Q29<>\"\",R29<>\"\"),IF(OR(N29=2,N29=3,N29=7),IF(T29<0,1,0)),\"\")","v":""},{"$f":"IF(SUM(V29:AA29)=2,IF(N29=2,IF(N29=2,IF(U29-'Barèmes & Options'!H$2<-1,0,1)),\"\"),0)","v":0},{"$f":"IF(OR(N29=2,N29=9),SUM(V29:AA29)-AB29,SUM(V29:AA29))","v":0},{"$f":"IF(OR(V29=1,W29=1,X29=1),TRUE,FALSE)","v":false},{"$f":"IF(OR(Y29=1,Z29=1,AA29=1),TRUE,FALSE)","v":false},{"$f":"IF(N29<>\"\",IF(AND(N29>=1,N29<=8,N29=ABS(N29)),IF(AND(N29<=9,N29>=1),IF(AND(AC29=1,H29<>\"\"),1,IF(AND(AC29=1,H29=\"\"),1.5,IF(AND(AC29=2,H29<>\"\"),2,IF(AND(AC29=2,H29=\"\"),3,0)))),\"\"),\"Err. Profil\"),\"\")","v":""},{"$f":"IF(O29<>\"\",IF(ROUND(M29,0)<=3,1,0),\"\")","v":""},{"$f":"IF(AND(R29<>\"\",Q29<>\"\",P29<>\"\"),IF($C29=\"\",\"SX\",IF($C29=\"F\",VLOOKUP(ROUND($L29,0)/100,Barème500,3),VLOOKUP(ROUND($L29,0)/100,Barème500,2))),\"\")","v":""},{"$f":"IF(OR(K29=\"\",K29=\"\",AH29=\"\",AG29=\"\",AF29=\"\"),\"\",IF(OR(K29<0,K29>2),\"Err ech.\",SUM(K29,AH29,AG29,AF29)))","v":""},null,null,null,null,null,{"$f":"IF(C29<>\"f\",\"m\",\"f\")","v":"m"}]
[null,null,null,null,null,null,null,null,null,null,null,{"$f":"IF(AND(R30<>\"\",Q30<>\"\",P30<>\"\"),(INT(((INT($P30)*60)+(($P30-INT($P30))*100)+(INT($Q30)*60)+(($Q30-INT($Q30))*100)+(INT($R30)*60)+(($R30-INT($R30))*100))/60)+MOD(((INT($P30)*60)+(($P30-INT($P30))*100)+(INT($Q30)*60)+(($Q30-INT($Q30))*100)+(INT($R30)*60)+(($R30-INT($R30))*100)),60)/100)*100,\"\")","v":""},{"$f":"IF(OR(O30=\"\",P30=\"\"),\"\",ABS((INT(P30)*60)+((P30-INT(P30))*100)-((INT(O30)*60)+((O30-INT(O30))*100))))","v":""},{"$f":"IF(AND(E30=\"\",H30=\"\"),\"\",IF(H30=\"\",E30,H30))","v":""},{"$f":"IF(F30=\"\",\"\",F30/100)","v":""},{"$f":"IF(G30=\"\",\"\",G30/100)","v":""},{"$f":"IF(I30=\"\",\"\",I30/100)","v":""},{"$f":"IF(J30=\"\",\"\",J30/100)","v":""},{"$f":"ROUND((INT(Q30)*60)+((Q30-INT(Q30))*100)-((INT(P30)*60)+((P30-INT(P30))*100)),0)","v":{"$error":"#VALUE!"}},{"$f":"ROUND((INT(R30)*60)+((R30-INT(R30))*100)-((INT(Q30)*60)+((Q30-INT(Q30))*100)),0)","v":{"$error":"#VALUE!"}},{"$f":"ROUND((INT(R30)*60)+((R30-INT(R30))*100)-((INT(P30)*60)+((P30-INT(P30))*100)),0)","v":{"$error":"#VALUE!"}},{"$f":"IF(AND(Q30<>0,P30<>0),IF(OR(N30=1,N30=3,N30=4),IF(OR(S30=0,ABS(S30)<='Barèmes & Options'!H$2),1,0)),\"\")","v":false},{"$f":"IF(AND(Q30<>\"\",P30<>\"\"),IF(OR(N30=5,N30=7),IF(S30>0,1,0)),\"\")","v":""},{"$f":"IF(AND(Q30<>\"\",P30<>\"\"),IF(OR(N30=2,N30=6,N30=8),IF(S30<0,1,0)),\"\")","v":""},{"$f":"IF(AND(Q30<>0,R30<>0),IF(OR(N30=1,N30=5,N30=6),IF(OR(T30=0,ABS(T30)<='Barèmes & Options'!H$2),1,0)),\"\")","v":false},{"$f":"IF(AND(Q30<>\"\",R30<>\"\"),IF(OR(N30=4,N30=8),IF(T30>0,1,0)),\"\")","v":""},{"$f":"IF(AND(Q30<>\"\",R30<>\"\"),IF(OR(N30=2,N30=3,N30=7),IF(T30<0,1,0)),\"\")","v":""},{"$f":"IF(SUM(V30:AA30)=2,IF(N30=2,IF(N30=2,IF(U30-'Barèmes & Options'!H$2<-1,0,1)),\"\"),0)","v":0},{"$f":"IF(OR(N30=2,N30=9),SUM(V30:AA30)-AB30,SUM(V30:AA30))","v":0},{"$f":"IF(OR(V30=1,W30=1,X30=1),TRUE,FALSE)","v":false},{"$f":"IF(OR(Y30=1,Z30=1,AA30=1),TRUE,FALSE)","v":false},{"$f":"IF(N30<>\"\",IF(AND(N30>=1,N30<=8,N30=ABS(N30)),IF(AND(N30<=9,N30>=1),IF(AND(AC30=1,H30<>\"\"),1,IF(AND(AC30=1,H30=\"\"),1.5,IF(AND(AC30=2,H30<>\"\"),2,IF(AND(AC30=2,H30=\"\"),3,0)))),\"\"),\"Err. Profil\"),\"\")","v":""},{"$f":"IF(O30<>\"\",IF(ROUND(M30,0)<=3,1,0),\"\")","v":""},{"$f":"IF(AND(R30<>\"\",Q30<>\"\",P30<>\"\"),IF($C30=\"\",\"SX\",IF($C30=\"F\",VLOOKUP(ROUND($L30,0)/100,Barème500,3),VLOOKUP(ROUND($L30,0)/100,Barème500,2))),\"\")","v":""},{"$f":"IF(OR(K30=\"\",K30=\"\",AH30=\"\",AG30=\"\",AF30=\"\"),\"\",IF(OR(K30<0,K30>2),\"Err ech.\",SUM(K30,AH30,AG30,AF30)))","v":""},null,null,null,null,null,{"$f":"IF(C30<>\"f\",\"m\",\"f\")","v":"m"}]
[null,null,null,null,null,null,null,null,null,null,null,{"$f":"IF(AND(R31<>\"\",Q31<>\"\",P31<>\"\"),(INT(((INT($P31)*60)+(($P31-INT($P31))*100)+(INT($Q31)*60)+(($Q31-INT($Q31))*100)+(INT($R31)*60)+(($R31-INT($R31))*100))/60)+MOD(((INT($P31)*60)+(($P31-INT($P31))*100)+(INT($Q31)*60)+(($Q31-INT($Q31))*100)+(INT($R31)*60)+(($R31-INT($R31))*100)),60)/100)*100,\"\")","v":""},{"$f":"IF(OR(O31=\"\",P31=\"\"),\"\",ABS((INT(P31)*60)+((P31-INT(P31))*100)-((INT(O31)*60)+((O31-INT(O31))*100))))","v":""},{"$f":"IF(AND(E31=\"\",H31=\"\"),\"\",IF(H31=\"\",E31,H31))","v":""},{"$f":"IF(F31=\"\",\"\",F31/100)","v":""},{"$f":"IF(G31=\"\",\"\",G31/100)","v":""},{"$f":"IF(I31=\"\",\"\",I31/100)","v":""},{"$f":"IF(J31=\"\",\"\",J31/100)","v":""},{"$f":"ROUND((INT(Q31)*60)+((Q31-INT(Q31))*100)-((INT(P31)*60)+((P31-INT(P31))*100)),0)","v":{"$error":"#VALUE!"}},{"$f":"ROUND((INT(R31)*60)+((R31-INT(R31))*100)-((INT(Q31)*60)+((Q31-INT(Q31))*100)),0)","v":{"$error":"#VALUE!"}},{"$f":"ROUND((INT(R31)*60)+((R31-INT(R31))*100)-((INT(P31)*60)+((P31-INT(P31))*100)),0)","v":{"$error":"#VALUE!"}},{"$f":"IF(AND(Q31<>0,P31<>0),IF(OR(N31=1,N31=3,N31=4),IF(OR(S31=0,ABS(S31)<='Barèmes & Options'!H$2),1,0)),\"\")","v":false},{"$f":"IF(AND(Q31<>\"\",P31<>\"\"),IF(OR(N31=5,N31=7),IF(S31>0,1,0)),\"\")","v":""},{"$f":"IF(AND(Q31<>\"\",P31<>\"\"),IF(OR(N31=2,N31=6,N31=8),IF(S31<0,1,0)),\"\")","v":""},{"$f":"IF(AND(Q31<>0,R31<>0),IF(OR(N31=1,N31=5,N31=6),IF(OR(T31=0,ABS(T31)<='Barèmes & Options'!H$2),1,0)),\"\")","v":false},{"$f":"IF(AND(Q31<>\"\",R31<>\"\"),IF(OR(N31=4,N31=8),IF(T31>0,1,0)),\"\")","v":""},{"$f":"IF(AND(Q31<>\"\",R31<>\"\"),IF(OR(N31=2,N31=3,N31=7),IF(T31<0,1,0)),\"\")","v":""},{"$f":"IF(SUM(V31:AA31)=2,IF(N31=2,IF(N31=2,IF(U31-'Barèmes & Options'!H$2<-1,0,1)),\"\"),0)","v":0},{"$f":"IF(OR(N31=2,N31=9),SUM(V31:AA31)-AB31,SUM(V31:AA31))","v":0},{"$f":"IF(OR(V31=1,W31=1,X31=1),TRUE,FALSE)","v":false},{"$f":"IF(OR(Y31=1,Z31=1,AA31=1),TRUE,FALSE)","v":false},{"$f":"IF(N31<>\"\",IF(AND(N31>=1,N31<=8,N31=ABS(N31)),IF(AND(N31<=9,N31>=1),IF(AND(AC31=1,H31<>\"\"),1,IF(AND(AC31=1,H31=\"\"),1.5,IF(AND(AC31=2,H31<>\"\"),2,IF(AND(AC31=2,H31=\"\"),3,0)))),\"\"),\"Err. Profil\"),\"\")","v":""},{"$f":"IF(O31<>\"\",IF(ROUND(M31,0)<=3,1,0),\"\")","v":""},{"$f":"IF(AND(R31<>\"\",Q31<>\"\",P31<>\"\"),IF($C31=\"\",\"SX\",IF($C31=\"F\",VLOOKUP(ROUND($L31,0)/100,Barème500,3),VLOOKUP(ROUND($L31,0)/100,Barème500,2))),\"\")","v":""},{"$f":"IF(OR(K31=\"\",K31=\"\",AH31=\"\",AG31=\"\",AF31=\"\"),\"\",IF(OR(K31<0,K31>2),\"Err ech.\",SUM(K31,AH31,AG31,AF31)))","v":""},null,null,null,null,null,{"$f":"IF(C31<>\"f\",\"m\",\"f\")","v":"m"}]
[null,null,null,null,null,null,null,null,null,null,null,{"$f":"IF(AND(R32<>\"\",Q32<>\"\",P32<>\"\"),(INT(((INT($P32)*60)+(($P32-INT($P32))*100)+(INT($Q32)*60)+(($Q32-INT($Q32))*100)+(INT($R32)*60)+(($R32-INT($R32))*100))/60)+MOD(((INT($P32)*60)+(($P32-INT($P32))*100)+(INT($Q32)*60)+(($Q32-INT($Q32))*100)+(INT($R32)*60)+(($R32-INT($R32))*100)),60)/100)*100,\"\")","v":""},{"$f":"IF(OR(O32=\"\",P32=\"\"),\"\",ABS((INT(P32)*60)+((P32-INT(P32))*100)-((INT(O32)*60)+((O32-INT(O32))*100))))","v":""},{"$f":"IF(AND(E32=\"\",H32=\"\"),\"\",IF(H32=\"\",E32,H32))","v":""},{"$f":"IF(F32=\"\",\"\",F32/100)","v":""},{"$f":"IF(G32=\"\",\"\",G32/100)","v":""},{"$f":"IF(I32=\"\",\"\",I32/100)","v":""},{"$f":"IF(J32=\"\",\"\",J32/100)","v":""},{"$f":"ROUND((INT(Q32)*60)+((Q32-INT(Q32))*100)-((INT(P32)*60)+((P32-INT(P32))*100)),0)","v":{"$error":"#VALUE!"}},{"$f":"ROUND((INT(R32)*60)+((R32-INT(R32))*100)-((INT(Q32)*60)+((Q32-INT(Q32))*100)),0)","v":{"$error":"#VALUE!"}},{"$f":"ROUND((INT(R32)*60)+((R32-INT(R32))*100)-((INT(P32)*60)+((P32-INT(P32))*100)),0)","v":{"$error":"#VALUE!"}},{"$f":"IF(AND(Q32<>0,P32<>0),IF(OR(N32=1,N32=3,N32=4),IF(OR(S32=0,ABS(S32)<='Barèmes & Options'!H$2),1,0)),\"\")","v":false},{"$f":"IF(AND(Q32<>\"\",P32<>\"\"),IF(OR(N32=5,N32=7),IF(S32>0,1,0)),\"\")","v":""},{"$f":"IF(AND(Q32<>\"\",P32<>\"\"),IF(OR(N32=2,N32=6,N32=8),IF(S32<0,1,0)),\"\")","v":""},{"$f":"IF(AND(Q32<>0,R32<>0),IF(OR(N32=1,N32=5,N32=6),IF(OR(T32=0,ABS(T32)<='Barèmes & Options'!H$2),1,0)),\"\")","v":false},{"$f":"IF(AND(Q32<>\"\",R32<>\"\"),IF(OR(N32=4,N32=8),IF(T32>0,1,0)),\"\")","v":""},{"$f":"IF(AND(Q32<>\"\",R32<>\"\"),IF(OR(N32=2,N32=3,N32=7),IF(T32<0,1,0)),\"\")","v":""},{"$f":"IF(SUM(V32:AA32)=2,IF(N32=2,IF(N32=2,IF(U32-'Barèmes & Options'!H$2<-1,0,1)),\"\"),0)","v":0},{"$f":"IF(OR(N32=2,N32=9),SUM(V32:AA32)-AB32,SUM(V32:AA32))","v":0},{"$f":"IF(OR(V32=1,W32=1,X32=1),TRUE,FALSE)","v":false},{"$f":"IF(OR(Y32=1,Z32=1,AA32=1),TRUE,FALSE)","v":false},{"$f":"IF(N32<>\"\",IF(AND(N32>=1,N32<=8,N32=ABS(N32)),IF(AND(N32<=9,N32>=1),IF(AND(AC32=1,H32<>\"\"),1,IF(AND(AC32=1,H32=\"\"),1.5,IF(AND(AC32=2,H32<>\"\"),2,IF(AND(AC32=2,H32=\"\"),3,0)))),\"\"),\"Err. Profil\"),\"\")","v":""},{"$f":"IF(O32<>\"\",IF(ROUND(M32,0)<=3,1,0),\"\")","v":""},{"$f":"IF(AND(R32<>\"\",Q32<>\"\",P32<>\"\"),IF($C32=\"\",\"SX\",IF($C32=\"F\",VLOOKUP(ROUND($L32,0)/100,Barème500,3),VLOOKUP(ROUND($L32,0)/100,Barème500,2))),\"\")","v":""},{"$f":"IF(OR(K32=\"\",K32=\"\",AH32=\"\",AG32=\"\",AF32=\"\"),\"\",IF(OR(K32<0,K32>2),\"Err ech.\",SUM(K32,AH32,AG32,AF32)))","v":""},null,null,null,null,null,{"$f":"IF(C32<>\"f\",\"m\",\"f\")","v":"m"}]
[null,null,null,null,null,null,null,null,null,null,null,{"$f":"IF(AND(R33<>\"\",Q33<>\"\",P33<>\"\"),(INT(((INT($P33)*60)+(($P33-INT($P33))*100)+(INT($Q33)*60)+(($Q33-INT($Q33))*100)+(INT($R33)*60)+(($R33-INT($R33))*100))/60)+MOD(((INT($P33)*60)+(($P33-INT($P33))*100)+(INT($Q33)*60)+(($Q33-INT($Q33))*100)+(INT($R33)*60)+(($R33-INT($R33))*100)),60)/100)*100,\"\")","v":""},{"$f":"IF(OR(O33=\"\",P33=\"\"),\"\",ABS((INT(P33)*60)+((P33-INT(P33))*100)-((INT(O33)*60)+((O33-INT(O33))*100))))","v":""},{"$f":"IF(AND(E33=\"\",H33=\"\"),\"\",IF(H33=\"\",E33,H33))","v":""},{"$f":"IF(F33=\"\",\"\",F33/100)","v":""},{"$f":"IF(G33=\"\",\"\",G33/100)","v":""},{"$f":"IF(I33=\"\",\"\",I33/100)","v":""},{"$f":"IF(J33=\"\",\"\",J33/100)","v":""},{"$f":"ROUND((INT(Q33)*60)+((Q33-INT(Q33))*100)-((INT(P33)*60)+((P33-INT(P33))*100)),0)","v":{"$error":"#VALUE!"}},{"$f":"ROUND((INT(R33)*60)+((R33-INT(R33))*100)-((INT(Q33)*60)+((Q33-INT(Q33))*100)),0)","v":{"$error":"#VALUE!"}},{"$f":"ROUND((INT(R33)*60)+((R33-INT(R33))*100)-((INT(P33)*60)+((P33-INT(P33))*100)),0)","v":{"$error":"#VALUE!"}},{"$f":"IF(AND(Q33<>0,P33<>0),IF(OR(N33=1,N33=3,N33=4),IF(OR(S33=0,ABS(S33)<='Barèmes & Options'!H$2),1,0)),\"\")","v":false},{"$f":"IF(AND(Q33<>\"\",P33<>\"\"),IF(OR(N33=5,N33=7),IF(S33>0,1,0)),\"\")","v":""},{"$f":"IF(AND(Q33<>\"\",P33<>\"\"),IF(OR(N33=2,N33=6,N33=8),IF(S33<0,1,0)),\"\")","v":""},{"$f":"IF(AND(Q33<>0,R33<>0),IF(OR(N33=1,N33=5,N33=6),IF(OR(T33=0,ABS(T33)<='Barèmes & Options'!H$2),1,0)),\"\")","v":false},{"$f":"IF(AND(Q33<>\"\",R33<>\"\"),IF(OR(N33=4,N33=8),IF(T33>0,1,0)),\"\")","v":""},{"$f":"IF(AND(Q33<>\"\",R33<>\"\"),IF(OR(N33=2,N33=3,N33=7),IF(T33<0,1,0)),\"\")","v":""},{"$f":"IF(SUM(V33:AA33)=2,IF(N33=2,IF(N33=2,IF(U33-'Barèmes & Options'!H$2<-1,0,1)),\"\"),0)","v":0},{"$f":"IF(OR(N33=2,N33=9),SUM(V33:AA33)-AB33,SUM(V33:AA33))","v":0},{"$f":"IF(OR(V33=1,W33=1,X33=1),TRUE,FALSE)","v":false},{"$f":"IF(OR(Y33=1,Z33=1,AA33=1),TRUE,FALSE)","v":false},{"$f":"IF(N33<>\"\",IF(AND(N33>=1,N33<=8,N33=ABS(N33)),IF(AND(N33<=9,N33>=1),IF(AND(AC33=1,H33<>\"\"),1,IF(AND(AC33=1,H33=\"\"),1.5,IF(AND(AC33=2,H33<>\"\"),2,IF(AND(AC33=2,H33=\"\"),3,0)))),\"\"),\"Err. Profil\"),\"\")","v":""},{"$f":"IF(O33<>\"\",IF(ROUND(M33,0)<=3,1,0),\"\")","v":""},{"$f":"IF(AND(R33<>\"\",Q33<>\"\",P33<>\"\"),IF($C33=\"\",\"SX\",IF($C33=\"F\",VLOOKUP(ROUND($L33,0)/100,Barème500,3),VLOOKUP(ROUND($L33,0)/100,Barème500,2))),\"\")","v":""},{"$f":"IF(OR(K33=\"\",K33=\"\",AH33=\"\",AG33=\"\",AF33=\"\"),\"\",IF(OR(K33<0,K33>2),\"Err ech.\",SUM(K33,AH33,AG33,AF33)))","v":""},null,null,null,null,null,{"$f":"IF(C33<>\"f\",\"m\",\"f\")","v":"m"}]
[null,null,null,null,null,null,null,null,null,null,null,{"$f":"IF(AND(R34<>\"\",Q34<>\"\",P34<>\"\"),(INT(((INT($P34)*60)+(($P34-INT($P34))*100)+(INT($Q34)*60)+(($Q34-INT($Q34))*100)+(INT($R34)*60)+(($R34-INT($R34))*100))/60)+MOD(((INT($P34)*60)+(($P34-INT($P34))*100)+(INT($Q34)*60)+(($Q34-INT($Q34))*100)+(INT($R34)*60)+(($R34-INT($R34))*100)),60)/100)*100,\"\")","v":""},{"$f":"IF(OR(O34=\"\",P34=\"\"),\"\",ABS((INT(P34)*60)+((P34-INT(P34))*100)-((INT(O34)*60)+((O34-INT(O34))*100))))","v":""},{"$f":"IF(AND(E34=\"\",H34=\"\"),\"\",IF(H34=\"\",E34,H34))","v":""},{"$f":"IF(F34=\"\",\"\",F34/100)","v":""},{"$f":"IF(G34=\"\",\"\",G34/100)","v":""},{"$f":"IF(I34=\"\",\"\",I34/100)","v":""},{"$f":"IF(J34=\"\",\"\",J34/100)","v":""},{"$f":"ROUND((INT(Q34)*60)+((Q34-INT(Q34))*100)-((INT(P34)*60)+((P34-INT(P34))*100)),0)","v":{"$error":"#VALUE!"}},{"$f":"ROUND((INT(R34)*60)+((R34-INT(R34))*100)-((INT(Q34)*60)+((Q34-INT(Q34))*100)),0)","v":{"$error":"#VALUE!"}},{"$f":"ROUND((INT(R34)*60)+((R34-INT(R34))*100)-((INT(P34)*60)+((P34-INT(P34))*100)),0)","v":{"$error":"#VALUE!"}},{"$f":"IF(AND(Q34<>0,P34<>0),IF(OR(N34=1,N34=3,N34=4),IF(OR(S34=0,ABS(S34)<='Barèmes & Options'!H$2),1,0)),\"\")","v":false},{"$f":"IF(AND(Q34<>\"\",P34<>\"\"),IF(OR(N34=5,N34=7),IF(S34>0,1,0)),\"\")","v":""},{"$f":"IF(AND(Q34<>\"\",P34<>\"\"),IF(OR(N34=2,N34=6,N34=8),IF(S34<0,1,0)),\"\")","v":""},{"$f":"IF(AND(Q34<>0,R34<>0),IF(OR(N34=1,N34=5,N34=6),IF(OR(T34=0,ABS(T34)<='Barèmes & Options'!H$2),1,0)),\"\")","v":false},{"$f":"IF(AND(Q34<>\"\",R34<>\"\"),IF(OR(N34=4,N34=8),IF(T34>0,1,0)),\"\")","v":""},{"$f":"IF(AND(Q34<>\"\",R34<>\"\"),IF(OR(N34=2,N34=3,N34=7),IF(T34<0,1,0)),\"\")","v":""},{"$f":"IF(SUM(V34:AA34)=2,IF(N34=2,IF(N34=2,IF(U34-'Barèmes & Options'!H$2<-1,0,1)),\"\"),0)","v":0},{"$f":"IF(OR(N34=2,N34=9),SUM(V34:AA34)-AB34,SUM(V34:AA34))","v":0},{"$f":"IF(OR(V34=1,W34=1,X34=1),TRUE,FALSE)","v":false},{"$f":"IF(OR(Y34=1,Z34=1,AA34=1),TRUE,FALSE)","v":false},{"$f":"IF(N34<>\"\",IF(AND(N34>=1,N34<=8,N34=ABS(N34)),IF(AND(N34<=9,N34>=1),IF(AND(AC34=1,H34<>\"\"),1,IF(AND(AC34=1,H34=\"\"),1.5,IF(AND(AC34=2,H34<>\"\"),2,IF(AND(AC34=2,H34=\"\"),3,0)))),\"\"),\"Err. Profil\"),\"\")","v":""},{"$f":"IF(O34<>\"\",IF(ROUND(M34,0)<=3,1,0),\"\")","v":""},{"$f":"IF(AND(R34<>\"\",Q34<>\"\",P34<>\"\"),IF($C34=\"\",\"SX\",IF($C34=\"F\",VLOOKUP(ROUND($L34,0)/100,Barème500,3),VLOOKUP(ROUND($L34,0)/100,Barème500,2))),\"\")","v":""},{"$f":"IF(OR(K34=\"\",K34=\"\",AH34=\"\",AG34=\"\",AF34=\"\"),\"\",IF(OR(K34<0,K34>2),\"Err ech.\",SUM(K34,AH34,AG34,AF34)))","v":""},null,null,null,null,null,{"$f":"IF(C34<>\"f\",\"m\",\"f\")","v":"m"}]
[null,null,null,null,null,null,null,null,null,null,null,{"$f":"IF(AND(R35<>\"\",Q35<>\"\",P35<>\"\"),(INT(((INT($P35)*60)+(($P35-INT($P35))*100)+(INT($Q35)*60)+(($Q35-INT($Q35))*100)+(INT($R35)*60)+(($R35-INT($R35))*100))/60)+MOD(((INT($P35)*60)+(($P35-INT($P35))*100)+(INT($Q35)*60)+(($Q35-INT($Q35))*100)+(INT($R35)*60)+(($R35-INT($R35))*100)),60)/100)*100,\"\")","v":""},{"$f":"IF(OR(O35=\"\",P35=\"\"),\"\",ABS((INT(P35)*60)+((P35-INT(P35))*100)-((INT(O35)*60)+((O35-INT(O35))*100))))","v":""},{"$f":"IF(AND(E35=\"\",H35=\"\"),\"\",IF(H35=\"\",E35,H35))","v":""},{"$f":"IF(F35=\"\",\"\",F35/100)","v":""},{"$f":"IF(G35=\"\",\"\",G35/100)","v":""},{"$f":"IF(I35=\"\",\"\",I35/100)","v":""},{"$f":"IF(J35=\"\",\"\",J35/100)","v":""},{"$f":"ROUND((INT(Q35)*60)+((Q35-INT(Q35))*100)-((INT(P35)*60)+((P35-INT(P35))*100)),0)","v":{"$error":"#VALUE!"}},{"$f":"ROUND((INT(R35)*60)+((R35-INT(R35))*100)-((INT(Q35)*60)+((Q35-INT(Q35))*100)),0)","v":{"$error":"#VALUE!"}},{"$f":"ROUND((INT(R35)*60)+((R35-INT(R35))*100)-((INT(P35)*60)+((P35-INT(P35))*100)),0)","v":{"$error":"#VALUE!"}},{"$f":"IF(AND(Q35<>0,P35<>0),IF(OR(N35=1,N35=3,N35=4),IF(OR(S35=0,ABS(S35)<='Barèmes & Options'!H$2),1,0)),\"\")","v":false},{"$f":"IF(AND(Q35<>\"\",P35<>\"\"),IF(OR(N35=5,N35=7),IF(S35>0,1,0)),\"\")","v":""},{"$f":"IF(AND(Q35<>\"\",P35<>\"\"),IF(OR(N35=2,N35=6,N35=8),IF(S35<0,1,0)),\"\")","v":""},{"$f":"IF(AND(Q35<>0,R35<>0),IF(OR(N35=1,N35=5,N35=6),IF(OR(T35=0,ABS(T35)<='Barèmes & Options'!H$2),1,0)),\"\")","v":false},{"$f":"IF(AND(Q35<>\"\",R35<>\"\"),IF(OR(N35=4,N35=8),IF(T35>0,1,0)),\"\")","v":""},{"$f":"IF(AND(Q35<>\"\",R35<>\"\"),IF(OR(N35=2,N35=3,N35=7),IF(T35<0,1,0)),\"\")","v":""},{"$f":"IF(SUM(V35:AA35)=2,IF(N35=2,IF(N35=2,IF(U35-'Barèmes & Options'!H$2<-1,0,1)),\"\"),0)","v":0},{"$f":"IF(OR(N35=2,N35=9),SUM(V35:AA35)-AB35,SUM(V35:AA35))","v":0},{"$f":"IF(OR(V35=1,W35=1,X35=1),TRUE,FALSE)","v":false},{"$f":"IF(OR(Y35=1,Z35=1,AA35=1),TRUE,FALSE)","v":false},{"$f":"IF(N35<>\"\",IF(AND(N35>=1,N35<=8,N35=ABS(N35)),IF(AND(N35<=9,N35>=1),IF(AND(AC35=1,H35<>\"\"),1,IF(AND(AC35=1,H35=\"\"),1.5,IF(AND(AC35=2,H35<>\"\"),2,IF(AND(AC35=2,H35=\"\"),3,0)))),\"\"),\"Err. Profil\"),\"\")","v":""},{"$f":"IF(O35<>\"\",IF(ROUND(M35,0)<=3,1,0),\"\")","v":""},{"$f":"IF(AND(R35<>\"\",Q35<>\"\",P35<>\"\"),IF($C35=\"\",\"SX\",IF($C35=\"F\",VLOOKUP(ROUND($L35,0)/100,Barème500,3),VLOOKUP(ROUND($L35,0)/100,Barème500,2))),\"\")","v":""},{"$f":"IF(OR(K35=\"\",K35=\"\",AH35=\"\",AG35=\"\",AF35=\"\"),\"\",IF(OR(K35<0,K35>2),\"Err ech.\",SUM(K35,AH35,AG35,AF35)))","v":""},null,null,null,null,null,{"$f":"IF(C35<>\"f\",\"m\",\"f\")","v":"m"}]
[null,null,null,null,null,null,null,null,null,null,null,{"$f":"IF(AND(R36<>\"\",Q36<>\"\",P36<>\"\"),(INT(((INT($P36)*60)+(($P36-INT($P36))*100)+(INT($Q36)*60)+(($Q36-INT($Q36))*100)+(INT($R36)*60)+(($R36-INT($R36))*100))/60)+MOD(((INT($P36)*60)+(($P36-INT($P36))*100)+(INT($Q36)*60)+(($Q36-INT($Q36))*100)+(INT($R36)*60)+(($R36-INT($R36))*100)),60)/100)*100,\"\")","v":""},{"$f":"IF(OR(O36=\"\",P36=\"\"),\"\",ABS((INT(P36)*60)+((P36-INT(P36))*100)-((INT(O36)*60)+((O36-INT(O36))*100))))","v":""},{"$f":"IF(AND(E36=\"\",H36=\"\"),\"\",IF(H36=\"\",E36,H36))","v":""},{"$f":"IF(F36=\"\",\"\",F36/100)","v":""},{"$f":"IF(G36=\"\",\"\",G36/100)","v":""},{"$f":"IF(I36=\"\",\"\",I36/100)","v":""},{"$f":"IF(J36=\"\",\"\",J36/100)","v":""},{"$f":"ROUND((INT(Q36)*60)+((Q36-INT(Q36))*100)-((INT(P36)*60)+((P36-INT(P36))*100)),0)","v":{"$error":"#VALUE!"}},{"$f":"ROUND((INT(R36)*60)+((R36-INT(R36))*100)-((INT(Q36)*60)+((Q36-INT(Q36))*100)),0)","v":{"$error":"#VALUE!"}},{"$f":"ROUND((INT(R36)*60)+((R36-INT(R36))*100)-((INT(P36)*60)+((P36-INT(P36))*100)),0)","v":{"$error":"#VALUE!"}},{"$f":"IF(AND(Q36<>0,P36<>0),IF(OR(N36=1,N36=3,N36=4),IF(OR(S36=0,ABS(S36)<='Barèmes & Options'!H$2),1,0)),\"\")","v":false},{"$f":"IF(AND(Q36<>\"\",P36<>\"\"),IF(OR(N36=5,N36=7),IF(S36>0,1,0)),\"\")","v":""},{"$f":"IF(AND(Q36<>\"\",P36<>\"\"),IF(OR(N36=2,N36=6,N36=8),IF(S36<0,1,0)),\"\")","v":""},{"$f":"IF(AND(Q36<>0,R36<>0),IF(OR(N36=1,N36=5,N36=6),IF(OR(T36=0,ABS(T36)<='Barèmes & Options'!H$2),1,0)),\"\")","v":false},{"$f":"IF(AND(Q36<>\"\",R36<>\"\"),IF(OR(N36=4,N36=8),IF(T36>0,1,0)),\"\")","v":""},{"$f":"IF(AND(Q36<>\"\",R36<>\"\"),IF(OR(N36=2,N36=3,N36=7),IF(T36<0,1,0)),\"\")","v":""},{"$f":"IF(SUM(V36:AA36)=2,IF(N36=2,IF(N36=2,IF(U36-'Barèmes & Options'!H$2<-1,0,1)),\"\"),0)","v":0},{"$f":"IF(OR(N36=2,N36=9),SUM(V36:AA36)-AB36,SUM(V36:AA36))","v":0},{"$f":"IF(OR(V36=1,W36=1,X36=1),TRUE,FALSE)","v":false},{"$f":"IF(OR(Y36=1,Z36=1,AA36=1),TRUE,FALSE)","v":false},{"$f":"IF(N36<>\"\",IF(AND(N36>=1,N36<=8,N36=ABS(N36)),IF(AND(N36<=9,N36>=1),IF(AND(AC36=1,H36<>\"\"),1,IF(AND(AC36=1,H36=\"\"),1.5,IF(AND(AC36=2,H36<>\"\"),2,IF(AND(AC36=2,H36=\"\"),3,0)))),\"\"),\"Err. Profil\"),\"\")","v":""},{"$f":"IF(O36<>\"\",IF(ROUND(M36,0)<=3,1,0),\"\")","v":""},{"$f":"IF(AND(R36<>\"\",Q36<>\"\",P36<>\"\"),IF($C36=\"\",\"SX\",IF($C36=\"F\",VLOOKUP(ROUND($L36,0)/100,Barème500,3),VLOOKUP(ROUND($L36,0)/100,Barème500,2))),\"\")","v":""},{"$f":"IF(OR(K36=\"\",K36=\"\",AH36=\"\",AG36=\"\",AF36=\"\"),\"\",IF(OR(K36<0,K36>2),\"Err ech.\",SUM(K36,AH36,AG36,AF36)))","v":""},null,null,null,null,null,{"$f":"IF(C36<>\"f\",\"m\",\"f\")","v":"m"}]
[null,null,null,null,null,null,null,null,null,null,null,{"$f":"IF(AND(R37<>\"\",Q37<>\"\",P37<>\"\"),(INT(((INT($P37)*60)+(($P37-INT($P37))*100)+(INT($Q37)*60)+(($Q37-INT($Q37))*100)+(INT($R37)*60)+(($R37-INT($R37))*100))/60)+MOD(((INT($P37)*60)+(($P37-INT($P37))*100)+(INT($Q37)*60)+(($Q37-INT($Q37))*100)+(INT($R37)*60)+(($R37-INT($R37))*100)),60)/100)*100,\"\")","v":""},{"$f":"IF(OR(O37=\"\",P37=\"\"),\"\",ABS((INT(P37)*60)+((P37-INT(P37))*100)-((INT(O37)*60)+((O37-INT(O37))*100))))","v":""},{"$f":"IF(AND(E37=\"\",H37=\"\"),\"\",IF(H37=\"\",E37,H37))","v":""},{"$f":"IF(F37=\"\",\"\",F37/100)","v":""},{"$f":"IF(G37=\"\",\"\",G37/100)","v":""},{"$f":"IF(I37=\"\",\"\",I37/100)","v":""},{"$f":"IF(J37=\"\",\"\",J37/100)","v":""},{"$f":"ROUND((INT(Q37)*60)+((Q37-INT(Q37))*100)-((INT(P37)*60)+((P37-INT(P37))*100)),0)","v":{"$error":"#VALUE!"}},{"$f":"ROUND((INT(R37)*60)+((R37-INT(R37))*100)-((INT(Q37)*60)+((Q37-INT(Q37))*100)),0)","v":{"$error":"#VALUE!"}},{"$f":"ROUND((INT(R37)*60)+((R37-INT(R37))*100)-((INT(P37)*60)+((P37-INT(P37))*100)),0)","v":{"$error":"#VALUE!"}},{"$f":"IF(AND(Q37<>0,P37<>0),IF(OR(N37=1,N37=3,N37=4),IF(OR(S37=0,ABS(S37)<='Barèmes & Options'!H$2),1,0)),\"\")","v":false},{"$f":"IF(AND(Q37<>\"\",P37<>\"\"),IF(OR(N37=5,N37=7),IF(S37>0,1,0)),\"\")","v":""},{"$f":"IF(AND(Q37<>\"\",P37<>\"\"),IF(OR(N37=2,N37=6,N37=8),IF(S37<0,1,0)),\"\")","v":""},{"$f":"IF(AND(Q37<>0,R37<>0),IF(OR(N37=1,N37=5,N37=6),IF(OR(T37=0,ABS(T37)<='Barèmes & Options'!H$2),1,0)),\"\")","v":false},{"$f":"IF(AND(Q37<>\"\",R37<>\"\"),IF(OR(N37=4,N37=8),IF(T37>0,1,0)),\"\")","v":""},{"$f":"IF(AND(Q37<>\"\",R37<>\"\"),IF(OR(N37=2,N37=3,N37=7),IF(T37<0,1,0)),\"\")","v":""},{"$f":"IF(SUM(V37:AA37)=2,IF(N37=2,IF(N37=2,IF(U37-'Barèmes & Options'!H$2<-1,0,1)),\"\"),0)","v":0},{"$f":"IF(OR(N37=2,N37=9),SUM(V37:AA37)-AB37,SUM(V37:AA37))","v":0},{"$f":"IF(OR(V37=1,W37=1,X37=1),TRUE,FALSE)","v":false},{"$f":"IF(OR(Y37=1,Z37=1,AA37=1),TRUE,FALSE)","v":false},{"$f":"IF(N37<>\"\",IF(AND(N37>=1,N37<=8,N37=ABS(N37)),IF(AND(N37<=9,N37>=1),IF(AND(AC37=1,H37<>\"\"),1,IF(AND(AC37=1,H37=\"\"),1.5,IF(AND(AC37=2,H37<>\"\"),2,IF(AND(AC37=2,H37=\"\"),3,0)))),\"\"),\"Err. Profil\"),\"\")","v":""},{"$f":"IF(O37<>\"\",IF(ROUND(M37,0)<=3,1,0),\"\")","v":""},{"$f":"IF(AND(R37<>\"\",Q37<>\"\",P37<>\"\"),IF($C37=\"\",\"SX\",IF($C37=\"F\",VLOOKUP(ROUND($L37,0)/100,Barème500,3),VLOOKUP(ROUND($L37,0)/100,Barème500,2))),\"\")","v":""},{"$f":"IF(OR(K37=\"\",K37=\"\",AH37=\"\",AG37=\"\",AF37=\"\"),\"\",IF(OR(K37<0,K37>2),\"Err ech.\",SUM(K37,AH37,AG37,AF37)))","v":""},null,null,null,null,null,{"$f":"IF(C37<>\"f\",\"m\",\"f\")","v":"m"}]
[null,null,null,null,null,null,null,null,null,null,null,{"$f":"IF(AND(R38<>\"\",Q38<>\"\",P38<>\"\"),(INT(((INT($P38)*60)+(($P38-INT($P38))*100)+(INT($Q38)*60)+(($Q38-INT($Q38))*100)+(INT($R38)*60)+(($R38-INT($R38))*100))/60)+MOD(((INT($P38)*60)+(($P38-INT($P38))*100)+(INT($Q38)*60)+(($Q38-INT($Q38))*100)+(INT($R38)*60)+(($R38-INT($R38))*100)),60)/100)*100,\"\")","v":""},{"$f":"IF(OR(O38=\"\",P38=\"\"),\"\",ABS((INT(P38)*60)+((P38-INT(P38))*100)-((INT(O38)*60)+((O38-INT(O38))*100))))","v":""},{"$f":"IF(AND(E38=\"\",H38=\"\"),\"\",IF(H38=\"\",E38,H38))","v":""},{"$f":"IF(F38=\"\",\"\",F38/100)","v":""},{"$f":"IF(G38=\"\",\"\",G38/100)","v":""},{"$f":"IF(I38=\"\",\"\",I38/100)","v":""},{"$f":"IF(J38=\"\",\"\",J38/100)","v":""},{"$f":"ROUND((INT(Q38)*60)+((Q38-INT(Q38))*100)-((INT(P38)*60)+((P38-INT(P38))*100)),0)","v":{"$error":"#VALUE!"}},{"$f":"ROUND((INT(R38)*60)+((R38-INT(R38))*100)-((INT(Q38)*60)+((Q38-INT(Q38))*100)),0)","v":{"$error":"#VALUE!"}},{"$f":"ROUND((INT(R38)*60)+((R38-INT(R38))*100)-((INT(P38)*60)+((P38-INT(P38))*100)),0)","v":{"$error":"#VALUE!"}},{"$f":"IF(AND(Q38<>0,P38<>0),IF(OR(N38=1,N38=3,N38=4),IF(OR(S38=0,ABS(S38)<='Barèmes & Options'!H$2),1,0)),\"\")","v":false},{"$f":"IF(AND(Q38<>\"\",P38<>\"\"),IF(OR(N38=5,N38=7),IF(S38>0,1,0)),\"\")","v":""},{"$f":"IF(AND(Q38<>\"\",P38<>\"\"),IF(OR(N38=2,N38=6,N38=8),IF(S38<0,1,0)),\"\")","v":""},{"$f":"IF(AND(Q38<>0,R38<>0),IF(OR(N38=1,N38=5,N38=6),IF(OR(T38=0,ABS(T38)<='Barèmes & Options'!H$2),1,0)),\"\")","v":false},{"$f":"IF(AND(Q38<>\"\",R38<>\"\"),IF(OR(N38=4,N38=8),IF(T38>0,1,0)),\"\")","v":""},{"$f":"IF(AND(Q38<>\"\",R38<>\"\"),IF(OR(N38=2,N38=3,N38=7),IF(T38<0,1,0)),\"\")","v":""},{"$f":"IF(SUM(V38:AA38)=2,IF(N38=2,IF(N38=2,IF(U38-'Barèmes & Options'!H$2<-1,0,1)),\"\"),0)","v":0},{"$f":"IF(OR(N38=2,N38=9),SUM(V38:AA38)-AB38,SUM(V38:AA38))","v":0},{"$f":"IF(OR(V38=1,W38=1,X38=1),TRUE,FALSE)","v":false},{"$f":"IF(OR(Y38=1,Z38=1,AA38=1),TRUE,FALSE)","v":false},{"$f":"IF(N38<>\"\",IF(AND(N38>=1,N38<=8,N38=ABS(N38)),IF(AND(N38<=9,N38>=1),IF(AND(AC38=1,H38<>\"\"),1,IF(AND(AC38=1,H38=\"\"),1.5,IF(AND(AC38=2,H38<>\"\"),2,IF(AND(AC38=2,H38=\"\"),3,0)))),\"\"),\"Err. Profil\"),\"\")","v":""},{"$f":"IF(O38<>\"\",IF(ROUND(M38,0)<=3,1,0),\"\")","v":""},{"$f":"IF(AND(R38<>\"\",Q38<>\"\",P38<>\"\"),IF($C38=\"\",\"SX\",IF($C38=\"F\",VLOOKUP(ROUND($L38,0)/100,Barème500,3),VLOOKUP(ROUND($L38,0)/100,Barème500,2))),\"\")","v":""},{"$f":"IF(OR(K38=\"\",K38=\"\",AH38=\"\",AG38=\"\",AF38=\"\"),\"\",IF(OR(K38<0,K38>2),\"Err ech.\",SUM(K38,AH38,AG38,AF38)))","v":""},null,null,null,null,null,{"$f":"IF(C38<>\"f\",\"m\",\"f\")","v":"m"}]
[null,null,null,null,null,null,null,null,null,null,null,{"$f":"IF(AND(R39<>\"\",Q39<>\"\",P39<>\"\"),(INT(((INT($P39)*60)+(($P39-INT($P39))*100)+(INT($Q39)*60)+(($Q39-INT($Q39))*100)+(INT($R39)*60)+(($R39-INT($R39))*100))/60)+MOD(((INT($P39)*60)+(($P39-INT($P39))*100)+(INT($Q39)*60)+(($Q39-INT($Q39))*100)+(INT($R39)*60)+(($R39-INT($R39))*100)),60)/100)*100,\"\")","v":""},{"$f":"IF(OR(O39=\"\",P39=\"\"),\"\",ABS((INT(P39)*60)+((P39-INT(P39))*100)-((INT(O39)*60)+((O39-INT(O39))*100))))","v":""},{"$f":"IF(AND(E39=\"\",H39=\"\"),\"\",IF(H39=\"\",E39,H39))","v":""},{"$f":"IF(F39=\"\",\"\",F39/100)","v":""},{"$f":"IF(G39=\"\",\"\",G39/100)","v":""},{"$f":"IF(I39=\"\",\"\",I39/100)","v":""},{"$f":"IF(J39=\"\",\"\",J39/100)","v":""},{"$f":"ROUND((INT(Q39)*60)+((Q39-INT(Q39))*100)-((INT(P39)*60)+((P39-INT(P39))*100)),0)","v":{"$error":"#VALUE!"}},{"$f":"ROUND((INT(R39)*60)+((R39-INT(R39))*100)-((INT(Q39)*60)+((Q39-INT(Q39))*100)),0)","v":{"$error":"#VALUE!"}},{"$f":"ROUND((INT(R39)*60)+((R39-INT(R39))*100)-((INT(P39)*60)+((P39-INT(P39))*100)),0)","v":{"$error":"#VALUE!"}},{"$f":"IF(AND(Q39<>0,P39<>0),IF(OR(N39=1,N39=3,N39=4),IF(OR(S39=0,ABS(S39)<='Barèmes & Options'!H$2),1,0)),\"\")","v":false},{"$f":"IF(AND(Q39<>\"\",P39<>\"\"),IF(OR(N39=5,N39=7),IF(S39>0,1,0)),\"\")","v":""},{"$f":"IF(AND(Q39<>\"\",P39<>\"\"),IF(OR(N39=2,N39=6,N39=8),IF(S39<0,1,0)),\"\")","v":""},{"$f":"IF(AND(Q39<>0,R39<>0),IF(OR(N39=1,N39=5,N39=6),IF(OR(T39=0,ABS(T39)<='Barèmes & Options'!H$2),1,0)),\"\")","v":false},{"$f":"IF(AND(Q39<>\"\",R39<>\"\"),IF(OR(N39=4,N39=8),IF(T39>0,1,0)),\"\")","v":""},{"$f":"IF(AND(Q39<>\"\",R39<>\"\"),IF(OR(N39=2,N39=3,N39=7),IF(T39<0,1,0)),\"\")","v":""},{"$f":"IF(SUM(V39:AA39)=2,IF(N39=2,IF(N39=2,IF(U39-'Barèmes & Options'!H$2<-1,0,1)),\"\"),0)","v":0},{"$f":"IF(OR(N39=2,N39=9),SUM(V39:AA39)-AB39,SUM(V39:AA39))","v":0},{"$f":"IF(OR(V39=1,W39=1,X39=1),TRUE,FALSE)","v":false},{"$f":"IF(OR(Y39=1,Z39=1,AA39=1),TRUE,FALSE)","v":false},{"$f":"IF(N39<>\"\",IF(AND(N39>=1,N39<=8,N39=ABS(N39)),IF(AND(N39<=9,N39>=1),IF(AND(AC39=1,H39<>\"\"),1,IF(AND(AC39=1,H39=\"\"),1.5,IF(AND(AC39=2,H39<>\"\"),2,IF(AND(AC39=2,H39=\"\"),3,0)))),\"\"),\"Err. Profil\"),\"\")","v":""},{"$f":"IF(O39<>\"\",IF(ROUND(M39,0)<=3,1,0),\"\")","v":""},{"$f":"IF(AND(R39<>\"\",Q39<>\"\",P39<>\"\"),IF($C39=\"\",\"SX\",IF($C39=\"F\",VLOOKUP(ROUND($L39,0)/100,Barème500,3),VLOOKUP(ROUND($L39,0)/100,Barème500,2))),\"\")","v":""},{"$f":"IF(OR(K39=\"\",K39=\"\",AH39=\"\",AG39=\"\",AF39=\"\"),\"\",IF(OR(K39<0,K39>2),\"Err ech.\",SUM(K39,AH39,AG39,AF39)))","v":""},null,null,null,null,null,{"$f":"IF(C39<>\"f\",\"m\",\"f\")","v":"m"}]
[null,null,null,null,null,null,null,null,null,null,null,{"$f":"IF(AND(R40<>\"\",Q40<>\"\",P40<>\"\"),(INT(((INT($P40)*60)+(($P40-INT($P40))*100)+(INT($Q40)*60)+(($Q40-INT($Q40))*100)+(INT($R40)*60)+(($R40-INT($R40))*100))/60)+MOD(((INT($P40)*60)+(($P40-INT($P40))*100)+(INT($Q40)*60)+(($Q40-INT($Q40))*100)+(INT($R40)*60)+(($R40-INT($R40))*100)),60)/100)*100,\"\")","v":""},{"$f":"IF(OR(O40=\"\",P40=\"\"),\"\",ABS((INT(P40)*60)+((P40-INT(P40))*100)-((INT(O40)*60)+((O40-INT(O40))*100))))","v":""},{"$f":"IF(AND(E40=\"\",H40=\"\"),\"\",IF(H40=\"\",E40,H40))","v":""},{"$f":"IF(F40=\"\",\"\",F40/100)","v":""},{"$f":"IF(G40=\"\",\"\",G40/100)","v":""},{"$f":"IF(I40=\"\",\"\",I40/100)","v":""},{"$f":"IF(J40=\"\",\"\",J40/100)","v":""},{"$f":"ROUND((INT(Q40)*60)+((Q40-INT(Q40))*100)-((INT(P40)*60)+((P40-INT(P40))*100)),0)","v":{"$error":"#VALUE!"}},{"$f":"ROUND((INT(R40)*60)+((R40-INT(R40))*100)-((INT(Q40)*60)+((Q40-INT(Q40))*100)),0)","v":{"$error":"#VALUE!"}},{"$f":"ROUND((INT(R40)*60)+((R40-INT(R40))*100)-((INT(P40)*60)+((P40-INT(P40))*100)),0)","v":{"$error":"#VALUE!"}},{"$f":"IF(AND(Q40<>0,P40<>0),IF(OR(N40=1,N40=3,N40=4),IF(OR(S40=0,ABS(S40)<='Barèmes & Options'!H$2),1,0)),\"\")","v":false},{"$f":"IF(AND(Q40<>\"\",P40<>\"\"),IF(OR(N40=5,N40=7),IF(S40>0,1,0)),\"\")","v":""},{"$f":"IF(AND(Q40<>\"\",P40<>\"\"),IF(OR(N40=2,N40=6,N40=8),IF(S40<0,1,0)),\"\")","v":""},{"$f":"IF(AND(Q40<>0,R40<>0),IF(OR(N40=1,N40=5,N40=6),IF(OR(T40=0,ABS(T40)<='Barèmes & Options'!H$2),1,0)),\"\")","v":false},{"$f":"IF(AND(Q40<>\"\",R40<>\"\"),IF(OR(N40=4,N40=8),IF(T40>0,1,0)),\"\")","v":""},{"$f":"IF(AND(Q40<>\"\",R40<>\"\"),IF(OR(N40=2,N40=3,N40=7),IF(T40<0,1,0)),\"\")","v":""},{"$f":"IF(SUM(V40:AA40)=2,IF(N40=2,IF(N40=2,IF(U40-'Barèmes & Options'!H$2<-1,0,1)),\"\"),0)","v":0},{"$f":"IF(OR(N40=2,N40=9),SUM(V40:AA40)-AB40,SUM(V40:AA40))","v":0},{"$f":"IF(OR(V40=1,W40=1,X40=1),TRUE,FALSE)","v":false},{"$f":"IF(OR(Y40=1,Z40=1,AA40=1),TRUE,FALSE)","v":false},{"$f":"IF(N40<>\"\",IF(AND(N40>=1,N40<=8,N40=ABS(N40)),IF(AND(N40<=9,N40>=1),IF(AND(AC40=1,H40<>\"\"),1,IF(AND(AC40=1,H40=\"\"),1.5,IF(AND(AC40=2,H40<>\"\"),2,IF(AND(AC40=2,H40=\"\"),3,0)))),\"\"),\"Err. Profil\"),\"\")","v":""},{"$f":"IF(O40<>\"\",IF(ROUND(M40,0)<=3,1,0),\"\")","v":""},{"$f":"IF(AND(R40<>\"\",Q40<>\"\",P40<>\"\"),IF($C40=\"\",\"SX\",IF($C40=\"F\",VLOOKUP(ROUND($L40,0)/100,Barème500,3),VLOOKUP(ROUND($L40,0)/100,Barème500,2))),\"\")","v":""},{"$f":"IF(OR(K40=\"\",K40=\"\",AH40=\"\",AG40=\"\",AF40=\"\"),\"\",IF(OR(K40<0,K40>2),\"Err ech.\",SUM(K40,AH40,AG40,AF40)))","v":""},null,null,null,null,null,{"$f":"IF(C40<>\"f\",\"m\",\"f\")","v":"m"}]
[null,null,null,null,null,null,null,null,null,null,null,{"$f":"IF(AND(R41<>\"\",Q41<>\"\",P41<>\"\"),(INT(((INT($P41)*60)+(($P41-INT($P41))*100)+(INT($Q41)*60)+(($Q41-INT($Q41))*100)+(INT($R41)*60)+(($R41-INT($R41))*100))/60)+MOD(((INT($P41)*60)+(($P41-INT($P41))*100)+(INT($Q41)*60)+(($Q41-INT($Q41))*100)+(INT($R41)*60)+(($R41-INT($R41))*100)),60)/100)*100,\"\")","v":""},{"$f":"IF(OR(O41=\"\",P41=\"\"),\"\",ABS((INT(P41)*60)+((P41-INT(P41))*100)-((INT(O41)*60)+((O41-INT(O41))*100))))","v":""},{"$f":"IF(AND(E41=\"\",H41=\"\"),\"\",IF(H41=\"\",E41,H41))","v":""},{"$f":"IF(F41=\"\",\"\",F41/100)","v":""},{"$f":"IF(G41=\"\",\"\",G41/100)","v":""},{"$f":"IF(I41=\"\",\"\",I41/100)","v":""},{"$f":"IF(J41=\"\",\"\",J41/100)","v":""},{"$f":"ROUND((INT(Q41)*60)+((Q41-INT(Q41))*100)-((INT(P41)*60)+((P41-INT(P41))*100)),0)","v":{"$error":"#VALUE!"}},{"$f":"ROUND((INT(R41)*60)+((R41-INT(R41))*100)-((INT(Q41)*60)+((Q41-INT(Q41))*100)),0)","v":{"$error":"#VALUE!"}},{"$f":"ROUND((INT(R41)*60)+((R41-INT(R41))*100)-((INT(P41)*60)+((P41-INT(P41))*100)),0)","v":{"$error":"#VALUE!"}},{"$f":"IF(AND(Q41<>0,P41<>0),IF(OR(N41=1,N41=3,N41=4),IF(OR(S41=0,ABS(S41)<='Barèmes & Options'!H$2),1,0)),\"\")","v":false},{"$f":"IF(AND(Q41<>\"\",P41<>\"\"),IF(OR(N41=5,N41=7),IF(S41>0,1,0)),\"\")","v":""},{"$f":"IF(AND(Q41<>\"\",P41<>\"\"),IF(OR(N41=2,N41=6,N41=8),IF(S41<0,1,0)),\"\")","v":""},{"$f":"IF(AND(Q41<>0,R41<>0),IF(OR(N41=1,N41=5,N41=6),IF(OR(T41=0,ABS(T41)<='Barèmes & Options'!H$2),1,0)),\"\")","v":false},{"$f":"IF(AND(Q41<>\"\",R41<>\"\"),IF(OR(N41=4,N41=8),IF(T41>0,1,0)),\"\")","v":""},{"$f":"IF(AND(Q41<>\"\",R41<>\"\"),IF(OR(N41=2,N41=3,N41=7),IF(T41<0,1,0)),\"\")","v":""},{"$f":"IF(SUM(V41:AA41)=2,IF(N41=2,IF(N41=2,IF(U41-'Barèmes & Options'!H$2<-1,0,1)),\"\"),0)","v":0},{"$f":"IF(OR(N41=2,N41=9),SUM(V41:AA41)-AB41,SUM(V41:AA41))","v":0},{"$f":"IF(OR(V41=1,W41=1,X41=1),TRUE,FALSE)","v":false},{"$f":"IF(OR(Y41=1,Z41=1,AA41=1),TRUE,FALSE)","v":false},{"$f":"IF(N41<>\"\",IF(AND(N41>=1,N41<=8,N41=ABS(N41)),IF(AND(N41<=9,N41>=1),IF(AND(AC41=1,H41<>\"\"),1,IF(AND(AC41=1,H41=\"\"),1.5,IF(AND(AC41=2,H41<>\"\"),2,IF(AND(AC41=2,H41=\"\"),3,0)))),\"\"),\"Err. Profil\"),\"\")","v":""},{"$f":"IF(O41<>\"\",IF(ROUND(M41,0)<=3,1,0),\"\")","v":""},{"$f":"IF(AND(R41<>\"\",Q41<>\"\",P41<>\"\"),IF($C41=\"\",\"SX\",IF($C41=\"F\",VLOOKUP(ROUND($L41,0)/100,Barème500,3),VLOOKUP(ROUND($L41,0)/100,Barème500,2))),\"\")","v":""},{"$f":"IF(OR(K41=\"\",K41=\"\",AH41=\"\",AG41=\"\",AF41=\"\"),\"\",IF(OR(K41<0,K41>2),\"Err ech.\",SUM(K41,AH41,AG41,AF41)))","v":""},null,null,null,null,null,{"$f":"IF(C41<>\"f\",\"m\",\"f\")","v":"m"}]
[null,null,null,null,null,null,null,null,null,null,null,{"$f":"IF(AND(R42<>\"\",Q42<>\"\",P42<>\"\"),(INT(((INT($P42)*60)+(($P42-INT($P42))*100)+(INT($Q42)*60)+(($Q42-INT($Q42))*100)+(INT($R42)*60)+(($R42-INT($R42))*100))/60)+MOD(((INT($P42)*60)+(($P42-INT($P42))*100)+(INT($Q42)*60)+(($Q42-INT($Q42))*100)+(INT($R42)*60)+(($R42-INT($R42))*100)),60)/100)*100,\"\")","v":""},{"$f":"IF(OR(O42=\"\",P42=\"\"),\"\",ABS((INT(P42)*60)+((P42-INT(P42))*100)-((INT(O42)*60)+((O42-INT(O42))*100))))","v":""},{"$f":"IF(AND(E42=\"\",H42=\"\"),\"\",IF(H42=\"\",E42,H42))","v":""},{"$f":"IF(F42=\"\",\"\",F42/100)","v":""},{"$f":"IF(G42=\"\",\"\",G42/100)","v":""},{"$f":"IF(I42=\"\",\"\",I42/100)","v":""},{"$f":"IF(J42=\"\",\"\",J42/100)","v":""},{"$f":"ROUND((INT(Q42)*60)+((Q42-INT(Q42))*100)-((INT(P42)*60)+((P42-INT(P42))*100)),0)","v":{"$error":"#VALUE!"}},{"$f":"ROUND((INT(R42)*60)+((R42-INT(R42))*100)-((INT(Q42)*60)+((Q42-INT(Q42))*100)),0)","v":{"$error":"#VALUE!"}},{"$f":"ROUND((INT(R42)*60)+((R42-INT(R42))*100)-((INT(P42)*60)+((P42-INT(P42))*100)),0)","v":{"$error":"#VALUE!"}},{"$f":"IF(AND(Q42<>0,P42<>0),IF(OR(N42=1,N42=3,N42=4),IF(OR(S42=0,ABS(S42)<='Barèmes & Options'!H$2),1,0)),\"\")","v":false},{"$f":"IF(AND(Q42<>\"\",P42<>\"\"),IF(OR(N42=5,N42=7),IF(S42>0,1,0)),\"\")","v":""},{"$f":"IF(AND(Q42<>\"\",P42<>\"\"),IF(OR(N42=2,N42=6,N42=8),IF(S42<0,1,0)),\"\")","v":""},{"$f":"IF(AND(Q42<>0,R42<>0),IF(OR(N42=1,N42=5,N42=6),IF(OR(T42=0,ABS(T42)<='Barèmes & Options'!H$2),1,0)),\"\")","v":false},{"$f":"IF(AND(Q42<>\"\",R42<>\"\"),IF(OR(N42=4,N42=8),IF(T42>0,1,0)),\"\")","v":""},{"$f":"IF(AND(Q42<>\"\",R42<>\"\"),IF(OR(N42=2,N42=3,N42=7),IF(T42<0,1,0)),\"\")","v":""},{"$f":"IF(SUM(V42:AA42)=2,IF(N42=2,IF(N42=2,IF(U42-'Barèmes & Options'!H$2<-1,0,1)),\"\"),0)","v":0},{"$f":"IF(OR(N42=2,N42=9),SUM(V42:AA42)-AB42,SUM(V42:AA42))","v":0},{"$f":"IF(OR(V42=1,W42=1,X42=1),TRUE,FALSE)","v":false},{"$f":"IF(OR(Y42=1,Z42=1,AA42=1),TRUE,FALSE)","v":false},{"$f":"IF(N42<>\"\",IF(AND(N42>=1,N42<=8,N42=ABS(N42)),IF(AND(N42<=9,N42>=1),IF(AND(AC42=1,H42<>\"\"),1,IF(AND(AC42=1,H42=\"\"),1.5,IF(AND(AC42=2,H42<>\"\"),2,IF(AND(AC42=2,H42=\"\"),3,0)))),\"\"),\"Err. Profil\"),\"\")","v":""},{"$f":"IF(O42<>\"\",IF(ROUND(M42,0)<=3,1,0),\"\")","v":""},{"$f":"IF(AND(R42<>\"\",Q42<>\"\",P42<>\"\"),IF($C42=\"\",\"SX\",IF($C42=\"F\",VLOOKUP(ROUND($L42,0)/100,Barème500,3),VLOOKUP(ROUND($L42,0)/100,Barème500,2))),\"\")","v":""},{"$f":"IF(OR(K42=\"\",K42=\"\",AH42=\"\",AG42=\"\",AF42=\"\"),\"\",IF(OR(K42<0,K42>2),\"Err ech.\",SUM(K42,AH42,AG42,AF42)))","v":""},null,null,null,null,null,{"$f":"IF(C42<>\"f\",\"m\",\"f\")","v":"m"}]
[null,null,null,null,null,null,null,null,null,null,null,{"$f":"IF(AND(R43<>\"\",Q43<>\"\",P43<>\"\"),(INT(((INT($P43)*60)+(($P43-INT($P43))*100)+(INT($Q43)*60)+(($Q43-INT($Q43))*100)+(INT($R43)*60)+(($R43-INT($R43))*100))/60)+MOD(((INT($P43)*60)+(($P43-INT($P43))*100)+(INT($Q43)*60)+(($Q43-INT($Q43))*100)+(INT($R43)*60)+(($R43-INT($R43))*100)),60)/100)*100,\"\")","v":""},{"$f":"IF(OR(O43=\"\",P43=\"\"),\"\",ABS((INT(P43)*60)+((P43-INT(P43))*100)-((INT(O43)*60)+((O43-INT(O43))*100))))","v":""},{"$f":"IF(AND(E43=\"\",H43=\"\"),\"\",IF(H43=\"\",E43,H43))","v":""},{"$f":"IF(F43=\"\",\"\",F43/100)","v":""},{"$f":"IF(G43=\"\",\"\",G43/100)","v":""},{"$f":"IF(I43=\"\",\"\",I43/100)","v":""},{"$f":"IF(J43=\"\",\"\",J43/100)","v":""},{"$f":"ROUND((INT(Q43)*60)+((Q43-INT(Q43))*100)-((INT(P43)*60)+((P43-INT(P43))*100)),0)","v":{"$error":"#VALUE!"}},{"$f":"ROUND((INT(R43)*60)+((R43-INT(R43))*100)-((INT(Q43)*60)+((Q43-INT(Q43))*100)),0)","v":{"$error":"#VALUE!"}},{"$f":"ROUND((INT(R43)*60)+((R43-INT(R43))*100)-((INT(P43)*60)+((P43-INT(P43))*100)),0)","v":{"$error":"#VALUE!"}},{"$f":"IF(AND(Q43<>0,P43<>0),IF(OR(N43=1,N43=3,N43=4),IF(OR(S43=0,ABS(S43)<='Barèmes & Options'!H$2),1,0)),\"\")","v":false},{"$f":"IF(AND(Q43<>\"\",P43<>\"\"),IF(OR(N43=5,N43=7),IF(S43>0,1,0)),\"\")","v":""},{"$f":"IF(AND(Q43<>\"\",P43<>\"\"),IF(OR(N43=2,N43=6,N43=8),IF(S43<0,1,0)),\"\")","v":""},{"$f":"IF(AND(Q43<>0,R43<>0),IF(OR(N43=1,N43=5,N43=6),IF(OR(T43=0,ABS(T43)<='Barèmes & Options'!H$2),1,0)),\"\")","v":false},{"$f":"IF(AND(Q43<>\"\",R43<>\"\"),IF(OR(N43=4,N43=8),IF(T43>0,1,0)),\"\")","v":""},{"$f":"IF(AND(Q43<>\"\",R43<>\"\"),IF(OR(N43=2,N43=3,N43=7),IF(T43<0,1,0)),\"\")","v":""},{"$f":"IF(SUM(V43:AA43)=2,IF(N43=2,IF(N43=2,IF(U43-'Barèmes & Options'!H$2<-1,0,1)),\"\"),0)","v":0},{"$f":"IF(OR(N43=2,N43=9),SUM(V43:AA43)-AB43,SUM(V43:AA43))","v":0},{"$f":"IF(OR(V43=1,W43=1,X43=1),TRUE,FALSE)","v":false},{"$f":"IF(OR(Y43=1,Z43=1,AA43=1),TRUE,FALSE)","v":false},{"$f":"IF(N43<>\"\",IF(AND(N43>=1,N43<=8,N43=ABS(N43)),IF(AND(N43<=9,N43>=1),IF(AND(AC43=1,H43<>\"\"),1,IF(AND(AC43=1,H43=\"\"),1.5,IF(AND(AC43=2,H43<>\"\"),2,IF(AND(AC43=2,H43=\"\"),3,0)))),\"\"),\"Err. Profil\"),\"\")","v":""},{"$f":"IF(O43<>\"\",IF(ROUND(M43,0)<=3,1,0),\"\")","v":""},{"$f":"IF(AND(R43<>\"\",Q43<>\"\",P43<>\"\"),IF($C43=\"\",\"SX\",IF($C43=\"F\",VLOOKUP(ROUND($L43,0)/100,Barème500,3),VLOOKUP(ROUND($L43,0)/100,Barème500,2))),\"\")","v":""},{"$f":"IF(OR(K43=\"\",K43=\"\",AH43=\"\",AG43=\"\",AF43=\"\"),\"\",IF(OR(K43<0,K43>2),\"Err ech.\",SUM(K43,AH43,AG43,AF43)))","v":""},null,null,null,null,null,{"$f":"IF(C43<>\"f\",\"m\",\"f\")","v":"m"}]
[null,null,null,null,null,null,null,null,null,null,null,{"$f":"IF(AND(R44<>\"\",Q44<>\"\",P44<>\"\"),(INT(((INT($P44)*60)+(($P44-INT($P44))*100)+(INT($Q44)*60)+(($Q44-INT($Q44))*100)+(INT($R44)*60)+(($R44-INT($R44))*100))/60)+MOD(((INT($P44)*60)+(($P44-INT($P44))*100)+(INT($Q44)*60)+(($Q44-INT($Q44))*100)+(INT($R44)*60)+(($R44-INT($R44))*100)),60)/100)*100,\"\")","v":""},{"$f":"IF(OR(O44=\"\",P44=\"\"),\"\",ABS((INT(P44)*60)+((P44-INT(P44))*100)-((INT(O44)*60)+((O44-INT(O44))*100))))","v":""},{"$f":"IF(AND(E44=\"\",H44=\"\"),\"\",IF(H44=\"\",E44,H44))","v":""},{"$f":"IF(F44=\"\",\"\",F44/100)","v":""},{"$f":"IF(G44=\"\",\"\",G44/100)","v":""},{"$f":"IF(I44=\"\",\"\",I44/100)","v":""},{"$f":"IF(J44=\"\",\"\",J44/100)","v":""},{"$f":"ROUND((INT(Q44)*60)+((Q44-INT(Q44))*100)-((INT(P44)*60)+((P44-INT(P44))*100)),0)","v":{"$error":"#VALUE!"}},{"$f":"ROUND((INT(R44)*60)+((R44-INT(R44))*100)-((INT(Q44)*60)+((Q44-INT(Q44))*100)),0)","v":{"$error":"#VALUE!"}},{"$f":"ROUND((INT(R44)*60)+((R44-INT(R44))*100)-((INT(P44)*60)+((P44-INT(P44))*100)),0)","v":{"$error":"#VALUE!"}},{"$f":"IF(AND(Q44<>0,P44<>0),IF(OR(N44=1,N44=3,N44=4),IF(OR(S44=0,ABS(S44)<='Barèmes & Options'!H$2),1,0)),\"\")","v":false},{"$f":"IF(AND(Q44<>\"\",P44<>\"\"),IF(OR(N44=5,N44=7),IF(S44>0,1,0)),\"\")","v":""},{"$f":"IF(AND(Q44<>\"\",P44<>\"\"),IF(OR(N44=2,N44=6,N44=8),IF(S44<0,1,0)),\"\")","v":""},{"$f":"IF(AND(Q44<>0,R44<>0),IF(OR(N44=1,N44=5,N44=6),IF(OR(T44=0,ABS(T44)<='Barèmes & Options'!H$2),1,0)),\"\")","v":false},{"$f":"IF(AND(Q44<>\"\",R44<>\"\"),IF(OR(N44=4,N44=8),IF(T44>0,1,0)),\"\")","v":""},{"$f":"IF(AND(Q44<>\"\",R44<>\"\"),IF(OR(N44=2,N44=3,N44=7),IF(T44<0,1,0)),\"\")","v":""},{"$f":"IF(SUM(V44:AA44)=2,IF(N44=2,IF(N44=2,IF(U44-'Barèmes & Options'!H$2<-1,0,1)),\"\"),0)","v":0},{"$f":"IF(OR(N44=2,N44=9),SUM(V44:AA44)-AB44,SUM(V44:AA44))","v":0},{"$f":"IF(OR(V44=1,W44=1,X44=1),TRUE,FALSE)","v":false},{"$f":"IF(OR(Y44=1,Z44=1,AA44=1),TRUE,FALSE)","v":false},{"$f":"IF(N44<>\"\",IF(AND(N44>=1,N44<=8,N44=ABS(N44)),IF(AND(N44<=9,N44>=1),IF(AND(AC44=1,H44<>\"\"),1,IF(AND(AC44=1,H44=\"\"),1.5,IF(AND(AC44=2,H44<>\"\"),2,IF(AND(AC44=2,H44=\"\"),3,0)))),\"\"),\"Err. Profil\"),\"\")","v":""},{"$f":"IF(O44<>\"\",IF(ROUND(M44,0)<=3,1,0),\"\")","v":""},{"$f":"IF(AND(R44<>\"\",Q44<>\"\",P44<>\"\"),IF($C44=\"\",\"SX\",IF($C44=\"F\",VLOOKUP(ROUND($L44,0)/100,Barème500,3),VLOOKUP(ROUND($L44,0)/100,Barème500,2))),\"\")","v":""},{"$f":"IF(OR(K44=\"\",K44=\"\",AH44=\"\",AG44=\"\",AF44=\"\"),\"\",IF(OR(K44<0,K44>2),\"Err ech.\",SUM(K44,AH44,AG44,AF44)))","v":""},null,null,null,null,null,{"$f":"IF(C44<>\"f\",\"m\",\"f\")","v":"m"}]
[null,null,null,null,null,null,null,null,null,null,null,{"$f":"IF(AND(R45<>\"\",Q45<>\"\",P45<>\"\"),(INT(((INT($P45)*60)+(($P45-INT($P45))*100)+(INT($Q45)*60)+(($Q45-INT($Q45))*100)+(INT($R45)*60)+(($R45-INT($R45))*100))/60)+MOD(((INT($P45)*60)+(($P45-INT($P45))*100)+(INT($Q45)*60)+(($Q45-INT($Q45))*100)+(INT($R45)*60)+(($R45-INT($R45))*100)),60)/100)*100,\"\")","v":""},{"$f":"IF(OR(O45=\"\",P45=\"\"),\"\",ABS((INT(P45)*60)+((P45-INT(P45))*100)-((INT(O45)*60)+((O45-INT(O45))*100))))","v":""},{"$f":"IF(AND(E45=\"\",H45=\"\"),\"\",IF(H45=\"\",E45,H45))","v":""},{"$f":"IF(F45=\"\",\"\",F45/100)","v":""},{"$f":"IF(G45=\"\",\"\",G45/100)","v":""},{"$f":"IF(I45=\"\",\"\",I45/100)","v":""},{"$f":"IF(J45=\"\",\"\",J45/100)","v":""},{"$f":"ROUND((INT(Q45)*60)+((Q45-INT(Q45))*100)-((INT(P45)*60)+((P45-INT(P45))*100)),0)","v":{"$error":"#VALUE!"}},{"$f":"ROUND((INT(R45)*60)+((R45-INT(R45))*100)-((INT(Q45)*60)+((Q45-INT(Q45))*100)),0)","v":{"$error":"#VALUE!"}},{"$f":"ROUND((INT(R45)*60)+((R45-INT(R45))*100)-((INT(P45)*60)+((P45-INT(P45))*100)),0)","v":{"$error":"#VALUE!"}},{"$f":"IF(AND(Q45<>0,P45<>0),IF(OR(N45=1,N45=3,N45=4),IF(OR(S45=0,ABS(S45)<='Barèmes & Options'!H$2),1,0)),\"\")","v":false},{"$f":"IF(AND(Q45<>\"\",P45<>\"\"),IF(OR(N45=5,N45=7),IF(S45>0,1,0)),\"\")","v":""},{"$f":"IF(AND(Q45<>\"\",P45<>\"\"),IF(OR(N45=2,N45=6,N45=8),IF(S45<0,1,0)),\"\")","v":""},{"$f":"IF(AND(Q45<>0,R45<>0),IF(OR(N45=1,N45=5,N45=6),IF(OR(T45=0,ABS(T45)<='Barèmes & Options'!H$2),1,0)),\"\")","v":false},{"$f":"IF(AND(Q45<>\"\",R45<>\"\"),IF(OR(N45=4,N45=8),IF(T45>0,1,0)),\"\")","v":""},{"$f":"IF(AND(Q45<>\"\",R45<>\"\"),IF(OR(N45=2,N45=3,N45=7),IF(T45<0,1,0)),\"\")","v":""},{"$f":"IF(SUM(V45:AA45)=2,IF(N45=2,IF(N45=2,IF(U45-'Barèmes & Options'!H$2<-1,0,1)),\"\"),0)","v":0},{"$f":"IF(OR(N45=2,N45=9),SUM(V45:AA45)-AB45,SUM(V45:AA45))","v":0},{"$f":"IF(OR(V45=1,W45=1,X45=1),TRUE,FALSE)","v":false},{"$f":"IF(OR(Y45=1,Z45=1,AA45=1),TRUE,FALSE)","v":false},{"$f":"IF(N45<>\"\",IF(AND(N45>=1,N45<=8,N45=ABS(N45)),IF(AND(N45<=9,N45>=1),IF(AND(AC45=1,H45<>\"\"),1,IF(AND(AC45=1,H45=\"\"),1.5,IF(AND(AC45=2,H45<>\"\"),2,IF(AND(AC45=2,H45=\"\"),3,0)))),\"\"),\"Err. Profil\"),\"\")","v":""},{"$f":"IF(O45<>\"\",IF(ROUND(M45,0)<=3,1,0),\"\")","v":""},{"$f":"IF(AND(R45<>\"\",Q45<>\"\",P45<>\"\"),IF($C45=\"\",\"SX\",IF($C45=\"F\",VLOOKUP(ROUND($L45,0)/100,Barème500,3),VLOOKUP(ROUND($L45,0)/100,Barème500,2))),\"\")","v":""},{"$f":"IF(OR(K45=\"\",K45=\"\",AH45=\"\",AG45=\"\",AF45=\"\"),\"\",IF(OR(K45<0,K45>2),\"Err ech.\",SUM(K45,AH45,AG45,AF45)))","v":""},null,null,null,null,null,{"$f":"IF(C45<>\"f\",\"m\",\"f\")","v":"m"}]
[null,null,null,null,null,null,null,null,null,null,null,{"$f":"IF(AND(R46<>\"\",Q46<>\"\",P46<>\"\"),(INT(((INT($P46)*60)+(($P46-INT($P46))*100)+(INT($Q46)*60)+(($Q46-INT($Q46))*100)+(INT($R46)*60)+(($R46-INT($R46))*100))/60)+MOD(((INT($P46)*60)+(($P46-INT($P46))*100)+(INT($Q46)*60)+(($Q46-INT($Q46))*100)+(INT($R46)*60)+(($R46-INT($R46))*100)),60)/100)*100,\"\")","v":""},{"$f":"IF(OR(O46=\"\",P46=\"\"),\"\",ABS((INT(P46)*60)+((P46-INT(P46))*100)-((INT(O46)*60)+((O46-INT(O46))*100))))","v":""},{"$f":"IF(AND(E46=\"\",H46=\"\"),\"\",IF(H46=\"\",E46,H46))","v":""},{"$f":"IF(F46=\"\",\"\",F46/100)","v":""},{"$f":"IF(G46=\"\",\"\",G46/100)","v":""},{"$f":"IF(I46=\"\",\"\",I46/100)","v":""},{"$f":"IF(J46=\"\",\"\",J46/100)","v":""},{"$f":"ROUND((INT(Q46)*60)+((Q46-INT(Q46))*100)-((INT(P46)*60)+((P46-INT(P46))*100)),0)","v":{"$error":"#VALUE!"}},{"$f":"ROUND((INT(R46)*60)+((R46-INT(R46))*100)-((INT(Q46)*60)+((Q46-INT(Q46))*100)),0)","v":{"$error":"#VALUE!"}},{"$f":"ROUND((INT(R46)*60)+((R46-INT(R46))*100)-((INT(P46)*60)+((P46-INT(P46))*100)),0)","v":{"$error":"#VALUE!"}},{"$f":"IF(AND(Q46<>0,P46<>0),IF(OR(N46=1,N46=3,N46=4),IF(OR(S46=0,ABS(S46)<='Barèmes & Options'!H$2),1,0)),\"\")","v":false},{"$f":"IF(AND(Q46<>\"\",P46<>\"\"),IF(OR(N46=5,N46=7),IF(S46>0,1,0)),\"\")","v":""},{"$f":"IF(AND(Q46<>\"\",P46<>\"\"),IF(OR(N46=2,N46=6,N46=8),IF(S46<0,1,0)),\"\")","v":""},{"$f":"IF(AND(Q46<>0,R46<>0),IF(OR(N46=1,N46=5,N46=6),IF(OR(T46=0,ABS(T46)<='Barèmes & Options'!H$2),1,0)),\"\")","v":false},{"$f":"IF(AND(Q46<>\"\",R46<>\"\"),IF(OR(N46=4,N46=8),IF(T46>0,1,0)),\"\")","v":""},{"$f":"IF(AND(Q46<>\"\",R46<>\"\"),IF(OR(N46=2,N46=3,N46=7),IF(T46<0,1,0)),\"\")","v":""},{"$f":"IF(SUM(V46:AA46)=2,IF(N46=2,IF(N46=2,IF(U46-'Barèmes & Options'!H$2<-1,0,1)),\"\"),0)","v":0},{"$f":"IF(OR(N46=2,N46=9),SUM(V46:AA46)-AB46,SUM(V46:AA46))","v":0},{"$f":"IF(OR(V46=1,W46=1,X46=1),TRUE,FALSE)","v":false},{"$f":"IF(OR(Y46=1,Z46=1,AA46=1),TRUE,FALSE)","v":false},{"$f":"IF(N46<>\"\",IF(AND(N46>=1,N46<=8,N46=ABS(N46)),IF(AND(N46<=9,N46>=1),IF(AND(AC46=1,H46<>\"\"),1,IF(AND(AC46=1,H46=\"\"),1.5,IF(AND(AC46=2,H46<>\"\"),2,IF(AND(AC46=2,H46=\"\"),3,0)))),\"\"),\"Err. Profil\"),\"\")","v":""},{"$f":"IF(O46<>\"\",IF(ROUND(M46,0)<=3,1,0),\"\")","v":""},{"$f":"IF(AND(R46<>\"\",Q46<>\"\",P46<>\"\"),IF($C46=\"\",\"SX\",IF($C46=\"F\",VLOOKUP(ROUND($L46,0)/100,Barème500,3),VLOOKUP(ROUND($L46,0)/100,Barème500,2))),\"\")","v":""},{"$f":"IF(OR(K46=\"\",K46=\"\",AH46=\"\",AG46=\"\",AF46=\"\"),\"\",IF(OR(K46<0,K46>2),\"Err ech.\",SUM(K46,AH46,AG46,AF46)))","v":""},null,null,null,null,null,{"$f":"IF(C46<>\"f\",\"m\",\"f\")","v":"m"}]
[null,null,null,null,null,null,null,null,null,null,null,{"$f":"IF(AND(R47<>\"\",Q47<>\"\",P47<>\"\"),(INT(((INT($P47)*60)+(($P47-INT($P47))*100)+(INT($Q47)*60)+(($Q47-INT($Q47))*100)+(INT($R47)*60)+(($R47-INT($R47))*100))/60)+MOD(((INT($P47)*60)+(($P47-INT($P47))*100)+(INT($Q47)*60)+(($Q47-INT($Q47))*100)+(INT($R47)*60)+(($R47-INT($R47))*100)),60)/100)*100,\"\")","v":""},{"$f":"IF(OR(O47=\"\",P47=\"\"),\"\",ABS((INT(P47)*60)+((P47-INT(P47))*100)-((INT(O47)*60)+((O47-INT(O47))*100))))","v":""},{"$f":"IF(AND(E47=\"\",H47=\"\"),\"\",IF(H47=\"\",E47,H47))","v":""},{"$f":"IF(F47=\"\",\"\",F47/100)","v":""},{"$f":"IF(G47=\"\",\"\",G47/100)","v":""},{"$f":"IF(I47=\"\",\"\",I47/100)","v":""},{"$f":"IF(J47=\"\",\"\",J47/100)","v":""},{"$f":"ROUND((INT(Q47)*60)+((Q47-INT(Q47))*100)-((INT(P47)*60)+((P47-INT(P47))*100)),0)","v":{"$error":"#VALUE!"}},{"$f":"ROUND((INT(R47)*60)+((R47-INT(R47))*100)-((INT(Q47)*60)+((Q47-INT(Q47))*100)),0)","v":{"$error":"#VALUE!"}},{"$f":"ROUND((INT(R47)*60)+((R47-INT(R47))*100)-((INT(P47)*60)+((P47-INT(P47))*100)),0)","v":{"$error":"#VALUE!"}},{"$f":"IF(AND(Q47<>0,P47<>0),IF(OR(N47=1,N47=3,N47=4),IF(OR(S47=0,ABS(S47)<='Barèmes & Options'!H$2),1,0)),\"\")","v":false},{"$f":"IF(AND(Q47<>\"\",P47<>\"\"),IF(OR(N47=5,N47=7),IF(S47>0,1,0)),\"\")","v":""},{"$f":"IF(AND(Q47<>\"\",P47<>\"\"),IF(OR(N47=2,N47=6,N47=8),IF(S47<0,1,0)),\"\")","v":""},{"$f":"IF(AND(Q47<>0,R47<>0),IF(OR(N47=1,N47=5,N47=6),IF(OR(T47=0,ABS(T47)<='Barèmes & Options'!H$2),1,0)),\"\")","v":false},{"$f":"IF(AND(Q47<>\"\",R47<>\"\"),IF(OR(N47=4,N47=8),IF(T47>0,1,0)),\"\")","v":""},{"$f":"IF(AND(Q47<>\"\",R47<>\"\"),IF(OR(N47=2,N47=3,N47=7),IF(T47<0,1,0)),\"\")","v":""},{"$f":"IF(SUM(V47:AA47)=2,IF(N47=2,IF(N47=2,IF(U47-'Barèmes & Options'!H$2<-1,0,1)),\"\"),0)","v":0},{"$f":"IF(OR(N47=2,N47=9),SUM(V47:AA47)-AB47,SUM(V47:AA47))","v":0},{"$f":"IF(OR(V47=1,W47=1,X47=1),TRUE,FALSE)","v":false},{"$f":"IF(OR(Y47=1,Z47=1,AA47=1),TRUE,FALSE)","v":false},{"$f":"IF(N47<>\"\",IF(AND(N47>=1,N47<=8,N47=ABS(N47)),IF(AND(N47<=9,N47>=1),IF(AND(AC47=1,H47<>\"\"),1,IF(AND(AC47=1,H47=\"\"),1.5,IF(AND(AC47=2,H47<>\"\"),2,IF(AND(AC47=2,H47=\"\"),3,0)))),\"\"),\"Err. Profil\"),\"\")","v":""},{"$f":"IF(O47<>\"\",IF(ROUND(M47,0)<=3,1,0),\"\")","v":""},{"$f":"IF(AND(R47<>\"\",Q47<>\"\",P47<>\"\"),IF($C47=\"\",\"SX\",IF($C47=\"F\",VLOOKUP(ROUND($L47,0)/100,Barème500,3),VLOOKUP(ROUND($L47,0)/100,Barème500,2))),\"\")","v":""},{"$f":"IF(OR(K47=\"\",K47=\"\",AH47=\"\",AG47=\"\",AF47=\"\"),\"\",IF(OR(K47<0,K47>2),\"Err ech.\",SUM(K47,AH47,AG47,AF47)))","v":""},null,null,null,null,null,{"$f":"IF(C47<>\"f\",\"m\",\"f\")","v":"m"}]
[null,null,null,null,null,null,null,null,null,null,null,{"$f":"IF(AND(R48<>\"\",Q48<>\"\",P48<>\"\"),(INT(((INT($P48)*60)+(($P48-INT($P48))*100)+(INT($Q48)*60)+(($Q48-INT($Q48))*100)+(INT($R48)*60)+(($R48-INT($R48))*100))/60)+MOD(((INT($P48)*60)+(($P48-INT($P48))*100)+(INT($Q48)*60)+(($Q48-INT($Q48))*100)+(INT($R48)*60)+(($R48-INT($R48))*100)),60)/100)*100,\"\")","v":""},{"$f":"IF(OR(O48=\"\",P48=\"\"),\"\",ABS((INT(P48)*60)+((P48-INT(P48))*100)-((INT(O48)*60)+((O48-INT(O48))*100))))","v":""},{"$f":"IF(AND(E48=\"\",H48=\"\"),\"\",IF(H48=\"\",E48,H48))","v":""},{"$f":"IF(F48=\"\",\"\",F48/100)","v":""},{"$f":"IF(G48=\"\",\"\",G48/100)","v":""},{"$f":"IF(I48=\"\",\"\",I48/100)","v":""},{"$f":"IF(J48=\"\",\"\",J48/100)","v":""},{"$f":"ROUND((INT(Q48)*60)+((Q48-INT(Q48))*100)-((INT(P48)*60)+((P48-INT(P48))*100)),0)","v":{"$error":"#VALUE!"}},{"$f":"ROUND((INT(R48)*60)+((R48-INT(R48))*100)-((INT(Q48)*60)+((Q48-INT(Q48))*100)),0)","v":{"$error":"#VALUE!"}},{"$f":"ROUND((INT(R48)*60)+((R48-INT(R48))*100)-((INT(P48)*60)+((P48-INT(P48))*100)),0)","v":{"$error":"#VALUE!"}},{"$f":"IF(AND(Q48<>0,P48<>0),IF(OR(N48=1,N48=3,N48=4),IF(OR(S48=0,ABS(S48)<='Barèmes & Options'!H$2),1,0)),\"\")","v":false},{"$f":"IF(AND(Q48<>\"\",P48<>\"\"),IF(OR(N48=5,N48=7),IF(S48>0,1,0)),\"\")","v":""},{"$f":"IF(AND(Q48<>\"\",P48<>\"\"),IF(OR(N48=2,N48=6,N48=8),IF(S48<0,1,0)),\"\")","v":""},{"$f":"IF(AND(Q48<>0,R48<>0),IF(OR(N48=1,N48=5,N48=6),IF(OR(T48=0,ABS(T48)<='Barèmes & Options'!H$2),1,0)),\"\")","v":false},{"$f":"IF(AND(Q48<>\"\",R48<>\"\"),IF(OR(N48=4,N48=8),IF(T48>0,1,0)),\"\")","v":""},{"$f":"IF(AND(Q48<>\"\",R48<>\"\"),IF(OR(N48=2,N48=3,N48=7),IF(T48<0,1,0)),\"\")","v":""},{"$f":"IF(SUM(V48:AA48)=2,IF(N48=2,IF(N48=2,IF(U48-'Barèmes & Options'!H$2<-1,0,1)),\"\"),0)","v":0},{"$f":"IF(OR(N48=2,N48=9),SUM(V48:AA48)-AB48,SUM(V48:AA48))","v":0},{"$f":"IF(OR(V48=1,W48=1,X48=1),TRUE,FALSE)","v":false},{"$f":"IF(OR(Y48=1,Z48=1,AA48=1),TRUE,FALSE)","v":false},{"$f":"IF(N48<>\"\",IF(AND(N48>=1,N48<=8,N48=ABS(N48)),IF(AND(N48<=9,N48>=1),IF(AND(AC48=1,H48<>\"\"),1,IF(AND(AC48=1,H48=\"\"),1.5,IF(AND(AC48=2,H48<>\"\"),2,IF(AND(AC48=2,H48=\"\"),3,0)))),\"\"),\"Err. Profil\"),\"\")","v":""},{"$f":"IF(O48<>\"\",IF(ROUND(M48,0)<=3,1,0),\"\")","v":""},{"$f":"IF(AND(R48<>\"\",Q48<>\"\",P48<>\"\"),IF($C48=\"\",\"SX\",IF($C48=\"F\",VLOOKUP(ROUND($L48,0)/100,Barème500,3),VLOOKUP(ROUND($L48,0)/100,Barème500,2))),\"\")","v":""},{"$f":"IF(OR(K48=\"\",K48=\"\",AH48=\"\",AG48=\"\",AF48=\"\"),\"\",IF(OR(K48<0,K48>2),\"Err ech.\",SUM(K48,AH48,AG48,AF48)))","v":""},null,null,null,null,null,{"$f":"IF(C48<>\"f\",\"m\",\"f\")","v":"m"}]
[null,null,null,null,null,null,null,null,null,null,null,{"$f":"IF(AND(R49<>\"\",Q49<>\"\",P49<>\"\"),(INT(((INT($P49)*60)+(($P49-INT($P49))*100)+(INT($Q49)*60)+(($Q49-INT($Q49))*100)+(INT($R49)*60)+(($R49-INT($R49))*100))/60)+MOD(((INT($P49)*60)+(($P49-INT($P49))*100)+(INT($Q49)*60)+(($Q49-INT($Q49))*100)+(INT($R49)*60)+(($R49-INT($R49))*100)),60)/100)*100,\"\")","v":""},{"$f":"IF(OR(O49=\"\",P49=\"\"),\"\",ABS((INT(P49)*60)+((P49-INT(P49))*100)-((INT(O49)*60)+((O49-INT(O49))*100))))","v":""},{"$f":"IF(AND(E49=\"\",H49=\"\"),\"\",IF(H49=\"\",E49,H49))","v":""},{"$f":"IF(F49=\"\",\"\",F49/100)","v":""},{"$f":"IF(G49=\"\",\"\",G49/100)","v":""},{"$f":"IF(I49=\"\",\"\",I49/100)","v":""},{"$f":"IF(J49=\"\",\"\",J49/100)","v":""},{"$f":"ROUND((INT(Q49)*60)+((Q49-INT(Q49))*100)-((INT(P49)*60)+((P49-INT(P49))*100)),0)","v":{"$error":"#VALUE!"}},{"$f":"ROUND((INT(R49)*60)+((R49-INT(R49))*100)-((INT(Q49)*60)+((Q49-INT(Q49))*100)),0)","v":{"$error":"#VALUE!"}},{"$f":"ROUND((INT(R49)*60)+((R49-INT(R49))*100)-((INT(P49)*60)+((P49-INT(P49))*100)),0)","v":{"$error":"#VALUE!"}},{"$f":"IF(AND(Q49<>0,P49<>0),IF(OR(N49=1,N49=3,N49=4),IF(OR(S49=0,ABS(S49)<='Barèmes & Options'!H$2),1,0)),\"\")","v":false},{"$f":"IF(AND(Q49<>\"\",P49<>\"\"),IF(OR(N49=5,N49=7),IF(S49>0,1,0)),\"\")","v":""},{"$f":"IF(AND(Q49<>\"\",P49<>\"\"),IF(OR(N49=2,N49=6,N49=8),IF(S49<0,1,0)),\"\")","v":""},{"$f":"IF(AND(Q49<>0,R49<>0),IF(OR(N49=1,N49=5,N49=6),IF(OR(T49=0,ABS(T49)<='Barèmes & Options'!H$2),1,0)),\"\")","v":false},{"$f":"IF(AND(Q49<>\"\",R49<>\"\"),IF(OR(N49=4,N49=8),IF(T49>0,1,0)),\"\")","v":""},{"$f":"IF(AND(Q49<>\"\",R49<>\"\"),IF(OR(N49=2,N49=3,N49=7),IF(T49<0,1,0)),\"\")","v":""},{"$f":"IF(SUM(V49:AA49)=2,IF(N49=2,IF(N49=2,IF(U49-'Barèmes & Options'!H$2<-1,0,1)),\"\"),0)","v":0},{"$f":"IF(OR(N49=2,N49=9),SUM(V49:AA49)-AB49,SUM(V49:AA49))","v":0},{"$f":"IF(OR(V49=1,W49=1,X49=1),TRUE,FALSE)","v":false},{"$f":"IF(OR(Y49=1,Z49=1,AA49=1),TRUE,FALSE)","v":false},{"$f":"IF(N49<>\"\",IF(AND(N49>=1,N49<=8,N49=ABS(N49)),IF(AND(N49<=9,N49>=1),IF(AND(AC49=1,H49<>\"\"),1,IF(AND(AC49=1,H49=\"\"),1.5,IF(AND(AC49=2,H49<>\"\"),2,IF(AND(AC49=2,H49=\"\"),3,0)))),\"\"),\"Err. Profil\"),\"\")","v":""},{"$f":"IF(O49<>\"\",IF(ROUND(M49,0)<=3,1,0),\"\")","v":""},{"$f":"IF(AND(R49<>\"\",Q49<>\"\",P49<>\"\"),IF($C49=\"\",\"SX\",IF($C49=\"F\",VLOOKUP(ROUND($L49,0)/100,Barème500,3),VLOOKUP(ROUND($L49,0)/100,Barème500,2))),\"\")","v":""},{"$f":"IF(OR(K49=\"\",K49=\"\",AH49=\"\",AG49=\"\",AF49=\"\"),\"\",IF(OR(K49<0,K49>2),\"Err ech.\",SUM(K49,AH49,AG49,AF49)))","v":""},null,null,null,null,null,{"$f":"IF(C49<>\"f\",\"m\",\"f\")","v":"m"}]
[null,null,null,null,null,null,null,null,null,null,null,{"$f":"IF(AND(R50<>\"\",Q50<>\"\",P50<>\"\"),(INT(((INT($P50)*60)+(($P50-INT($P50))*100)+(INT($Q50)*60)+(($Q50-INT($Q50))*100)+(INT($R50)*60)+(($R50-INT($R50))*100))/60)+MOD(((INT($P50)*60)+(($P50-INT($P50))*100)+(INT($Q50)*60)+(($Q50-INT($Q50))*100)+(INT($R50)*60)+(($R50-INT($R50))*100)),60)/100)*100,\"\")","v":""},{"$f":"IF(OR(O50=\"\",P50=\"\"),\"\",ABS((INT(P50)*60)+((P50-INT(P50))*100)-((INT(O50)*60)+((O50-INT(O50))*100))))","v":""},{"$f":"IF(AND(E50=\"\",H50=\"\"),\"\",IF(H50=\"\",E50,H50))","v":""},{"$f":"IF(F50=\"\",\"\",F50/100)","v":""},{"$f":"IF(G50=\"\",\"\",G50/100)","v":""},{"$f":"IF(I50=\"\",\"\",I50/100)","v":""},{"$f":"IF(J50=\"\",\"\",J50/100)","v":""},{"$f":"ROUND((INT(Q50)*60)+((Q50-INT(Q50))*100)-((INT(P50)*60)+((P50-INT(P50))*100)),0)","v":{"$error":"#VALUE!"}},{"$f":"ROUND((INT(R50)*60)+((R50-INT(R50))*100)-((INT(Q50)*60)+((Q50-INT(Q50))*100)),0)","v":{"$error":"#VALUE!"}},{"$f":"ROUND((INT(R50)*60)+((R50-INT(R50))*100)-((INT(P50)*60)+((P50-INT(P50))*100)),0)","v":{"$error":"#VALUE!"}},{"$f":"IF(AND(Q50<>0,P50<>0),IF(OR(N50=1,N50=3,N50=4),IF(OR(S50=0,ABS(S50)<='Barèmes & Options'!H$2),1,0)),\"\")","v":false},{"$f":"IF(AND(Q50<>\"\",P50<>\"\"),IF(OR(N50=5,N50=7),IF(S50>0,1,0)),\"\")","v":""},{"$f":"IF(AND(Q50<>\"\",P50<>\"\"),IF(OR(N50=2,N50=6,N50=8),IF(S50<0,1,0)),\"\")","v":""},{"$f":"IF(AND(Q50<>0,R50<>0),IF(OR(N50=1,N50=5,N50=6),IF(OR(T50=0,ABS(T50)<='Barèmes & Options'!H$2),1,0)),\"\")","v":false},{"$f":"IF(AND(Q50<>\"\",R50<>\"\"),IF(OR(N50=4,N50=8),IF(T50>0,1,0)),\"\")","v":""},{"$f":"IF(AND(Q50<>\"\",R50<>\"\"),IF(OR(N50=2,N50=3,N50=7),IF(T50<0,1,0)),\"\")","v":""},{"$f":"IF(SUM(V50:AA50)=2,IF(N50=2,IF(N50=2,IF(U50-'Barèmes & Options'!H$2<-1,0,1)),\"\"),0)","v":0},{"$f":"IF(OR(N50=2,N50=9),SUM(V50:AA50)-AB50,SUM(V50:AA50))","v":0},{"$f":"IF(OR(V50=1,W50=1,X50=1),TRUE,FALSE)","v":false},{"$f":"IF(OR(Y50=1,Z50=1,AA50=1),TRUE,FALSE)","v":false},{"$f":"IF(N50<>\"\",IF(AND(N50>=1,N50<=8,N50=ABS(N50)),IF(AND(N50<=9,N50>=1),IF(AND(AC50=1,H50<>\"\"),1,IF(AND(AC50=1,H50=\"\"),1.5,IF(AND(AC50=2,H50<>\"\"),2,IF(AND(AC50=2,H50=\"\"),3,0)))),\"\"),\"Err. Profil\"),\"\")","v":""},{"$f":"IF(O50<>\"\",IF(ROUND(M50,0)<=3,1,0),\"\")","v":""},{"$f":"IF(AND(R50<>\"\",Q50<>\"\",P50<>\"\"),IF($C50=\"\",\"SX\",IF($C50=\"F\",VLOOKUP(ROUND($L50,0)/100,Barème500,3),VLOOKUP(ROUND($L50,0)/100,Barème500,2))),\"\")","v":""},{"$f":"IF(OR(K50=\"\",K50=\"\",AH50=\"\",AG50=\"\",AF50=\"\"),\"\",IF(OR(K50<0,K50>2),\"Err ech.\",SUM(K50,AH50,AG50,AF50)))","v":""},null,null,null,null,null,{"$f":"IF(C50<>\"f\",\"m\",\"f\")","v":"m"}]
[null,null,null,null,null,null,null,null,null,null,null,{"$f":"IF(AND(R51<>\"\",Q51<>\"\",P51<>\"\"),(INT(((INT($P51)*60)+(($P51-INT($P51))*100)+(INT($Q51)*60)+(($Q51-INT($Q51))*100)+(INT($R51)*60)+(($R51-INT($R51))*100))/60)+MOD(((INT($P51)*60)+(($P51-INT($P51))*100)+(INT($Q51)*60)+(($Q51-INT($Q51))*100)+(INT($R51)*60)+(($R51-INT($R51))*100)),60)/100)*100,\"\")","v":""},{"$f":"IF(OR(O51=\"\",P51=\"\"),\"\",ABS((INT(P51)*60)+((P51-INT(P51))*100)-((INT(O51)*60)+((O51-INT(O51))*100))))","v":""},{"$f":"IF(AND(E51=\"\",H51=\"\"),\"\",IF(H51=\"\",E51,H51))","v":""},{"$f":"IF(F51=\"\",\"\",F51/100)","v":""},{"$f":"IF(G51=\"\",\"\",G51/100)","v":""},{"$f":"IF(I51=\"\",\"\",I51/100)","v":""},{"$f":"IF(J51=\"\",\"\",J51/100)","v":""},{"$f":"ROUND((INT(Q51)*60)+((Q51-INT(Q51))*100)-((INT(P51)*60)+((P51-INT(P51))*100)),0)","v":{"$error":"#VALUE!"}},{"$f":"ROUND((INT(R51)*60)+((R51-INT(R51))*100)-((INT(Q51)*60)+((Q51-INT(Q51))*100)),0)","v":{"$error":"#VALUE!"}},{"$f":"ROUND((INT(R51)*60)+((R51-INT(R51))*100)-((INT(P51)*60)+((P51-INT(P51))*100)),0)","v":{"$error":"#VALUE!"}},{"$f":"IF(AND(Q51<>0,P51<>0),IF(OR(N51=1,N51=3,N51=4),IF(OR(S51=0,ABS(S51)<='Barèmes & Options'!H$2),1,0)),\"\")","v":false},{"$f":"IF(AND(Q51<>\"\",P51<>\"\"),IF(OR(N51=5,N51=7),IF(S51>0,1,0)),\"\")","v":""},{"$f":"IF(AND(Q51<>\"\",P51<>\"\"),IF(OR(N51=2,N51=6,N51=8),IF(S51<0,1,0)),\"\")","v":""},{"$f":"IF(AND(Q51<>0,R51<>0),IF(OR(N51=1,N51=5,N51=6),IF(OR(T51=0,ABS(T51)<='Barèmes & Options'!H$2),1,0)),\"\")","v":false},{"$f":"IF(AND(Q51<>\"\",R51<>\"\"),IF(OR(N51=4,N51=8),IF(T51>0,1,0)),\"\")","v":""},{"$f":"IF(AND(Q51<>\"\",R51<>\"\"),IF(OR(N51=2,N51=3,N51=7),IF(T51<0,1,0)),\"\")","v":""},{"$f":"IF(SUM(V51:AA51)=2,IF(N51=2,IF(N51=2,IF(U51-'Barèmes & Options'!H$2<-1,0,1)),\"\"),0)","v":0},{"$f":"IF(OR(N51=2,N51=9),SUM(V51:AA51)-AB51,SUM(V51:AA51))","v":0},{"$f":"IF(OR(V51=1,W51=1,X51=1),TRUE,FALSE)","v":false},{"$f":"IF(OR(Y51=1,Z51=1,AA51=1),TRUE,FALSE)","v":false},{"$f":"IF(N51<>\"\",IF(AND(N51>=1,N51<=8,N51=ABS(N51)),IF(AND(N51<=9,N51>=1),IF(AND(AC51=1,H51<>\"\"),1,IF(AND(AC51=1,H51=\"\"),1.5,IF(AND(AC51=2,H51<>\"\"),2,IF(AND(AC51=2,H51=\"\"),3,0)))),\"\"),\"Err. Profil\"),\"\")","v":""},{"$f":"IF(O51<>\"\",IF(ROUND(M51,0)<=3,1,0),\"\")","v":""},{"$f":"IF(AND(R51<>\"\",Q51<>\"\",P51<>\"\"),IF($C51=\"\",\"SX\",IF($C51=\"F\",VLOOKUP(ROUND($L51,0)/100,Barème500,3),VLOOKUP(ROUND($L51,0)/100,Barème500,2))),\"\")","v":""},{"$f":"IF(OR(K51=\"\",K51=\"\",AH51=\"\",AG51=\"\",AF51=\"\"),\"\",IF(OR(K51<0,K51>2),\"Err ech.\",SUM(K51,AH51,AG51,AF51)))","v":""},null,null,null,null,null,{"$f":"IF(C51<>\"f\",\"m\",\"f\")","v":"m"}]
[null,null,null,null,null,null,null,null,null,null,null,{"$f":"IF(AND(R52<>\"\",Q52<>\"\",P52<>\"\"),(INT(((INT($P52)*60)+(($P52-INT($P52))*100)+(INT($Q52)*60)+(($Q52-INT($Q52))*100)+(INT($R52)*60)+(($R52-INT($R52))*100))/60)+MOD(((INT($P52)*60)+(($P52-INT($P52))*100)+(INT($Q52)*60)+(($Q52-INT($Q52))*100)+(INT($R52)*60)+(($R52-INT($R52))*100)),60)/100)*100,\"\")","v":""},{"$f":"IF(OR(O52=\"\",P52=\"\"),\"\",ABS((INT(P52)*60)+((P52-INT(P52))*100)-((INT(O52)*60)+((O52-INT(O52))*100))))","v":""},{"$f":"IF(AND(E52=\"\",H52=\"\"),\"\",IF(H52=\"\",E52,H52))","v":""},{"$f":"IF(F52=\"\",\"\",F52/100)","v":""},{"$f":"IF(G52=\"\",\"\",G52/100)","v":""},{"$f":"IF(I52=\"\",\"\",I52/100)","v":""},{"$f":"IF(J52=\"\",\"\",J52/100)","v":""},{"$f":"ROUND((INT(Q52)*60)+((Q52-INT(Q52))*100)-((INT(P52)*60)+((P52-INT(P52))*100)),0)","v":{"$error":"#VALUE!"}},{"$f":"ROUND((INT(R52)*60)+((R52-INT(R52))*100)-((INT(Q52)*60)+((Q52-INT(Q52))*100)),0)","v":{"$error":"#VALUE!"}},{"$f":"ROUND((INT(R52)*60)+((R52-INT(R52))*100)-((INT(P52)*60)+((P52-INT(P52))*100)),0)","v":{"$error":"#VALUE!"}},{"$f":"IF(AND(Q52<>0,P52<>0),IF(OR(N52=1,N52=3,N52=4),IF(OR(S52=0,ABS(S52)<='Barèmes & Options'!H$2),1,0)),\"\")","v":false},{"$f":"IF(AND(Q52<>\"\",P52<>\"\"),IF(OR(N52=5,N52=7),IF(S52>0,1,0)),\"\")","v":""},{"$f":"IF(AND(Q52<>\"\",P52<>\"\"),IF(OR(N52=2,N52=6,N52=8),IF(S52<0,1,0)),\"\")","v":""},{"$f":"IF(AND(Q52<>0,R52<>0),IF(OR(N52=1,N52=5,N52=6),IF(OR(T52=0,ABS(T52)<='Barèmes & Options'!H$2),1,0)),\"\")","v":false},{"$f":"IF(AND(Q52<>\"\",R52<>\"\"),IF(OR(N52=4,N52=8),IF(T52>0,1,0)),\"\")","v":""},{"$f":"IF(AND(Q52<>\"\",R52<>\"\"),IF(OR(N52=2,N52=3,N52=7),IF(T52<0,1,0)),\"\")","v":""},{"$f":"IF(SUM(V52:AA52)=2,IF(N52=2,IF(N52=2,IF(U52-'Barèmes & Options'!H$2<-1,0,1)),\"\"),0)","v":0},{"$f":"IF(OR(N52=2,N52=9),SUM(V52:AA52)-AB52,SUM(V52:AA52))","v":0},{"$f":"IF(OR(V52=1,W52=1,X52=1),TRUE,FALSE)","v":false},{"$f":"IF(OR(Y52=1,Z52=1,AA52=1),TRUE,FALSE)","v":false},{"$f":"IF(N52<>\"\",IF(AND(N52>=1,N52<=8,N52=ABS(N52)),IF(AND(N52<=9,N52>=1),IF(AND(AC52=1,H52<>\"\"),1,IF(AND(AC52=1,H52=\"\"),1.5,IF(AND(AC52=2,H52<>\"\"),2,IF(AND(AC52=2,H52=\"\"),3,0)))),\"\"),\"Err. Profil\"),\"\")","v":""},{"$f":"IF(O52<>\"\",IF(ROUND(M52,0)<=3,1,0),\"\")","v":""},{"$f":"IF(AND(R52<>\"\",Q52<>\"\",P52<>\"\"),IF($C52=\"\",\"SX\",IF($C52=\"F\",VLOOKUP(ROUND($L52,0)/100,Barème500,3),VLOOKUP(ROUND($L52,0)/100,Barème500,2))),\"\")","v":""},{"$f":"IF(OR(K52=\"\",K52=\"\",AH52=\"\",AG52=\"\",AF52=\"\"),\"\",IF(OR(K52<0,K52>2),\"Err ech.\",SUM(K52,AH52,AG52,AF52)))","v":""},null,null,null,null,null,{"$f":"IF(C52<>\"f\",\"m\",\"f\")","v":"m"}]
[null,null,null,null,null,null,null,null,null,null,null,{"$f":"IF(AND(R53<>\"\",Q53<>\"\",P53<>\"\"),(INT(((INT($P53)*60)+(($P53-INT($P53))*100)+(INT($Q53)*60)+(($Q53-INT($Q53))*100)+(INT($R53)*60)+(($R53-INT($R53))*100))/60)+MOD(((INT($P53)*60)+(($P53-INT($P53))*100)+(INT($Q53)*60)+(($Q53-INT($Q53))*100)+(INT($R53)*60)+(($R53-INT($R53))*100)),60)/100)*100,\"\")","v":""},{"$f":"IF(OR(O53=\"\",P53=\"\"),\"\",ABS((INT(P53)*60)+((P53-INT(P53))*100)-((INT(O53)*60)+((O53-INT(O53))*100))))","v":""},{"$f":"IF(AND(E53=\"\",H53=\"\"),\"\",IF(H53=\"\",E53,H53))","v":""},{"$f":"IF(F53=\"\",\"\",F53/100)","v":""},{"$f":"IF(G53=\"\",\"\",G53/100)","v":""},{"$f":"IF(I53=\"\",\"\",I53/100)","v":""},{"$f":"IF(J53=\"\",\"\",J53/100)","v":""},{"$f":"ROUND((INT(Q53)*60)+((Q53-INT(Q53))*100)-((INT(P53)*60)+((P53-INT(P53))*100)),0)","v":{"$error":"#VALUE!"}},{"$f":"ROUND((INT(R53)*60)+((R53-INT(R53))*100)-((INT(Q53)*60)+((Q53-INT(Q53))*100)),0)","v":{"$error":"#VALUE!"}},{"$f":"ROUND((INT(R53)*60)+((R53-INT(R53))*100)-((INT(P53)*60)+((P53-INT(P53))*100)),0)","v":{"$error":"#VALUE!"}},{"$f":"IF(AND(Q53<>0,P53<>0),IF(OR(N53=1,N53=3,N53=4),IF(OR(S53=0,ABS(S53)<='Barèmes & Options'!H$2),1,0)),\"\")","v":false},{"$f":"IF(AND(Q53<>\"\",P53<>\"\"),IF(OR(N53=5,N53=7),IF(S53>0,1,0)),\"\")","v":""},{"$f":"IF(AND(Q53<>\"\",P53<>\"\"),IF(OR(N53=2,N53=6,N53=8),IF(S53<0,1,0)),\"\")","v":""},{"$f":"IF(AND(Q53<>0,R53<>0),IF(OR(N53=1,N53=5,N53=6),IF(OR(T53=0,ABS(T53)<='Barèmes & Options'!H$2),1,0)),\"\")","v":false},{"$f":"IF(AND(Q53<>\"\",R53<>\"\"),IF(OR(N53=4,N53=8),IF(T53>0,1,0)),\"\")","v":""},{"$f":"IF(AND(Q53<>\"\",R53<>\"\"),IF(OR(N53=2,N53=3,N53=7),IF(T53<0,1,0)),\"\")","v":""},{"$f":"IF(SUM(V53:AA53)=2,IF(N53=2,IF(N53=2,IF(U53-'Barèmes & Options'!H$2<-1,0,1)),\"\"),0)","v":0},{"$f":"IF(OR(N53=2,N53=9),SUM(V53:AA53)-AB53,SUM(V53:AA53))","v":0},{"$f":"IF(OR(V53=1,W53=1,X53=1),TRUE,FALSE)","v":false},{"$f":"IF(OR(Y53=1,Z53=1,AA53=1),TRUE,FALSE)","v":false},{"$f":"IF(N53<>\"\",IF(AND(N53>=1,N53<=8,N53=ABS(N53)),IF(AND(N53<=9,N53>=1),IF(AND(AC53=1,H53<>\"\"),1,IF(AND(AC53=1,H53=\"\"),1.5,IF(AND(AC53=2,H53<>\"\"),2,IF(AND(AC53=2,H53=\"\"),3,0)))),\"\"),\"Err. Profil\"),\"\")","v":""},{"$f":"IF(O53<>\"\",IF(ROUND(M53,0)<=3,1,0),\"\")","v":""},{"$f":"IF(AND(R53<>\"\",Q53<>\"\",P53<>\"\"),IF($C53=\"\",\"SX\",IF($C53=\"F\",VLOOKUP(ROUND($L53,0)/100,Barème500,3),VLOOKUP(ROUND($L53,0)/100,Barème500,2))),\"\")","v":""},{"$f":"IF(OR(K53=\"\",K53=\"\",AH53=\"\",AG53=\"\",AF53=\"\"),\"\",IF(OR(K53<0,K53>2),\"Err ech.\",SUM(K53,AH53,AG53,AF53)))","v":""},null,null,null,null,null,{"$f":"IF(C53<>\"f\",\"m\",\"f\")","v":"m"}]
[null,null,null,null,null,null,null,null,null,null,null,{"$f":"IF(AND(R54<>\"\",Q54<>\"\",P54<>\"\"),(INT(((INT($P54)*60)+(($P54-INT($P54))*100)+(INT($Q54)*60)+(($Q54-INT($Q54))*100)+(INT($R54)*60)+(($R54-INT($R54))*100))/60)+MOD(((INT($P54)*60)+(($P54-INT($P54))*100)+(INT($Q54)*60)+(($Q54-INT($Q54))*100)+(INT($R54)*60)+(($R54-INT($R54))*100)),60)/100)*100,\"\")","v":""},{"$f":"IF(OR(O54=\"\",P54=\"\"),\"\",ABS((INT(P54)*60)+((P54-INT(P54))*100)-((INT(O54)*60)+((O54-INT(O54))*100))))","v":""},{"$f":"IF(AND(E54=\"\",H54=\"\"),\"\",IF(H54=\"\",E54,H54))","v":""},{"$f":"IF(F54=\"\",\"\",F54/100)","v":""},{"$f":"IF(G54=\"\",\"\",G54/100)","v":""},{"$f":"IF(I54=\"\",\"\",I54/100)","v":""},{"$f":"IF(J54=\"\",\"\",J54/100)","v":""},{"$f":"ROUND((INT(Q54)*60)+((Q54-INT(Q54))*100)-((INT(P54)*60)+((P54-INT(P54))*100)),0)","v":{"$error":"#VALUE!"}},{"$f":"ROUND((INT(R54)*60)+((R54-INT(R54))*100)-((INT(Q54)*60)+((Q54-INT(Q54))*100)),0)","v":{"$error":"#VALUE!"}},{"$f":"ROUND((INT(R54)*60)+((R54-INT(R54))*100)-((INT(P54)*60)+((P54-INT(P54))*100)),0)","v":{"$error":"#VALUE!"}},{"$f":"IF(AND(Q54<>0,P54<>0),IF(OR(N54=1,N54=3,N54=4),IF(OR(S54=0,ABS(S54)<='Barèmes & Options'!H$2),1,0)),\"\")","v":false},{"$f":"IF(AND(Q54<>\"\",P54<>\"\"),IF(OR(N54=5,N54=7),IF(S54>0,1,0)),\"\")","v":""},{"$f":"IF(AND(Q54<>\"\",P54<>\"\"),IF(OR(N54=2,N54=6,N54=8),IF(S54<0,1,0)),\"\")","v":""},{"$f":"IF(AND(Q54<>0,R54<>0),IF(OR(N54=1,N54=5,N54=6),IF(OR(T54=0,ABS(T54)<='Barèmes & Options'!H$2),1,0)),\"\")","v":false},{"$f":"IF(AND(Q54<>\"\",R54<>\"\"),IF(OR(N54=4,N54=8),IF(T54>0,1,0)),\"\")","v":""},{"$f":"IF(AND(Q54<>\"\",R54<>\"\"),IF(OR(N54=2,N54=3,N54=7),IF(T54<0,1,0)),\"\")","v":""},{"$f":"IF(SUM(V54:AA54)=2,IF(N54=2,IF(N54=2,IF(U54-'Barèmes & Options'!H$2<-1,0,1)),\"\"),0)","v":0},{"$f":"IF(OR(N54=2,N54=9),SUM(V54:AA54)-AB54,SUM(V54:AA54))","v":0},{"$f":"IF(OR(V54=1,W54=1,X54=1),TRUE,FALSE)","v":false},{"$f":"IF(OR(Y54=1,Z54=1,AA54=1),TRUE,FALSE)","v":false},{"$f":"IF(N54<>\"\",IF(AND(N54>=1,N54<=8,N54=ABS(N54)),IF(AND(N54<=9,N54>=1),IF(AND(AC54=1,H54<>\"\"),1,IF(AND(AC54=1,H54=\"\"),1.5,IF(AND(AC54=2,H54<>\"\"),2,IF(AND(AC54=2,H54=\"\"),3,0)))),\"\"),\"Err. Profil\"),\"\")","v":""},{"$f":"IF(O54<>\"\",IF(ROUND(M54,0)<=3,1,0),\"\")","v":""},{"$f":"IF(AND(R54<>\"\",Q54<>\"\",P54<>\"\"),IF($C54=\"\",\"SX\",IF($C54=\"F\",VLOOKUP(ROUND($L54,0)/100,Barème500,3),VLOOKUP(ROUND($L54,0)/100,Barème500,2))),\"\")","v":""},{"$f":"IF(OR(K54=\"\",K54=\"\",AH54=\"\",AG54=\"\",AF54=\"\"),\"\",IF(OR(K54<0,K54>2),\"Err ech.\",SUM(K54,AH54,AG54,AF54)))","v":""},null,null,null,null,null,{"$f":"IF(C54<>\"f\",\"m\",\"f\")","v":"m"}]
[null,null,null,null,null,null,null,null,null,null,null,{"$f":"IF(AND(R55<>\"\",Q55<>\"\",P55<>\"\"),(INT(((INT($P55)*60)+(($P55-INT($P55))*100)+(INT($Q55)*60)+(($Q55-INT($Q55))*100)+(INT($R55)*60)+(($R55-INT($R55))*100))/60)+MOD(((INT($P55)*60)+(($P55-INT($P55))*100)+(INT($Q55)*60)+(($Q55-INT($Q55))*100)+(INT($R55)*60)+(($R55-INT($R55))*100)),60)/100)*100,\"\")","v":""},{"$f":"IF(OR(O55=\"\",P55=\"\"),\"\",ABS((INT(P55)*60)+((P55-INT(P55))*100)-((INT(O55)*60)+((O55-INT(O55))*100))))","v":""},{"$f":"IF(AND(E55=\"\",H55=\"\"),\"\",IF(H55=\"\",E55,H55))","v":""},{"$f":"IF(F55=\"\",\"\",F55/100)","v":""},{"$f":"IF(G55=\"\",\"\",G55/100)","v":""},{"$f":"IF(I55=\"\",\"\",I55/100)","v":""},{"$f":"IF(J55=\"\",\"\",J55/100)","v":""},{"$f":"ROUND((INT(Q55)*60)+((Q55-INT(Q55))*100)-((INT(P55)*60)+((P55-INT(P55))*100)),0)","v":{"$error":"#VALUE!"}},{"$f":"ROUND((INT(R55)*60)+((R55-INT(R55))*100)-((INT(Q55)*60)+((Q55-INT(Q55))*100)),0)","v":{"$error":"#VALUE!"}},{"$f":"ROUND((INT(R55)*60)+((R55-INT(R55))*100)-((INT(P55)*60)+((P55-INT(P55))*100)),0)","v":{"$error":"#VALUE!"}},{"$f":"IF(AND(Q55<>0,P55<>0),IF(OR(N55=1,N55=3,N55=4),IF(OR(S55=0,ABS(S55)<='Barèmes & Options'!H$2),1,0)),\"\")","v":false},{"$f":"IF(AND(Q55<>\"\",P55<>\"\"),IF(OR(N55=5,N55=7),IF(S55>0,1,0)),\"\")","v":""},{"$f":"IF(AND(Q55<>\"\",P55<>\"\"),IF(OR(N55=2,N55=6,N55=8),IF(S55<0,1,0)),\"\")","v":""},{"$f":"IF(AND(Q55<>0,R55<>0),IF(OR(N55=1,N55=5,N55=6),IF(OR(T55=0,ABS(T55)<='Barèmes & Options'!H$2),1,0)),\"\")","v":false},{"$f":"IF(AND(Q55<>\"\",R55<>\"\"),IF(OR(N55=4,N55=8),IF(T55>0,1,0)),\"\")","v":""},{"$f":"IF(AND(Q55<>\"\",R55<>\"\"),IF(OR(N55=2,N55=3,N55=7),IF(T55<0,1,0)),\"\")","v":""},{"$f":"IF(SUM(V55:AA55)=2,IF(N55=2,IF(N55=2,IF(U55-'Barèmes & Options'!H$2<-1,0,1)),\"\"),0)","v":0},{"$f":"IF(OR(N55=2,N55=9),SUM(V55:AA55)-AB55,SUM(V55:AA55))","v":0},{"$f":"IF(OR(V55=1,W55=1,X55=1),TRUE,FALSE)","v":false},{"$f":"IF(OR(Y55=1,Z55=1,AA55=1),TRUE,FALSE)","v":false},{"$f":"IF(N55<>\"\",IF(AND(N55>=1,N55<=8,N55=ABS(N55)),IF(AND(N55<=9,N55>=1),IF(AND(AC55=1,H55<>\"\"),1,IF(AND(AC55=1,H55=\"\"),1.5,IF(AND(AC55=2,H55<>\"\"),2,IF(AND(AC55=2,H55=\"\"),3,0)))),\"\"),\"Err. Profil\"),\"\")","v":""},{"$f":"IF(O55<>\"\",IF(ROUND(M55,0)<=3,1,0),\"\")","v":""},{"$f":"IF(AND(R55<>\"\",Q55<>\"\",P55<>\"\"),IF($C55=\"\",\"SX\",IF($C55=\"F\",VLOOKUP(ROUND($L55,0)/100,Barème500,3),VLOOKUP(ROUND($L55,0)/100,Barème500,2))),\"\")","v":""},{"$f":"IF(OR(K55=\"\",K55=\"\",AH55=\"\",AG55=\"\",AF55=\"\"),\"\",IF(OR(K55<0,K55>2),\"Err ech.\",SUM(K55,AH55,AG55,AF55)))","v":""},null,null,null,null,null,{"$f":"IF(C55<>\"f\",\"m\",\"f\")","v":"m"}]
[null,null,null,null,null,null,null,null,null,null,null,{"$f":"IF(AND(R56<>\"\",Q56<>\"\",P56<>\"\"),(INT(((INT($P56)*60)+(($P56-INT($P56))*100)+(INT($Q56)*60)+(($Q56-INT($Q56))*100)+(INT($R56)*60)+(($R56-INT($R56))*100))/60)+MOD(((INT($P56)*60)+(($P56-INT($P56))*100)+(INT($Q56)*60)+(($Q56-INT($Q56))*100)+(INT($R56)*60)+(($R56-INT($R56))*100)),60)/100)*100,\"\")","v":""},{"$f":"IF(OR(O56=\"\",P56=\"\"),\"\",ABS((INT(P56)*60)+((P56-INT(P56))*100)-((INT(O56)*60)+((O56-INT(O56))*100))))","v":""},{"$f":"IF(AND(E56=\"\",H56=\"\"),\"\",IF(H56=\"\",E56,H56))","v":""},{"$f":"IF(F56=\"\",\"\",F56/100)","v":""},{"$f":"IF(G56=\"\",\"\",G56/100)","v":""},{"$f":"IF(I56=\"\",\"\",I56/100)","v":""},{"$f":"IF(J56=\"\",\"\",J56/100)","v":""},{"$f":"ROUND((INT(Q56)*60)+((Q56-INT(Q56))*100)-((INT(P56)*60)+((P56-INT(P56))*100)),0)","v":{"$error":"#VALUE!"}},{"$f":"ROUND((INT(R56)*60)+((R56-INT(R56))*100)-((INT(Q56)*60)+((Q56-INT(Q56))*100)),0)","v":{"$error":"#VALUE!"}},{"$f":"ROUND((INT(R56)*60)+((R56-INT(R56))*100)-((INT(P56)*60)+((P56-INT(P56))*100)),0)","v":{"$error":"#VALUE!"}},{"$f":"IF(AND(Q56<>0,P56<>0),IF(OR(N56=1,N56=3,N56=4),IF(OR(S56=0,ABS(S56)<='Barèmes & Options'!H$2),1,0)),\"\")","v":false},{"$f":"IF(AND(Q56<>\"\",P56<>\"\"),IF(OR(N56=5,N56=7),IF(S56>0,1,0)),\"\")","v":""},{"$f":"IF(AND(Q56<>\"\",P56<>\"\"),IF(OR(N56=2,N56=6,N56=8),IF(S56<0,1,0)),\"\")","v":""},{"$f":"IF(AND(Q56<>0,R56<>0),IF(OR(N56=1,N56=5,N56=6),IF(OR(T56=0,ABS(T56)<='Barèmes & Options'!H$2),1,0)),\"\")","v":false},{"$f":"IF(AND(Q56<>\"\",R56<>\"\"),IF(OR(N56=4,N56=8),IF(T56>0,1,0)),\"\")","v":""},{"$f":"IF(AND(Q56<>\"\",R56<>\"\"),IF(OR(N56=2,N56=3,N56=7),IF(T56<0,1,0)),\"\")","v":""},{"$f":"IF(SUM(V56:AA56)=2,IF(N56=2,IF(N56=2,IF(U56-'Barèmes & Options'!H$2<-1,0,1)),\"\"),0)","v":0},{"$f":"IF(OR(N56=2,N56=9),SUM(V56:AA56)-AB56,SUM(V56:AA56))","v":0},{"$f":"IF(OR(V56=1,W56=1,X56=1),TRUE,FALSE)","v":false},{"$f":"IF(OR(Y56=1,Z56=1,AA56=1),TRUE,FALSE)","v":false},{"$f":"IF(N56<>\"\",IF(AND(N56>=1,N56<=8,N56=ABS(N56)),IF(AND(N56<=9,N56>=1),IF(AND(AC56=1,H56<>\"\"),1,IF(AND(AC56=1,H56=\"\"),1.5,IF(AND(AC56=2,H56<>\"\"),2,IF(AND(AC56=2,H56=\"\"),3,0)))),\"\"),\"Err. Profil\"),\"\")","v":""},{"$f":"IF(O56<>\"\",IF(ROUND(M56,0)<=3,1,0),\"\")","v":""},{"$f":"IF(AND(R56<>\"\",Q56<>\"\",P56<>\"\"),IF($C56=\"\",\"SX\",IF($C56=\"F\",VLOOKUP(ROUND($L56,0)/100,Barème500,3),VLOOKUP(ROUND($L56,0)/100,Barème500,2))),\"\")","v":""},{"$f":"IF(OR(K56=\"\",K56=\"\",AH56=\"\",AG56=\"\",AF56=\"\"),\"\",IF(OR(K56<0,K56>2),\"Err ech.\",SUM(K56,AH56,AG56,AF56)))","v":""},null,null,null,null,null,{"$f":"IF(C56<>\"f\",\"m\",\"f\")","v":"m"}]
[null,null,null,null,null,null,null,null,null,null,null,{"$f":"IF(AND(R57<>\"\",Q57<>\"\",P57<>\"\"),(INT(((INT($P57)*60)+(($P57-INT($P57))*100)+(INT($Q57)*60)+(($Q57-INT($Q57))*100)+(INT($R57)*60)+(($R57-INT($R57))*100))/60)+MOD(((INT($P57)*60)+(($P57-INT($P57))*100)+(INT($Q57)*60)+(($Q57-INT($Q57))*100)+(INT($R57)*60)+(($R57-INT($R57))*100)),60)/100)*100,\"\")","v":""},{"$f":"IF(OR(O57=\"\",P57=\"\"),\"\",ABS((INT(P57)*60)+((P57-INT(P57))*100)-((INT(O57)*60)+((O57-INT(O57))*100))))","v":""},{"$f":"IF(AND(E57=\"\",H57=\"\"),\"\",IF(H57=\"\",E57,H57))","v":""},{"$f":"IF(F57=\"\",\"\",F57/100)","v":""},{"$f":"IF(G57=\"\",\"\",G57/100)","v":""},{"$f":"IF(I57=\"\",\"\",I57/100)","v":""},{"$f":"IF(J57=\"\",\"\",J57/100)","v":""},{"$f":"ROUND((INT(Q57)*60)+((Q57-INT(Q57))*100)-((INT(P57)*60)+((P57-INT(P57))*100)),0)","v":{"$error":"#VALUE!"}},{"$f":"ROUND((INT(R57)*60)+((R57-INT(R57))*100)-((INT(Q57)*60)+((Q57-INT(Q57))*100)),0)","v":{"$error":"#VALUE!"}},{"$f":"ROUND((INT(R57)*60)+((R57-INT(R57))*100)-((INT(P57)*60)+((P57-INT(P57))*100)),0)","v":{"$error":"#VALUE!"}},{"$f":"IF(AND(Q57<>0,P57<>0),IF(OR(N57=1,N57=3,N57=4),IF(OR(S57=0,ABS(S57)<='Barèmes & Options'!H$2),1,0)),\"\")","v":false},{"$f":"IF(AND(Q57<>\"\",P57<>\"\"),IF(OR(N57=5,N57=7),IF(S57>0,1,0)),\"\")","v":""},{"$f":"IF(AND(Q57<>\"\",P57<>\"\"),IF(OR(N57=2,N57=6,N57=8),IF(S57<0,1,0)),\"\")","v":""},{"$f":"IF(AND(Q57<>0,R57<>0),IF(OR(N57=1,N57=5,N57=6),IF(OR(T57=0,ABS(T57)<='Barèmes & Options'!H$2),1,0)),\"\")","v":false},{"$f":"IF(AND(Q57<>\"\",R57<>\"\"),IF(OR(N57=4,N57=8),IF(T57>0,1,0)),\"\")","v":""},{"$f":"IF(AND(Q57<>\"\",R57<>\"\"),IF(OR(N57=2,N57=3,N57=7),IF(T57<0,1,0)),\"\")","v":""},{"$f":"IF(SUM(V57:AA57)=2,IF(N57=2,IF(N57=2,IF(U57-'Barèmes & Options'!H$2<-1,0,1)),\"\"),0)","v":0},{"$f":"IF(OR(N57=2,N57=9),SUM(V57:AA57)-AB57,SUM(V57:AA57))","v":0},{"$f":"IF(OR(V57=1,W57=1,X57=1),TRUE,FALSE)","v":false},{"$f":"IF(OR(Y57=1,Z57=1,AA57=1),TRUE,FALSE)","v":false},{"$f":"IF(N57<>\"\",IF(AND(N57>=1,N57<=8,N57=ABS(N57)),IF(AND(N57<=9,N57>=1),IF(AND(AC57=1,H57<>\"\"),1,IF(AND(AC57=1,H57=\"\"),1.5,IF(AND(AC57=2,H57<>\"\"),2,IF(AND(AC57=2,H57=\"\"),3,0)))),\"\"),\"Err. Profil\"),\"\")","v":""},{"$f":"IF(O57<>\"\",IF(ROUND(M57,0)<=3,1,0),\"\")","v":""},{"$f":"IF(AND(R57<>\"\",Q57<>\"\",P57<>\"\"),IF($C57=\"\",\"SX\",IF($C57=\"F\",VLOOKUP(ROUND($L57,0)/100,Barème500,3),VLOOKUP(ROUND($L57,0)/100,Barème500,2))),\"\")","v":""},{"$f":"IF(OR(K57=\"\",K57=\"\",AH57=\"\",AG57=\"\",AF57=\"\"),\"\",IF(OR(K57<0,K57>2),\"Err ech.\",SUM(K57,AH57,AG57,AF57)))","v":""},null,null,null,null,null,{"$f":"IF(C57<>\"f\",\"m\",\"f\")","v":"m"}]
[null,null,null,null,null,null,null,null,null,null,null,{"$f":"IF(AND(R58<>\"\",Q58<>\"\",P58<>\"\"),(INT(((INT($P58)*60)+(($P58-INT($P58))*100)+(INT($Q58)*60)+(($Q58-INT($Q58))*100)+(INT($R58)*60)+(($R58-INT($R58))*100))/60)+MOD(((INT($P58)*60)+(($P58-INT($P58))*100)+(INT($Q58)*60)+(($Q58-INT($Q58))*100)+(INT($R58)*60)+(($R58-INT($R58))*100)),60)/100)*100,\"\")","v":""},{"$f":"IF(OR(O58=\"\",P58=\"\"),\"\",ABS((INT(P58)*60)+((P58-INT(P58))*100)-((INT(O58)*60)+((O58-INT(O58))*100))))","v":""},{"$f":"IF(AND(E58=\"\",H58=\"\"),\"\",IF(H58=\"\",E58,H58))","v":""},{"$f":"IF(F58=\"\",\"\",F58/100)","v":""},{"$f":"IF(G58=\"\",\"\",G58/100)","v":""},{"$f":"IF(I58=\"\",\"\",I58/100)","v":""},{"$f":"IF(J58=\"\",\"\",J58/100)","v":""},{"$f":"ROUND((INT(Q58)*60)+((Q58-INT(Q58))*100)-((INT(P58)*60)+((P58-INT(P58))*100)),0)","v":{"$error":"#VALUE!"}},{"$f":"ROUND((INT(R58)*60)+((R58-INT(R58))*100)-((INT(Q58)*60)+((Q58-INT(Q58))*100)),0)","v":{"$error":"#VALUE!"}},{"$f":"ROUND((INT(R58)*60)+((R58-INT(R58))*100)-((INT(P58)*60)+((P58-INT(P58))*100)),0)","v":{"$error":"#VALUE!"}},{"$f":"IF(AND(Q58<>0,P58<>0),IF(OR(N58=1,N58=3,N58=4),IF(OR(S58=0,ABS(S58)<='Barèmes & Options'!H$2),1,0)),\"\")","v":false},{"$f":"IF(AND(Q58<>\"\",P58<>\"\"),IF(OR(N58=5,N58=7),IF(S58>0,1,0)),\"\")","v":""},{"$f":"IF(AND(Q58<>\"\",P58<>\"\"),IF(OR(N58=2,N58=6,N58=8),IF(S58<0,1,0)),\"\")","v":""},{"$f":"IF(AND(Q58<>0,R58<>0),IF(OR(N58=1,N58=5,N58=6),IF(OR(T58=0,ABS(T58)<='Barèmes & Options'!H$2),1,0)),\"\")","v":false},{"$f":"IF(AND(Q58<>\"\",R58<>\"\"),IF(OR(N58=4,N58=8),IF(T58>0,1,0)),\"\")","v":""},{"$f":"IF(AND(Q58<>\"\",R58<>\"\"),IF(OR(N58=2,N58=3,N58=7),IF(T58<0,1,0)),\"\")","v":""},{"$f":"IF(SUM(V58:AA58)=2,IF(N58=2,IF(N58=2,IF(U58-'Barèmes & Options'!H$2<-1,0,1)),\"\"),0)","v":0},{"$f":"IF(OR(N58=2,N58=9),SUM(V58:AA58)-AB58,SUM(V58:AA58))","v":0},{"$f":"IF(OR(V58=1,W58=1,X58=1),TRUE,FALSE)","v":false},{"$f":"IF(OR(Y58=1,Z58=1,AA58=1),TRUE,FALSE)","v":false},{"$f":"IF(N58<>\"\",IF(AND(N58>=1,N58<=8,N58=ABS(N58)),IF(AND(N58<=9,N58>=1),IF(AND(AC58=1,H58<>\"\"),1,IF(AND(AC58=1,H58=\"\"),1.5,IF(AND(AC58=2,H58<>\"\"),2,IF(AND(AC58=2,H58=\"\"),3,0)))),\"\"),\"Err. Profil\"),\"\")","v":""},{"$f":"IF(O58<>\"\",IF(ROUND(M58,0)<=3,1,0),\"\")","v":""},{"$f":"IF(AND(R58<>\"\",Q58<>\"\",P58<>\"\"),IF($C58=\"\",\"SX\",IF($C58=\"F\",VLOOKUP(ROUND($L58,0)/100,Barème500,3),VLOOKUP(ROUND($L58,0)/100,Barème500,2))),\"\")","v":""},{"$f":"IF(OR(K58=\"\",K58=\"\",AH58=\"\",AG58=\"\",AF58=\"\"),\"\",IF(OR(K58<0,K58>2),\"Err ech.\",SUM(K58,AH58,AG58,AF58)))","v":""},null,null,null,null,null,{"$f":"IF(C58<>\"f\",\"m\",\"f\")","v":"m"}]
[null,null,null,null,null,null,null,null,null,null,null,{"$f":"IF(AND(R59<>\"\",Q59<>\"\",P59<>\"\"),(INT(((INT($P59)*60)+(($P59-INT($P59))*100)+(INT($Q59)*60)+(($Q59-INT($Q59))*100)+(INT($R59)*60)+(($R59-INT($R59))*100))/60)+MOD(((INT($P59)*60)+(($P59-INT($P59))*100)+(INT($Q59)*60)+(($Q59-INT($Q59))*100)+(INT($R59)*60)+(($R59-INT($R59))*100)),60)/100)*100,\"\")","v":""},{"$f":"IF(OR(O59=\"\",P59=\"\"),\"\",ABS((INT(P59)*60)+((P59-INT(P59))*100)-((INT(O59)*60)+((O59-INT(O59))*100))))","v":""},{"$f":"IF(AND(E59=\"\",H59=\"\"),\"\",IF(H59=\"\",E59,H59))","v":""},{"$f":"IF(F59=\"\",\"\",F59/100)","v":""},{"$f":"IF(G59=\"\",\"\",G59/100)","v":""},{"$f":"IF(I59=\"\",\"\",I59/100)","v":""},{"$f":"IF(J59=\"\",\"\",J59/100)","v":""},{"$f":"ROUND((INT(Q59)*60)+((Q59-INT(Q59))*100)-((INT(P59)*60)+((P59-INT(P59))*100)),0)","v":{"$error":"#VALUE!"}},{"$f":"ROUND((INT(R59)*60)+((R59-INT(R59))*100)-((INT(Q59)*60)+((Q59-INT(Q59))*100)),0)","v":{"$error":"#VALUE!"}},{"$f":"ROUND((INT(R59)*60)+((R59-INT(R59))*100)-((INT(P59)*60)+((P59-INT(P59))*100)),0)","v":{"$error":"#VALUE!"}},{"$f":"IF(AND(Q59<>0,P59<>0),IF(OR(N59=1,N59=3,N59=4),IF(OR(S59=0,ABS(S59)<='Barèmes & Options'!H$2),1,0)),\"\")","v":false},{"$f":"IF(AND(Q59<>\"\",P59<>\"\"),IF(OR(N59=5,N59=7),IF(S59>0,1,0)),\"\")","v":""},{"$f":"IF(AND(Q59<>\"\",P59<>\"\"),IF(OR(N59=2,N59=6,N59=8),IF(S59<0,1,0)),\"\")","v":""},{"$f":"IF(AND(Q59<>0,R59<>0),IF(OR(N59=1,N59=5,N59=6),IF(OR(T59=0,ABS(T59)<='Barèmes & Options'!H$2),1,0)),\"\")","v":false},{"$f":"IF(AND(Q59<>\"\",R59<>\"\"),IF(OR(N59=4,N59=8),IF(T59>0,1,0)),\"\")","v":""},{"$f":"IF(AND(Q59<>\"\",R59<>\"\"),IF(OR(N59=2,N59=3,N59=7),IF(T59<0,1,0)),\"\")","v":""},{"$f":"IF(SUM(V59:AA59)=2,IF(N59=2,IF(N59=2,IF(U59-'Barèmes & Options'!H$2<-1,0,1)),\"\"),0)","v":0},{"$f":"IF(OR(N59=2,N59=9),SUM(V59:AA59)-AB59,SUM(V59:AA59))","v":0},{"$f":"IF(OR(V59=1,W59=1,X59=1),TRUE,FALSE)","v":false},{"$f":"IF(OR(Y59=1,Z59=1,AA59=1),TRUE,FALSE)","v":false},{"$f":"IF(N59<>\"\",IF(AND(N59>=1,N59<=8,N59=ABS(N59)),IF(AND(N59<=9,N59>=1),IF(AND(AC59=1,H59<>\"\"),1,IF(AND(AC59=1,H59=\"\"),1.5,IF(AND(AC59=2,H59<>\"\"),2,IF(AND(AC59=2,H59=\"\"),3,0)))),\"\"),\"Err. Profil\"),\"\")","v":""},{"$f":"IF(O59<>\"\",IF(ROUND(M59,0)<=3,1,0),\"\")","v":""},{"$f":"IF(AND(R59<>\"\",Q59<>\"\",P59<>\"\"),IF($C59=\"\",\"SX\",IF($C59=\"F\",VLOOKUP(ROUND($L59,0)/100,Barème500,3),VLOOKUP(ROUND($L59,0)/100,Barème500,2))),\"\")","v":""},{"$f":"IF(OR(K59=\"\",K59=\"\",AH59=\"\",AG59=\"\",AF59=\"\"),\"\",IF(OR(K59<0,K59>2),\"Err ech.\",SUM(K59,AH59,AG59,AF59)))","v":""},null,null,null,null,null,{"$f":"IF(C59<>\"f\",\"m\",\"f\")","v":"m"}]
[null,null,null,null,null,null,null,null,null,null,null,{"$f":"IF(AND(R60<>\"\",Q60<>\"\",P60<>\"\"),(INT(((INT($P60)*60)+(($P60-INT($P60))*100)+(INT($Q60)*60)+(($Q60-INT($Q60))*100)+(INT($R60)*60)+(($R60-INT($R60))*100))/60)+MOD(((INT($P60)*60)+(($P60-INT($P60))*100)+(INT($Q60)*60)+(($Q60-INT($Q60))*100)+(INT($R60)*60)+(($R60-INT($R60))*100)),60)/100)*100,\"\")","v":""},{"$f":"IF(OR(O60=\"\",P60=\"\"),\"\",ABS((INT(P60)*60)+((P60-INT(P60))*100)-((INT(O60)*60)+((O60-INT(O60))*100))))","v":""},{"$f":"IF(AND(E60=\"\",H60=\"\"),\"\",IF(H60=\"\",E60,H60))","v":""},{"$f":"IF(F60=\"\",\"\",F60/100)","v":""},{"$f":"IF(G60=\"\",\"\",G60/100)","v":""},{"$f":"IF(I60=\"\",\"\",I60/100)","v":""},{"$f":"IF(J60=\"\",\"\",J60/100)","v":""},{"$f":"ROUND((INT(Q60)*60)+((Q60-INT(Q60))*100)-((INT(P60)*60)+((P60-INT(P60))*100)),0)","v":{"$error":"#VALUE!"}},{"$f":"ROUND((INT(R60)*60)+((R60-INT(R60))*100)-((INT(Q60)*60)+((Q60-INT(Q60))*100)),0)","v":{"$error":"#VALUE!"}},{"$f":"ROUND((INT(R60)*60)+((R60-INT(R60))*100)-((INT(P60)*60)+((P60-INT(P60))*100)),0)","v":{"$error":"#VALUE!"}},{"$f":"IF(AND(Q60<>0,P60<>0),IF(OR(N60=1,N60=3,N60=4),IF(OR(S60=0,ABS(S60)<='Barèmes & Options'!H$2),1,0)),\"\")","v":false},{"$f":"IF(AND(Q60<>\"\",P60<>\"\"),IF(OR(N60=5,N60=7),IF(S60>0,1,0)),\"\")","v":""},{"$f":"IF(AND(Q60<>\"\",P60<>\"\"),IF(OR(N60=2,N60=6,N60=8),IF(S60<0,1,0)),\"\")","v":""},{"$f":"IF(AND(Q60<>0,R60<>0),IF(OR(N60=1,N60=5,N60=6),IF(OR(T60=0,ABS(T60)<='Barèmes & Options'!H$2),1,0)),\"\")","v":false},{"$f":"IF(AND(Q60<>\"\",R60<>\"\"),IF(OR(N60=4,N60=8),IF(T60>0,1,0)),\"\")","v":""},{"$f":"IF(AND(Q60<>\"\",R60<>\"\"),IF(OR(N60=2,N60=3,N60=7),IF(T60<0,1,0)),\"\")","v":""},{"$f":"IF(SUM(V60:AA60)=2,IF(N60=2,IF(N60=2,IF(U60-'Barèmes & Options'!H$2<-1,0,1)),\"\"),0)","v":0},{"$f":"IF(OR(N60=2,N60=9),SUM(V60:AA60)-AB60,SUM(V60:AA60))","v":0},{"$f":"IF(OR(V60=1,W60=1,X60=1),TRUE,FALSE)","v":false},{"$f":"IF(OR(Y60=1,Z60=1,AA60=1),TRUE,FALSE)","v":false},{"$f":"IF(N60<>\"\",IF(AND(N60>=1,N60<=8,N60=ABS(N60)),IF(AND(N60<=9,N60>=1),IF(AND(AC60=1,H60<>\"\"),1,IF(AND(AC60=1,H60=\"\"),1.5,IF(AND(AC60=2,H60<>\"\"),2,IF(AND(AC60=2,H60=\"\"),3,0)))),\"\"),\"Err. Profil\"),\"\")","v":""},{"$f":"IF(O60<>\"\",IF(ROUND(M60,0)<=3,1,0),\"\")","v":""},{"$f":"IF(AND(R60<>\"\",Q60<>\"\",P60<>\"\"),IF($C60=\"\",\"SX\",IF($C60=\"F\",VLOOKUP(ROUND($L60,0)/100,Barème500,3),VLOOKUP(ROUND($L60,0)/100,Barème500,2))),\"\")","v":""},{"$f":"IF(OR(K60=\"\",K60=\"\",AH60=\"\",AG60=\"\",AF60=\"\"),\"\",IF(OR(K60<0,K60>2),\"Err ech.\",SUM(K60,AH60,AG60,AF60)))","v":""},null,null,null,null,null,{"$f":"IF(C60<>\"f\",\"m\",\"f\")","v":"m"}]
[null,null,null,null,null,null,null,null,null,null,null,{"$f":"IF(AND(R61<>\"\",Q61<>\"\",P61<>\"\"),(INT(((INT($P61)*60)+(($P61-INT($P61))*100)+(INT($Q61)*60)+(($Q61-INT($Q61))*100)+(INT($R61)*60)+(($R61-INT($R61))*100))/60)+MOD(((INT($P61)*60)+(($P61-INT($P61))*100)+(INT($Q61)*60)+(($Q61-INT($Q61))*100)+(INT($R61)*60)+(($R61-INT($R61))*100)),60)/100)*100,\"\")","v":""},{"$f":"IF(OR(O61=\"\",P61=\"\"),\"\",ABS((INT(P61)*60)+((P61-INT(P61))*100)-((INT(O61)*60)+((O61-INT(O61))*100))))","v":""},{"$f":"IF(AND(E61=\"\",H61=\"\"),\"\",IF(H61=\"\",E61,H61))","v":""},{"$f":"IF(F61=\"\",\"\",F61/100)","v":""},{"$f":"IF(G61=\"\",\"\",G61/100)","v":""},{"$f":"IF(I61=\"\",\"\",I61/100)","v":""},{"$f":"IF(J61=\"\",\"\",J61/100)","v":""},{"$f":"ROUND((INT(Q61)*60)+((Q61-INT(Q61))*100)-((INT(P61)*60)+((P61-INT(P61))*100)),0)","v":{"$error":"#VALUE!"}},{"$f":"ROUND((INT(R61)*60)+((R61-INT(R61))*100)-((INT(Q61)*60)+((Q61-INT(Q61))*100)),0)","v":{"$error":"#VALUE!"}},{"$f":"ROUND((INT(R61)*60)+((R61-INT(R61))*100)-((INT(P61)*60)+((P61-INT(P61))*100)),0)","v":{"$error":"#VALUE!"}},{"$f":"IF(AND(Q61<>0,P61<>0),IF(OR(N61=1,N61=3,N61=4),IF(OR(S61=0,ABS(S61)<='Barèmes & Options'!H$2),1,0)),\"\")","v":false},{"$f":"IF(AND(Q61<>\"\",P61<>\"\"),IF(OR(N61=5,N61=7),IF(S61>0,1,0)),\"\")","v":""},{"$f":"IF(AND(Q61<>\"\",P61<>\"\"),IF(OR(N61=2,N61=6,N61=8),IF(S61<0,1,0)),\"\")","v":""},{"$f":"IF(AND(Q61<>0,R61<>0),IF(OR(N61=1,N61=5,N61=6),IF(OR(T61=0,ABS(T61)<='Barèmes & Options'!H$2),1,0)),\"\")","v":false},{"$f":"IF(AND(Q61<>\"\",R61<>\"\"),IF(OR(N61=4,N61=8),IF(T61>0,1,0)),\"\")","v":""},{"$f":"IF(AND(Q61<>\"\",R61<>\"\"),IF(OR(N61=2,N61=3,N61=7),IF(T61<0,1,0)),\"\")","v":""},{"$f":"IF(SUM(V61:AA61)=2,IF(N61=2,IF(N61=2,IF(U61-'Barèmes & Options'!H$2<-1,0,1)),\"\"),0)","v":0},{"$f":"IF(OR(N61=2,N61=9),SUM(V61:AA61)-AB61,SUM(V61:AA61))","v":0},{"$f":"IF(OR(V61=1,W61=1,X61=1),TRUE,FALSE)","v":false},{"$f":"IF(OR(Y61=1,Z61=1,AA61=1),TRUE,FALSE)","v":false},{"$f":"IF(N61<>\"\",IF(AND(N61>=1,N61<=8,N61=ABS(N61)),IF(AND(N61<=9,N61>=1),IF(AND(AC61=1,H61<>\"\"),1,IF(AND(AC61=1,H61=\"\"),1.5,IF(AND(AC61=2,H61<>\"\"),2,IF(AND(AC61=2,H61=\"\"),3,0)))),\"\"),\"Err. Profil\"),\"\")","v":""},{"$f":"IF(O61<>\"\",IF(ROUND(M61,0)<=3,1,0),\"\")","v":""},{"$f":"IF(AND(R61<>\"\",Q61<>\"\",P61<>\"\"),IF($C61=\"\",\"SX\",IF($C61=\"F\",VLOOKUP(ROUND($L61,0)/100,Barème500,3),VLOOKUP(ROUND($L61,0)/100,Barème500,2))),\"\")","v":""},{"$f":"IF(OR(K61=\"\",K61=\"\",AH61=\"\",AG61=\"\",AF61=\"\"),\"\",IF(OR(K61<0,K61>2),\"Err ech.\",SUM(K61,AH61,AG61,AF61)))","v":""},null,null,null,null,null,{"$f":"IF(C61<>\"f\",\"m\",\"f\")","v":"m"}]
[null,null,null,null,null,null,null,null,null,null,null,{"$f":"IF(AND(R62<>\"\",Q62<>\"\",P62<>\"\"),(INT(((INT($P62)*60)+(($P62-INT($P62))*100)+(INT($Q62)*60)+(($Q62-INT($Q62))*100)+(INT($R62)*60)+(($R62-INT($R62))*100))/60)+MOD(((INT($P62)*60)+(($P62-INT($P62))*100)+(INT($Q62)*60)+(($Q62-INT($Q62))*100)+(INT($R62)*60)+(($R62-INT($R62))*100)),60)/100)*100,\"\")","v":""},{"$f":"IF(OR(O62=\"\",P62=\"\"),\"\",ABS((INT(P62)*60)+((P62-INT(P62))*100)-((INT(O62)*60)+((O62-INT(O62))*100))))","v":""},{"$f":"IF(AND(E62=\"\",H62=\"\"),\"\",IF(H62=\"\",E62,H62))","v":""},{"$f":"IF(F62=\"\",\"\",F62/100)","v":""},{"$f":"IF(G62=\"\",\"\",G62/100)","v":""},{"$f":"IF(I62=\"\",\"\",I62/100)","v":""},{"$f":"IF(J62=\"\",\"\",J62/100)","v":""},{"$f":"ROUND((INT(Q62)*60)+((Q62-INT(Q62))*100)-((INT(P62)*60)+((P62-INT(P62))*100)),0)","v":{"$error":"#VALUE!"}},{"$f":"ROUND((INT(R62)*60)+((R62-INT(R62))*100)-((INT(Q62)*60)+((Q62-INT(Q62))*100)),0)","v":{"$error":"#VALUE!"}},{"$f":"ROUND((INT(R62)*60)+((R62-INT(R62))*100)-((INT(P62)*60)+((P62-INT(P62))*100)),0)","v":{"$error":"#VALUE!"}},{"$f":"IF(AND(Q62<>0,P62<>0),IF(OR(N62=1,N62=3,N62=4),IF(OR(S62=0,ABS(S62)<='Barèmes & Options'!H$2),1,0)),\"\")","v":false},{"$f":"IF(AND(Q62<>\"\",P62<>\"\"),IF(OR(N62=5,N62=7),IF(S62>0,1,0)),\"\")","v":""},{"$f":"IF(AND(Q62<>\"\",P62<>\"\"),IF(OR(N62=2,N62=6,N62=8),IF(S62<0,1,0)),\"\")","v":""},{"$f":"IF(AND(Q62<>0,R62<>0),IF(OR(N62=1,N62=5,N62=6),IF(OR(T62=0,ABS(T62)<='Barèmes & Options'!H$2),1,0)),\"\")","v":false},{"$f":"IF(AND(Q62<>\"\",R62<>\"\"),IF(OR(N62=4,N62=8),IF(T62>0,1,0)),\"\")","v":""},{"$f":"IF(AND(Q62<>\"\",R62<>\"\"),IF(OR(N62=2,N62=3,N62=7),IF(T62<0,1,0)),\"\")","v":""},{"$f":"IF(SUM(V62:AA62)=2,IF(N62=2,IF(N62=2,IF(U62-'Barèmes & Options'!H$2<-1,0,1)),\"\"),0)","v":0},{"$f":"IF(OR(N62=2,N62=9),SUM(V62:AA62)-AB62,SUM(V62:AA62))","v":0},{"$f":"IF(OR(V62=1,W62=1,X62=1),TRUE,FALSE)","v":false},{"$f":"IF(OR(Y62=1,Z62=1,AA62=1),TRUE,FALSE)","v":false},{"$f":"IF(N62<>\"\",IF(AND(N62>=1,N62<=8,N62=ABS(N62)),IF(AND(N62<=9,N62>=1),IF(AND(AC62=1,H62<>\"\"),1,IF(AND(AC62=1,H62=\"\"),1.5,IF(AND(AC62=2,H62<>\"\"),2,IF(AND(AC62=2,H62=\"\"),3,0)))),\"\"),\"Err. Profil\"),\"\")","v":""},{"$f":"IF(O62<>\"\",IF(ROUND(M62,0)<=3,1,0),\"\")","v":""},{"$f":"IF(AND(R62<>\"\",Q62<>\"\",P62<>\"\"),IF($C62=\"\",\"SX\",IF($C62=\"F\",VLOOKUP(ROUND($L62,0)/100,Barème500,3),VLOOKUP(ROUND($L62,0)/100,Barème500,2))),\"\")","v":""},{"$f":"IF(OR(K62=\"\",K62=\"\",AH62=\"\",AG62=\"\",AF62=\"\"),\"\",IF(OR(K62<0,K62>2),\"Err ech.\",SUM(K62,AH62,AG62,AF62)))","v":""},null,null,null,null,null,{"$f":"IF(C62<>\"f\",\"m\",\"f\")","v":"m"}]
[null,null,null,null,null,null,null,null,null,null,null,{"$f":"IF(AND(R63<>\"\",Q63<>\"\",P63<>\"\"),(INT(((INT($P63)*60)+(($P63-INT($P63))*100)+(INT($Q63)*60)+(($Q63-INT($Q63))*100)+(INT($R63)*60)+(($R63-INT($R63))*100))/60)+MOD(((INT($P63)*60)+(($P63-INT($P63))*100)+(INT($Q63)*60)+(($Q63-INT($Q63))*100)+(INT($R63)*60)+(($R63-INT($R63))*100)),60)/100)*100,\"\")","v":""},{"$f":"IF(OR(O63=\"\",P63=\"\"),\"\",ABS((INT(P63)*60)+((P63-INT(P63))*100)-((INT(O63)*60)+((O63-INT(O63))*100))))","v":""},{"$f":"IF(AND(E63=\"\",H63=\"\"),\"\",IF(H63=\"\",E63,H63))","v":""},{"$f":"IF(F63=\"\",\"\",F63/100)","v":""},{"$f":"IF(G63=\"\",\"\",G63/100)","v":""},{"$f":"IF(I63=\"\",\"\",I63/100)","v":""},{"$f":"IF(J63=\"\",\"\",J63/100)","v":""},{"$f":"ROUND((INT(Q63)*60)+((Q63-INT(Q63))*100)-((INT(P63)*60)+((P63-INT(P63))*100)),0)","v":{"$error":"#VALUE!"}},{"$f":"ROUND((INT(R63)*60)+((R63-INT(R63))*100)-((INT(Q63)*60)+((Q63-INT(Q63))*100)),0)","v":{"$error":"#VALUE!"}},{"$f":"ROUND((INT(R63)*60)+((R63-INT(R63))*100)-((INT(P63)*60)+((P63-INT(P63))*100)),0)","v":{"$error":"#VALUE!"}},{"$f":"IF(AND(Q63<>0,P63<>0),IF(OR(N63=1,N63=3,N63=4),IF(OR(S63=0,ABS(S63)<='Barèmes & Options'!H$2),1,0)),\"\")","v":false},{"$f":"IF(AND(Q63<>\"\",P63<>\"\"),IF(OR(N63=5,N63=7),IF(S63>0,1,0)),\"\")","v":""},{"$f":"IF(AND(Q63<>\"\",P63<>\"\"),IF(OR(N63=2,N63=6,N63=8),IF(S63<0,1,0)),\"\")","v":""},{"$f":"IF(AND(Q63<>0,R63<>0),IF(OR(N63=1,N63=5,N63=6),IF(OR(T63=0,ABS(T63)<='Barèmes & Options'!H$2),1,0)),\"\")","v":false},{"$f":"IF(AND(Q63<>\"\",R63<>\"\"),IF(OR(N63=4,N63=8),IF(T63>0,1,0)),\"\")","v":""},{"$f":"IF(AND(Q63<>\"\",R63<>\"\"),IF(OR(N63=2,N63=3,N63=7),IF(T63<0,1,0)),\"\")","v":""},{"$f":"IF(SUM(V63:AA63)=2,IF(N63=2,IF(N63=2,IF(U63-'Barèmes & Options'!H$2<-1,0,1)),\"\"),0)","v":0},{"$f":"IF(OR(N63=2,N63=9),SUM(V63:AA63)-AB63,SUM(V63:AA63))","v":0},{"$f":"IF(OR(V63=1,W63=1,X63=1),TRUE,FALSE)","v":false},{"$f":"IF(OR(Y63=1,Z63=1,AA63=1),TRUE,FALSE)","v":false},{"$f":"IF(N63<>\"\",IF(AND(N63>=1,N63<=8,N63=ABS(N63)),IF(AND(N63<=9,N63>=1),IF(AND(AC63=1,H63<>\"\"),1,IF(AND(AC63=1,H63=\"\"),1.5,IF(AND(AC63=2,H63<>\"\"),2,IF(AND(AC63=2,H63=\"\"),3,0)))),\"\"),\"Err. Profil\"),\"\")","v":""},{"$f":"IF(O63<>\"\",IF(ROUND(M63,0)<=3,1,0),\"\")","v":""},{"$f":"IF(AND(R63<>\"\",Q63<>\"\",P63<>\"\"),IF($C63=\"\",\"SX\",IF($C63=\"F\",VLOOKUP(ROUND($L63,0)/100,Barème500,3),VLOOKUP(ROUND($L63,0)/100,Barème500,2))),\"\")","v":""},{"$f":"IF(OR(K63=\"\",K63=\"\",AH63=\"\",AG63=\"\",AF63=\"\"),\"\",IF(OR(K63<0,K63>2),\"Err ech.\",SUM(K63,AH63,AG63,AF63)))","v":""},null,null,null,null,null,{"$f":"IF(C63<>\"f\",\"m\",\"f\")","v":"m"}]
[null,null,null,null,null,null,null,null,null,null,null,{"$f":"IF(AND(R64<>\"\",Q64<>\"\",P64<>\"\"),(INT(((INT($P64)*60)+(($P64-INT($P64))*100)+(INT($Q64)*60)+(($Q64-INT($Q64))*100)+(INT($R64)*60)+(($R64-INT($R64))*100))/60)+MOD(((INT($P64)*60)+(($P64-INT($P64))*100)+(INT($Q64)*60)+(($Q64-INT($Q64))*100)+(INT($R64)*60)+(($R64-INT($R64))*100)),60)/100)*100,\"\")","v":""},{"$f":"IF(OR(O64=\"\",P64=\"\"),\"\",ABS((INT(P64)*60)+((P64-INT(P64))*100)-((INT(O64)*60)+((O64-INT(O64))*100))))","v":""},{"$f":"IF(AND(E64=\"\",H64=\"\"),\"\",IF(H64=\"\",E64,H64))","v":""},{"$f":"IF(F64=\"\",\"\",F64/100)","v":""},{"$f":"IF(G64=\"\",\"\",G64/100)","v":""},{"$f":"IF(I64=\"\",\"\",I64/100)","v":""},{"$f":"IF(J64=\"\",\"\",J64/100)","v":""},{"$f":"ROUND((INT(Q64)*60)+((Q64-INT(Q64))*100)-((INT(P64)*60)+((P64-INT(P64))*100)),0)","v":{"$error":"#VALUE!"}},{"$f":"ROUND((INT(R64)*60)+((R64-INT(R64))*100)-((INT(Q64)*60)+((Q64-INT(Q64))*100)),0)","v":{"$error":"#VALUE!"}},{"$f":"ROUND((INT(R64)*60)+((R64-INT(R64))*100)-((INT(P64)*60)+((P64-INT(P64))*100)),0)","v":{"$error":"#VALUE!"}},{"$f":"IF(AND(Q64<>0,P64<>0),IF(OR(N64=1,N64=3,N64=4),IF(OR(S64=0,ABS(S64)<='Barèmes & Options'!H$2),1,0)),\"\")","v":false},{"$f":"IF(AND(Q64<>\"\",P64<>\"\"),IF(OR(N64=5,N64=7),IF(S64>0,1,0)),\"\")","v":""},{"$f":"IF(AND(Q64<>\"\",P64<>\"\"),IF(OR(N64=2,N64=6,N64=8),IF(S64<0,1,0)),\"\")","v":""},{"$f":"IF(AND(Q64<>0,R64<>0),IF(OR(N64=1,N64=5,N64=6),IF(OR(T64=0,ABS(T64)<='Barèmes & Options'!H$2),1,0)),\"\")","v":false},{"$f":"IF(AND(Q64<>\"\",R64<>\"\"),IF(OR(N64=4,N64=8),IF(T64>0,1,0)),\"\")","v":""},{"$f":"IF(AND(Q64<>\"\",R64<>\"\"),IF(OR(N64=2,N64=3,N64=7),IF(T64<0,1,0)),\"\")","v":""},{"$f":"IF(SUM(V64:AA64)=2,IF(N64=2,IF(N64=2,IF(U64-'Barèmes & Options'!H$2<-1,0,1)),\"\"),0)","v":0},{"$f":"IF(OR(N64=2,N64=9),SUM(V64:AA64)-AB64,SUM(V64:AA64))","v":0},{"$f":"IF(OR(V64=1,W64=1,X64=1),TRUE,FALSE)","v":false},{"$f":"IF(OR(Y64=1,Z64=1,AA64=1),TRUE,FALSE)","v":false},{"$f":"IF(N64<>\"\",IF(AND(N64>=1,N64<=8,N64=ABS(N64)),IF(AND(N64<=9,N64>=1),IF(AND(AC64=1,H64<>\"\"),1,IF(AND(AC64=1,H64=\"\"),1.5,IF(AND(AC64=2,H64<>\"\"),2,IF(AND(AC64=2,H64=\"\"),3,0)))),\"\"),\"Err. Profil\"),\"\")","v":""},{"$f":"IF(O64<>\"\",IF(ROUND(M64,0)<=3,1,0),\"\")","v":""},{"$f":"IF(AND(R64<>\"\",Q64<>\"\",P64<>\"\"),IF($C64=\"\",\"SX\",IF($C64=\"F\",VLOOKUP(ROUND($L64,0)/100,Barème500,3),VLOOKUP(ROUND($L64,0)/100,Barème500,2))),\"\")","v":""},{"$f":"IF(OR(K64=\"\",K64=\"\",AH64=\"\",AG64=\"\",AF64=\"\"),\"\",IF(OR(K64<0,K64>2),\"Err ech.\",SUM(K64,AH64,AG64,AF64)))","v":""},null,null,null,null,null,{"$f":"IF(C64<>\"f\",\"m\",\"f\")","v":"m"}]
[null,null,null,null,null,null,null,null,null,null,null,{"$f":"IF(AND(R65<>\"\",Q65<>\"\",P65<>\"\"),(INT(((INT($P65)*60)+(($P65-INT($P65))*100)+(INT($Q65)*60)+(($Q65-INT($Q65))*100)+(INT($R65)*60)+(($R65-INT($R65))*100))/60)+MOD(((INT($P65)*60)+(($P65-INT($P65))*100)+(INT($Q65)*60)+(($Q65-INT($Q65))*100)+(INT($R65)*60)+(($R65-INT($R65))*100)),60)/100)*100,\"\")","v":""},{"$f":"IF(OR(O65=\"\",P65=\"\"),\"\",ABS((INT(P65)*60)+((P65-INT(P65))*100)-((INT(O65)*60)+((O65-INT(O65))*100))))","v":""},{"$f":"IF(AND(E65=\"\",H65=\"\"),\"\",IF(H65=\"\",E65,H65))","v":""},{"$f":"IF(F65=\"\",\"\",F65/100)","v":""},{"$f":"IF(G65=\"\",\"\",G65/100)","v":""},{"$f":"IF(I65=\"\",\"\",I65/100)","v":""},{"$f":"IF(J65=\"\",\"\",J65/100)","v":""},{"$f":"ROUND((INT(Q65)*60)+((Q65-INT(Q65))*100)-((INT(P65)*60)+((P65-INT(P65))*100)),0)","v":{"$error":"#VALUE!"}},{"$f":"ROUND((INT(R65)*60)+((R65-INT(R65))*100)-((INT(Q65)*60)+((Q65-INT(Q65))*100)),0)","v":{"$error":"#VALUE!"}},{"$f":"ROUND((INT(R65)*60)+((R65-INT(R65))*100)-((INT(P65)*60)+((P65-INT(P65))*100)),0)","v":{"$error":"#VALUE!"}},{"$f":"IF(AND(Q65<>0,P65<>0),IF(OR(N65=1,N65=3,N65=4),IF(OR(S65=0,ABS(S65)<='Barèmes & Options'!H$2),1,0)),\"\")","v":false},{"$f":"IF(AND(Q65<>\"\",P65<>\"\"),IF(OR(N65=5,N65=7),IF(S65>0,1,0)),\"\")","v":""},{"$f":"IF(AND(Q65<>\"\",P65<>\"\"),IF(OR(N65=2,N65=6,N65=8),IF(S65<0,1,0)),\"\")","v":""},{"$f":"IF(AND(Q65<>0,R65<>0),IF(OR(N65=1,N65=5,N65=6),IF(OR(T65=0,ABS(T65)<='Barèmes & Options'!H$2),1,0)),\"\")","v":false},{"$f":"IF(AND(Q65<>\"\",R65<>\"\"),IF(OR(N65=4,N65=8),IF(T65>0,1,0)),\"\")","v":""},{"$f":"IF(AND(Q65<>\"\",R65<>\"\"),IF(OR(N65=2,N65=3,N65=7),IF(T65<0,1,0)),\"\")","v":""},{"$f":"IF(SUM(V65:AA65)=2,IF(N65=2,IF(N65=2,IF(U65-'Barèmes & Options'!H$2<-1,0,1)),\"\"),0)","v":0},{"$f":"IF(OR(N65=2,N65=9),SUM(V65:AA65)-AB65,SUM(V65:AA65))","v":0},{"$f":"IF(OR(V65=1,W65=1,X65=1),TRUE,FALSE)","v":false},{"$f":"IF(OR(Y65=1,Z65=1,AA65=1),TRUE,FALSE)","v":false},{"$f":"IF(N65<>\"\",IF(AND(N65>=1,N65<=8,N65=ABS(N65)),IF(AND(N65<=9,N65>=1),IF(AND(AC65=1,H65<>\"\"),1,IF(AND(AC65=1,H65=\"\"),1.5,IF(AND(AC65=2,H65<>\"\"),2,IF(AND(AC65=2,H65=\"\"),3,0)))),\"\"),\"Err. Profil\"),\"\")","v":""},{"$f":"IF(O65<>\"\",IF(ROUND(M65,0)<=3,1,0),\"\")","v":""},{"$f":"IF(AND(R65<>\"\",Q65<>\"\",P65<>\"\"),IF($C65=\"\",\"SX\",IF($C65=\"F\",VLOOKUP(ROUND($L65,0)/100,Barème500,3),VLOOKUP(ROUND($L65,0)/100,Barème500,2))),\"\")","v":""},{"$f":"IF(OR(K65=\"\",K65=\"\",AH65=\"\",AG65=\"\",AF65=\"\"),\"\",IF(OR(K65<0,K65>2),\"Err ech.\",SUM(K65,AH65,AG65,AF65)))","v":""},null,null,null,null,null,{"$f":"IF(C65<>\"f\",\"m\",\"f\")","v":"m"}]
[null,null,null,null,null,null,null,null,null,null,null,{"$f":"IF(AND(R66<>\"\",Q66<>\"\",P66<>\"\"),(INT(((INT($P66)*60)+(($P66-INT($P66))*100)+(INT($Q66)*60)+(($Q66-INT($Q66))*100)+(INT($R66)*60)+(($R66-INT($R66))*100))/60)+MOD(((INT($P66)*60)+(($P66-INT($P66))*100)+(INT($Q66)*60)+(($Q66-INT($Q66))*100)+(INT($R66)*60)+(($R66-INT($R66))*100)),60)/100)*100,\"\")","v":""},{"$f":"IF(OR(O66=\"\",P66=\"\"),\"\",ABS((INT(P66)*60)+((P66-INT(P66))*100)-((INT(O66)*60)+((O66-INT(O66))*100))))","v":""},{"$f":"IF(AND(E66=\"\",H66=\"\"),\"\",IF(H66=\"\",E66,H66))","v":""},{"$f":"IF(F66=\"\",\"\",F66/100)","v":""},{"$f":"IF(G66=\"\",\"\",G66/100)","v":""},{"$f":"IF(I66=\"\",\"\",I66/100)","v":""},{"$f":"IF(J66=\"\",\"\",J66/100)","v":""},{"$f":"ROUND((INT(Q66)*60)+((Q66-INT(Q66))*100)-((INT(P66)*60)+((P66-INT(P66))*100)),0)","v":{"$error":"#VALUE!"}},{"$f":"ROUND((INT(R66)*60)+((R66-INT(R66))*100)-((INT(Q66)*60)+((Q66-INT(Q66))*100)),0)","v":{"$error":"#VALUE!"}},{"$f":"ROUND((INT(R66)*60)+((R66-INT(R66))*100)-((INT(P66)*60)+((P66-INT(P66))*100)),0)","v":{"$error":"#VALUE!"}},{"$f":"IF(AND(Q66<>0,P66<>0),IF(OR(N66=1,N66=3,N66=4),IF(OR(S66=0,ABS(S66)<='Barèmes & Options'!H$2),1,0)),\"\")","v":false},{"$f":"IF(AND(Q66<>\"\",P66<>\"\"),IF(OR(N66=5,N66=7),IF(S66>0,1,0)),\"\")","v":""},{"$f":"IF(AND(Q66<>\"\",P66<>\"\"),IF(OR(N66=2,N66=6,N66=8),IF(S66<0,1,0)),\"\")","v":""},{"$f":"IF(AND(Q66<>0,R66<>0),IF(OR(N66=1,N66=5,N66=6),IF(OR(T66=0,ABS(T66)<='Barèmes & Options'!H$2),1,0)),\"\")","v":false},{"$f":"IF(AND(Q66<>\"\",R66<>\"\"),IF(OR(N66=4,N66=8),IF(T66>0,1,0)),\"\")","v":""},{"$f":"IF(AND(Q66<>\"\",R66<>\"\"),IF(OR(N66=2,N66=3,N66=7),IF(T66<0,1,0)),\"\")","v":""},{"$f":"IF(SUM(V66:AA66)=2,IF(N66=2,IF(N66=2,IF(U66-'Barèmes & Options'!H$2<-1,0,1)),\"\"),0)","v":0},{"$f":"IF(OR(N66=2,N66=9),SUM(V66:AA66)-AB66,SUM(V66:AA66))","v":0},{"$f":"IF(OR(V66=1,W66=1,X66=1),TRUE,FALSE)","v":false},{"$f":"IF(OR(Y66=1,Z66=1,AA66=1),TRUE,FALSE)","v":false},{"$f":"IF(N66<>\"\",IF(AND(N66>=1,N66<=8,N66=ABS(N66)),IF(AND(N66<=9,N66>=1),IF(AND(AC66=1,H66<>\"\"),1,IF(AND(AC66=1,H66=\"\"),1.5,IF(AND(AC66=2,H66<>\"\"),2,IF(AND(AC66=2,H66=\"\"),3,0)))),\"\"),\"Err. Profil\"),\"\")","v":""},{"$f":"IF(O66<>\"\",IF(ROUND(M66,0)<=3,1,0),\"\")","v":""},{"$f":"IF(AND(R66<>\"\",Q66<>\"\",P66<>\"\"),IF($C66=\"\",\"SX\",IF($C66=\"F\",VLOOKUP(ROUND($L66,0)/100,Barème500,3),VLOOKUP(ROUND($L66,0)/100,Barème500,2))),\"\")","v":""},{"$f":"IF(OR(K66=\"\",K66=\"\",AH66=\"\",AG66=\"\",AF66=\"\"),\"\",IF(OR(K66<0,K66>2),\"Err ech.\",SUM(K66,AH66,AG66,AF66)))","v":""},null,null,null,null,null,{"$f":"IF(C66<>\"f\",\"m\",\"f\")","v":"m"}]
[null,null,null,null,null,null,null,null,null,null,null,{"$f":"IF(AND(R67<>\"\",Q67<>\"\",P67<>\"\"),(INT(((INT($P67)*60)+(($P67-INT($P67))*100)+(INT($Q67)*60)+(($Q67-INT($Q67))*100)+(INT($R67)*60)+(($R67-INT($R67))*100))/60)+MOD(((INT($P67)*60)+(($P67-INT($P67))*100)+(INT($Q67)*60)+(($Q67-INT($Q67))*100)+(INT($R67)*60)+(($R67-INT($R67))*100)),60)/100)*100,\"\")","v":""},{"$f":"IF(OR(O67=\"\",P67=\"\"),\"\",ABS((INT(P67)*60)+((P67-INT(P67))*100)-((INT(O67)*60)+((O67-INT(O67))*100))))","v":""},{"$f":"IF(AND(E67=\"\",H67=\"\"),\"\",IF(H67=\"\",E67,H67))","v":""},{"$f":"IF(F67=\"\",\"\",F67/100)","v":""},{"$f":"IF(G67=\"\",\"\",G67/100)","v":""},{"$f":"IF(I67=\"\",\"\",I67/100)","v":""},{"$f":"IF(J67=\"\",\"\",J67/100)","v":""},{"$f":"ROUND((INT(Q67)*60)+((Q67-INT(Q67))*100)-((INT(P67)*60)+((P67-INT(P67))*100)),0)","v":{"$error":"#VALUE!"}},{"$f":"ROUND((INT(R67)*60)+((R67-INT(R67))*100)-((INT(Q67)*60)+((Q67-INT(Q67))*100)),0)","v":{"$error":"#VALUE!"}},{"$f":"ROUND((INT(R67)*60)+((R67-INT(R67))*100)-((INT(P67)*60)+((P67-INT(P67))*100)),0)","v":{"$error":"#VALUE!"}},{"$f":"IF(AND(Q67<>0,P67<>0),IF(OR(N67=1,N67=3,N67=4),IF(OR(S67=0,ABS(S67)<='Barèmes & Options'!H$2),1,0)),\"\")","v":false},{"$f":"IF(AND(Q67<>\"\",P67<>\"\"),IF(OR(N67=5,N67=7),IF(S67>0,1,0)),\"\")","v":""},{"$f":"IF(AND(Q67<>\"\",P67<>\"\"),IF(OR(N67=2,N67=6,N67=8),IF(S67<0,1,0)),\"\")","v":""},{"$f":"IF(AND(Q67<>0,R67<>0),IF(OR(N67=1,N67=5,N67=6),IF(OR(T67=0,ABS(T67)<='Barèmes & Options'!H$2),1,0)),\"\")","v":false},{"$f":"IF(AND(Q67<>\"\",R67<>\"\"),IF(OR(N67=4,N67=8),IF(T67>0,1,0)),\"\")","v":""},{"$f":"IF(AND(Q67<>\"\",R67<>\"\"),IF(OR(N67=2,N67=3,N67=7),IF(T67<0,1,0)),\"\")","v":""},{"$f":"IF(SUM(V67:AA67)=2,IF(N67=2,IF(N67=2,IF(U67-'Barèmes & Options'!H$2<-1,0,1)),\"\"),0)","v":0},{"$f":"IF(OR(N67=2,N67=9),SUM(V67:AA67)-AB67,SUM(V67:AA67))","v":0},{"$f":"IF(OR(V67=1,W67=1,X67=1),TRUE,FALSE)","v":false},{"$f":"IF(OR(Y67=1,Z67=1,AA67=1),TRUE,FALSE)","v":false},{"$f":"IF(N67<>\"\",IF(AND(N67>=1,N67<=8,N67=ABS(N67)),IF(AND(N67<=9,N67>=1),IF(AND(AC67=1,H67<>\"\"),1,IF(AND(AC67=1,H67=\"\"),1.5,IF(AND(AC67=2,H67<>\"\"),2,IF(AND(AC67=2,H67=\"\"),3,0)))),\"\"),\"Err. Profil\"),\"\")","v":""},{"$f":"IF(O67<>\"\",IF(ROUND(M67,0)<=3,1,0),\"\")","v":""},{"$f":"IF(AND(R67<>\"\",Q67<>\"\",P67<>\"\"),IF($C67=\"\",\"SX\",IF($C67=\"F\",VLOOKUP(ROUND($L67,0)/100,Barème500,3),VLOOKUP(ROUND($L67,0)/100,Barème500,2))),\"\")","v":""},{"$f":"IF(OR(K67=\"\",K67=\"\",AH67=\"\",AG67=\"\",AF67=\"\"),\"\",IF(OR(K67<0,K67>2),\"Err ech.\",SUM(K67,AH67,AG67,AF67)))","v":""},null,null,null,null,null,{"$f":"IF(C67<>\"f\",\"m\",\"f\")","v":"m"}]
[null,null,null,null,null,null,null,null,null,null,null,{"$f":"IF(AND(R68<>\"\",Q68<>\"\",P68<>\"\"),(INT(((INT($P68)*60)+(($P68-INT($P68))*100)+(INT($Q68)*60)+(($Q68-INT($Q68))*100)+(INT($R68)*60)+(($R68-INT($R68))*100))/60)+MOD(((INT($P68)*60)+(($P68-INT($P68))*100)+(INT($Q68)*60)+(($Q68-INT($Q68))*100)+(INT($R68)*60)+(($R68-INT($R68))*100)),60)/100)*100,\"\")","v":""},{"$f":"IF(OR(O68=\"\",P68=\"\"),\"\",ABS((INT(P68)*60)+((P68-INT(P68))*100)-((INT(O68)*60)+((O68-INT(O68))*100))))","v":""},{"$f":"IF(AND(E68=\"\",H68=\"\"),\"\",IF(H68=\"\",E68,H68))","v":""},{"$f":"IF(F68=\"\",\"\",F68/100)","v":""},{"$f":"IF(G68=\"\",\"\",G68/100)","v":""},{"$f":"IF(I68=\"\",\"\",I68/100)","v":""},{"$f":"IF(J68=\"\",\"\",J68/100)","v":""},{"$f":"ROUND((INT(Q68)*60)+((Q68-INT(Q68))*100)-((INT(P68)*60)+((P68-INT(P68))*100)),0)","v":{"$error":"#VALUE!"}},{"$f":"ROUND((INT(R68)*60)+((R68-INT(R68))*100)-((INT(Q68)*60)+((Q68-INT(Q68))*100)),0)","v":{"$error":"#VALUE!"}},{"$f":"ROUND((INT(R68)*60)+((R68-INT(R68))*100)-((INT(P68)*60)+((P68-INT(P68))*100)),0)","v":{"$error":"#VALUE!"}},{"$f":"IF(AND(Q68<>0,P68<>0),IF(OR(N68=1,N68=3,N68=4),IF(OR(S68=0,ABS(S68)<='Barèmes & Options'!H$2),1,0)),\"\")","v":false},{"$f":"IF(AND(Q68<>\"\",P68<>\"\"),IF(OR(N68=5,N68=7),IF(S68>0,1,0)),\"\")","v":""},{"$f":"IF(AND(Q68<>\"\",P68<>\"\"),IF(OR(N68=2,N68=6,N68=8),IF(S68<0,1,0)),\"\")","v":""},{"$f":"IF(AND(Q68<>0,R68<>0),IF(OR(N68=1,N68=5,N68=6),IF(OR(T68=0,ABS(T68)<='Barèmes & Options'!H$2),1,0)),\"\")","v":false},{"$f":"IF(AND(Q68<>\"\",R68<>\"\"),IF(OR(N68=4,N68=8),IF(T68>0,1,0)),\"\")","v":""},{"$f":"IF(AND(Q68<>\"\",R68<>\"\"),IF(OR(N68=2,N68=3,N68=7),IF(T68<0,1,0)),\"\")","v":""},{"$f":"IF(SUM(V68:AA68)=2,IF(N68=2,IF(N68=2,IF(U68-'Barèmes & Options'!H$2<-1,0,1)),\"\"),0)","v":0},{"$f":"IF(OR(N68=2,N68=9),SUM(V68:AA68)-AB68,SUM(V68:AA68))","v":0},{"$f":"IF(OR(V68=1,W68=1,X68=1),TRUE,FALSE)","v":false},{"$f":"IF(OR(Y68=1,Z68=1,AA68=1),TRUE,FALSE)","v":false},{"$f":"IF(N68<>\"\",IF(AND(N68>=1,N68<=8,N68=ABS(N68)),IF(AND(N68<=9,N68>=1),IF(AND(AC68=1,H68<>\"\"),1,IF(AND(AC68=1,H68=\"\"),1.5,IF(AND(AC68=2,H68<>\"\"),2,IF(AND(AC68=2,H68=\"\"),3,0)))),\"\"),\"Err. Profil\"),\"\")","v":""},{"$f":"IF(O68<>\"\",IF(ROUND(M68,0)<=3,1,0),\"\")","v":""},{"$f":"IF(AND(R68<>\"\",Q68<>\"\",P68<>\"\"),IF($C68=\"\",\"SX\",IF($C68=\"F\",VLOOKUP(ROUND($L68,0)/100,Barème500,3),VLOOKUP(ROUND($L68,0)/100,Barème500,2))),\"\")","v":""},{"$f":"IF(OR(K68=\"\",K68=\"\",AH68=\"\",AG68=\"\",AF68=\"\"),\"\",IF(OR(K68<0,K68>2),\"Err ech.\",SUM(K68,AH68,AG68,AF68)))","v":""},null,null,null,null,null,{"$f":"IF(C68<>\"f\",\"m\",\"f\")","v":"m"}]
[null,null,null,null,null,null,null,null,null,null,null,{"$f":"IF(AND(R69<>\"\",Q69<>\"\",P69<>\"\"),(INT(((INT($P69)*60)+(($P69-INT($P69))*100)+(INT($Q69)*60)+(($Q69-INT($Q69))*100)+(INT($R69)*60)+(($R69-INT($R69))*100))/60)+MOD(((INT($P69)*60)+(($P69-INT($P69))*100)+(INT($Q69)*60)+(($Q69-INT($Q69))*100)+(INT($R69)*60)+(($R69-INT($R69))*100)),60)/100)*100,\"\")","v":""},{"$f":"IF(OR(O69=\"\",P69=\"\"),\"\",ABS((INT(P69)*60)+((P69-INT(P69))*100)-((INT(O69)*60)+((O69-INT(O69))*100))))","v":""},{"$f":"IF(AND(E69=\"\",H69=\"\"),\"\",IF(H69=\"\",E69,H69))","v":""},{"$f":"IF(F69=\"\",\"\",F69/100)","v":""},{"$f":"IF(G69=\"\",\"\",G69/100)","v":""},{"$f":"IF(I69=\"\",\"\",I69/100)","v":""},{"$f":"IF(J69=\"\",\"\",J69/100)","v":""},{"$f":"ROUND((INT(Q69)*60)+((Q69-INT(Q69))*100)-((INT(P69)*60)+((P69-INT(P69))*100)),0)","v":{"$error":"#VALUE!"}},{"$f":"ROUND((INT(R69)*60)+((R69-INT(R69))*100)-((INT(Q69)*60)+((Q69-INT(Q69))*100)),0)","v":{"$error":"#VALUE!"}},{"$f":"ROUND((INT(R69)*60)+((R69-INT(R69))*100)-((INT(P69)*60)+((P69-INT(P69))*100)),0)","v":{"$error":"#VALUE!"}},{"$f":"IF(AND(Q69<>0,P69<>0),IF(OR(N69=1,N69=3,N69=4),IF(OR(S69=0,ABS(S69)<='Barèmes & Options'!H$2),1,0)),\"\")","v":false},{"$f":"IF(AND(Q69<>\"\",P69<>\"\"),IF(OR(N69=5,N69=7),IF(S69>0,1,0)),\"\")","v":""},{"$f":"IF(AND(Q69<>\"\",P69<>\"\"),IF(OR(N69=2,N69=6,N69=8),IF(S69<0,1,0)),\"\")","v":""},{"$f":"IF(AND(Q69<>0,R69<>0),IF(OR(N69=1,N69=5,N69=6),IF(OR(T69=0,ABS(T69)<='Barèmes & Options'!H$2),1,0)),\"\")","v":false},{"$f":"IF(AND(Q69<>\"\",R69<>\"\"),IF(OR(N69=4,N69=8),IF(T69>0,1,0)),\"\")","v":""},{"$f":"IF(AND(Q69<>\"\",R69<>\"\"),IF(OR(N69=2,N69=3,N69=7),IF(T69<0,1,0)),\"\")","v":""},{"$f":"IF(SUM(V69:AA69)=2,IF(N69=2,IF(N69=2,IF(U69-'Barèmes & Options'!H$2<-1,0,1)),\"\"),0)","v":0},{"$f":"IF(OR(N69=2,N69=9),SUM(V69:AA69)-AB69,SUM(V69:AA69))","v":0},{"$f":"IF(OR(V69=1,W69=1,X69=1),TRUE,FALSE)","v":false},{"$f":"IF(OR(Y69=1,Z69=1,AA69=1),TRUE,FALSE)","v":false},{"$f":"IF(N69<>\"\",IF(AND(N69>=1,N69<=8,N69=ABS(N69)),IF(AND(N69<=9,N69>=1),IF(AND(AC69=1,H69<>\"\"),1,IF(AND(AC69=1,H69=\"\"),1.5,IF(AND(AC69=2,H69<>\"\"),2,IF(AND(AC69=2,H69=\"\"),3,0)))),\"\"),\"Err. Profil\"),\"\")","v":""},{"$f":"IF(O69<>\"\",IF(ROUND(M69,0)<=3,1,0),\"\")","v":""},{"$f":"IF(AND(R69<>\"\",Q69<>\"\",P69<>\"\"),IF($C69=\"\",\"SX\",IF($C69=\"F\",VLOOKUP(ROUND($L69,0)/100,Barème500,3),VLOOKUP(ROUND($L69,0)/100,Barème500,2))),\"\")","v":""},{"$f":"IF(OR(K69=\"\",K69=\"\",AH69=\"\",AG69=\"\",AF69=\"\"),\"\",IF(OR(K69<0,K69>2),\"Err ech.\",SUM(K69,AH69,AG69,AF69)))","v":""},null,null,null,null,null,{"$f":"IF(C69<>\"f\",\"m\",\"f\")","v":"m"}]
[null,null,null,null,null,null,null,null,null,null,null,{"$f":"IF(AND(R70<>\"\",Q70<>\"\",P70<>\"\"),(INT(((INT($P70)*60)+(($P70-INT($P70))*100)+(INT($Q70)*60)+(($Q70-INT($Q70))*100)+(INT($R70)*60)+(($R70-INT($R70))*100))/60)+MOD(((INT($P70)*60)+(($P70-INT($P70))*100)+(INT($Q70)*60)+(($Q70-INT($Q70))*100)+(INT($R70)*60)+(($R70-INT($R70))*100)),60)/100)*100,\"\")","v":""},{"$f":"IF(OR(O70=\"\",P70=\"\"),\"\",ABS((INT(P70)*60)+((P70-INT(P70))*100)-((INT(O70)*60)+((O70-INT(O70))*100))))","v":""},{"$f":"IF(AND(E70=\"\",H70=\"\"),\"\",IF(H70=\"\",E70,H70))","v":""},{"$f":"IF(F70=\"\",\"\",F70/100)","v":""},{"$f":"IF(G70=\"\",\"\",G70/100)","v":""},{"$f":"IF(I70=\"\",\"\",I70/100)","v":""},{"$f":"IF(J70=\"\",\"\",J70/100)","v":""},{"$f":"ROUND((INT(Q70)*60)+((Q70-INT(Q70))*100)-((INT(P70)*60)+((P70-INT(P70))*100)),0)","v":{"$error":"#VALUE!"}},{"$f":"ROUND((INT(R70)*60)+((R70-INT(R70))*100)-((INT(Q70)*60)+((Q70-INT(Q70))*100)),0)","v":{"$error":"#VALUE!"}},{"$f":"ROUND((INT(R70)*60)+((R70-INT(R70))*100)-((INT(P70)*60)+((P70-INT(P70))*100)),0)","v":{"$error":"#VALUE!"}},{"$f":"IF(AND(Q70<>0,P70<>0),IF(OR(N70=1,N70=3,N70=4),IF(OR(S70=0,ABS(S70)<='Barèmes & Options'!H$2),1,0)),\"\")","v":false},{"$f":"IF(AND(Q70<>\"\",P70<>\"\"),IF(OR(N70=5,N70=7),IF(S70>0,1,0)),\"\")","v":""},{"$f":"IF(AND(Q70<>\"\",P70<>\"\"),IF(OR(N70=2,N70=6,N70=8),IF(S70<0,1,0)),\"\")","v":""},{"$f":"IF(AND(Q70<>0,R70<>0),IF(OR(N70=1,N70=5,N70=6),IF(OR(T70=0,ABS(T70)<='Barèmes & Options'!H$2),1,0)),\"\")","v":false},{"$f":"IF(AND(Q70<>\"\",R70<>\"\"),IF(OR(N70=4,N70=8),IF(T70>0,1,0)),\"\")","v":""},{"$f":"IF(AND(Q70<>\"\",R70<>\"\"),IF(OR(N70=2,N70=3,N70=7),IF(T70<0,1,0)),\"\")","v":""},{"$f":"IF(SUM(V70:AA70)=2,IF(N70=2,IF(N70=2,IF(U70-'Barèmes & Options'!H$2<-1,0,1)),\"\"),0)","v":0},{"$f":"IF(OR(N70=2,N70=9),SUM(V70:AA70)-AB70,SUM(V70:AA70))","v":0},{"$f":"IF(OR(V70=1,W70=1,X70=1),TRUE,FALSE)","v":false},{"$f":"IF(OR(Y70=1,Z70=1,AA70=1),TRUE,FALSE)","v":false},{"$f":"IF(N70<>\"\",IF(AND(N70>=1,N70<=8,N70=ABS(N70)),IF(AND(N70<=9,N70>=1),IF(AND(AC70=1,H70<>\"\"),1,IF(AND(AC70=1,H70=\"\"),1.5,IF(AND(AC70=2,H70<>\"\"),2,IF(AND(AC70=2,H70=\"\"),3,0)))),\"\"),\"Err. Profil\"),\"\")","v":""},{"$f":"IF(O70<>\"\",IF(ROUND(M70,0)<=3,1,0),\"\")","v":""},{"$f":"IF(AND(R70<>\"\",Q70<>\"\",P70<>\"\"),IF($C70=\"\",\"SX\",IF($C70=\"F\",VLOOKUP(ROUND($L70,0)/100,Barème500,3),VLOOKUP(ROUND($L70,0)/100,Barème500,2))),\"\")","v":""},{"$f":"IF(OR(K70=\"\",K70=\"\",AH70=\"\",AG70=\"\",AF70=\"\"),\"\",IF(OR(K70<0,K70>2),\"Err ech.\",SUM(K70,AH70,AG70,AF70)))","v":""},null,null,null,null,null,{"$f":"IF(C70<>\"f\",\"m\",\"f\")","v":"m"}]
[null,null,null,null,null,null,null,null,null,null,null,{"$f":"IF(AND(R71<>\"\",Q71<>\"\",P71<>\"\"),(INT(((INT($P71)*60)+(($P71-INT($P71))*100)+(INT($Q71)*60)+(($Q71-INT($Q71))*100)+(INT($R71)*60)+(($R71-INT($R71))*100))/60)+MOD(((INT($P71)*60)+(($P71-INT($P71))*100)+(INT($Q71)*60)+(($Q71-INT($Q71))*100)+(INT($R71)*60)+(($R71-INT($R71))*100)),60)/100)*100,\"\")","v":""},{"$f":"IF(OR(O71=\"\",P71=\"\"),\"\",ABS((INT(P71)*60)+((P71-INT(P71))*100)-((INT(O71)*60)+((O71-INT(O71))*100))))","v":""},{"$f":"IF(AND(E71=\"\",H71=\"\"),\"\",IF(H71=\"\",E71,H71))","v":""},{"$f":"IF(F71=\"\",\"\",F71/100)","v":""},{"$f":"IF(G71=\"\",\"\",G71/100)","v":""},{"$f":"IF(I71=\"\",\"\",I71/100)","v":""},{"$f":"IF(J71=\"\",\"\",J71/100)","v":""},{"$f":"ROUND((INT(Q71)*60)+((Q71-INT(Q71))*100)-((INT(P71)*60)+((P71-INT(P71))*100)),0)","v":{"$error":"#VALUE!"}},{"$f":"ROUND((INT(R71)*60)+((R71-INT(R71))*100)-((INT(Q71)*60)+((Q71-INT(Q71))*100)),0)","v":{"$error":"#VALUE!"}},{"$f":"ROUND((INT(R71)*60)+((R71-INT(R71))*100)-((INT(P71)*60)+((P71-INT(P71))*100)),0)","v":{"$error":"#VALUE!"}},{"$f":"IF(AND(Q71<>0,P71<>0),IF(OR(N71=1,N71=3,N71=4),IF(OR(S71=0,ABS(S71)<='Barèmes & Options'!H$2),1,0)),\"\")","v":false},{"$f":"IF(AND(Q71<>\"\",P71<>\"\"),IF(OR(N71=5,N71=7),IF(S71>0,1,0)),\"\")","v":""},{"$f":"IF(AND(Q71<>\"\",P71<>\"\"),IF(OR(N71=2,N71=6,N71=8),IF(S71<0,1,0)),\"\")","v":""},{"$f":"IF(AND(Q71<>0,R71<>0),IF(OR(N71=1,N71=5,N71=6),IF(OR(T71=0,ABS(T71)<='Barèmes & Options'!H$2),1,0)),\"\")","v":false},{"$f":"IF(AND(Q71<>\"\",R71<>\"\"),IF(OR(N71=4,N71=8),IF(T71>0,1,0)),\"\")","v":""},{"$f":"IF(AND(Q71<>\"\",R71<>\"\"),IF(OR(N71=2,N71=3,N71=7),IF(T71<0,1,0)),\"\")","v":""},{"$f":"IF(SUM(V71:AA71)=2,IF(N71=2,IF(N71=2,IF(U71-'Barèmes & Options'!H$2<-1,0,1)),\"\"),0)","v":0},{"$f":"IF(OR(N71=2,N71=9),SUM(V71:AA71)-AB71,SUM(V71:AA71))","v":0},{"$f":"IF(OR(V71=1,W71=1,X71=1),TRUE,FALSE)","v":false},{"$f":"IF(OR(Y71=1,Z71=1,AA71=1),TRUE,FALSE)","v":false},{"$f":"IF(N71<>\"\",IF(AND(N71>=1,N71<=8,N71=ABS(N71)),IF(AND(N71<=9,N71>=1),IF(AND(AC71=1,H71<>\"\"),1,IF(AND(AC71=1,H71=\"\"),1.5,IF(AND(AC71=2,H71<>\"\"),2,IF(AND(AC71=2,H71=\"\"),3,0)))),\"\"),\"Err. Profil\"),\"\")","v":""},{"$f":"IF(O71<>\"\",IF(ROUND(M71,0)<=3,1,0),\"\")","v":""},{"$f":"IF(AND(R71<>\"\",Q71<>\"\",P71<>\"\"),IF($C71=\"\",\"SX\",IF($C71=\"F\",VLOOKUP(ROUND($L71,0)/100,Barème500,3),VLOOKUP(ROUND($L71,0)/100,Barème500,2))),\"\")","v":""},{"$f":"IF(OR(K71=\"\",K71=\"\",AH71=\"\",AG71=\"\",AF71=\"\"),\"\",IF(OR(K71<0,K71>2),\"Err ech.\",SUM(K71,AH71,AG71,AF71)))","v":""},null,null,null,null,null,{"$f":"IF(C71<>\"f\",\"m\",\"f\")","v":"m"}]
[null,null,null,null,null,null,null,null,null,null,null,{"$f":"IF(AND(R72<>\"\",Q72<>\"\",P72<>\"\"),(INT(((INT($P72)*60)+(($P72-INT($P72))*100)+(INT($Q72)*60)+(($Q72-INT($Q72))*100)+(INT($R72)*60)+(($R72-INT($R72))*100))/60)+MOD(((INT($P72)*60)+(($P72-INT($P72))*100)+(INT($Q72)*60)+(($Q72-INT($Q72))*100)+(INT($R72)*60)+(($R72-INT($R72))*100)),60)/100)*100,\"\")","v":""},{"$f":"IF(OR(O72=\"\",P72=\"\"),\"\",ABS((INT(P72)*60)+((P72-INT(P72))*100)-((INT(O72)*60)+((O72-INT(O72))*100))))","v":""},{"$f":"IF(AND(E72=\"\",H72=\"\"),\"\",IF(H72=\"\",E72,H72))","v":""},{"$f":"IF(F72=\"\",\"\",F72/100)","v":""},{"$f":"IF(G72=\"\",\"\",G72/100)","v":""},{"$f":"IF(I72=\"\",\"\",I72/100)","v":""},{"$f":"IF(J72=\"\",\"\",J72/100)","v":""},{"$f":"ROUND((INT(Q72)*60)+((Q72-INT(Q72))*100)-((INT(P72)*60)+((P72-INT(P72))*100)),0)","v":{"$error":"#VALUE!"}},{"$f":"ROUND((INT(R72)*60)+((R72-INT(R72))*100)-((INT(Q72)*60)+((Q72-INT(Q72))*100)),0)","v":{"$error":"#VALUE!"}},{"$f":"ROUND((INT(R72)*60)+((R72-INT(R72))*100)-((INT(P72)*60)+((P72-INT(P72))*100)),0)","v":{"$error":"#VALUE!"}},{"$f":"IF(AND(Q72<>0,P72<>0),IF(OR(N72=1,N72=3,N72=4),IF(OR(S72=0,ABS(S72)<='Barèmes & Options'!H$2),1,0)),\"\")","v":false},{"$f":"IF(AND(Q72<>\"\",P72<>\"\"),IF(OR(N72=5,N72=7),IF(S72>0,1,0)),\"\")","v":""},{"$f":"IF(AND(Q72<>\"\",P72<>\"\"),IF(OR(N72=2,N72=6,N72=8),IF(S72<0,1,0)),\"\")","v":""},{"$f":"IF(AND(Q72<>0,R72<>0),IF(OR(N72=1,N72=5,N72=6),IF(OR(T72=0,ABS(T72)<='Barèmes & Options'!H$2),1,0)),\"\")","v":false},{"$f":"IF(AND(Q72<>\"\",R72<>\"\"),IF(OR(N72=4,N72=8),IF(T72>0,1,0)),\"\")","v":""},{"$f":"IF(AND(Q72<>\"\",R72<>\"\"),IF(OR(N72=2,N72=3,N72=7),IF(T72<0,1,0)),\"\")","v":""},{"$f":"IF(SUM(V72:AA72)=2,IF(N72=2,IF(N72=2,IF(U72-'Barèmes & Options'!H$2<-1,0,1)),\"\"),0)","v":0},{"$f":"IF(OR(N72=2,N72=9),SUM(V72:AA72)-AB72,SUM(V72:AA72))","v":0},{"$f":"IF(OR(V72=1,W72=1,X72=1),TRUE,FALSE)","v":false},{"$f":"IF(OR(Y72=1,Z72=1,AA72=1),TRUE,FALSE)","v":false},{"$f":"IF(N72<>\"\",IF(AND(N72>=1,N72<=8,N72=ABS(N72)),IF(AND(N72<=9,N72>=1),IF(AND(AC72=1,H72<>\"\"),1,IF(AND(AC72=1,H72=\"\"),1.5,IF(AND(AC72=2,H72<>\"\"),2,IF(AND(AC72=2,H72=\"\"),3,0)))),\"\"),\"Err. Profil\"),\"\")","v":""},{"$f":"IF(O72<>\"\",IF(ROUND(M72,0)<=3,1,0),\"\")","v":""},{"$f":"IF(AND(R72<>\"\",Q72<>\"\",P72<>\"\"),IF($C72=\"\",\"SX\",IF($C72=\"F\",VLOOKUP(ROUND($L72,0)/100,Barème500,3),VLOOKUP(ROUND($L72,0)/100,Barème500,2))),\"\")","v":""},{"$f":"IF(OR(K72=\"\",K72=\"\",AH72=\"\",AG72=\"\",AF72=\"\"),\"\",IF(OR(K72<0,K72>2),\"Err ech.\",SUM(K72,AH72,AG72,AF72)))","v":""},null,null,null,null,null,{"$f":"IF(C72<>\"f\",\"m\",\"f\")","v":"m"}]
[null,null,null,null,null,null,null,null,null,null,null,{"$f":"IF(AND(R73<>\"\",Q73<>\"\",P73<>\"\"),(INT(((INT($P73)*60)+(($P73-INT($P73))*100)+(INT($Q73)*60)+(($Q73-INT($Q73))*100)+(INT($R73)*60)+(($R73-INT($R73))*100))/60)+MOD(((INT($P73)*60)+(($P73-INT($P73))*100)+(INT($Q73)*60)+(($Q73-INT($Q73))*100)+(INT($R73)*60)+(($R73-INT($R73))*100)),60)/100)*100,\"\")","v":""},{"$f":"IF(OR(O73=\"\",P73=\"\"),\"\",ABS((INT(P73)*60)+((P73-INT(P73))*100)-((INT(O73)*60)+((O73-INT(O73))*100))))","v":""},{"$f":"IF(AND(E73=\"\",H73=\"\"),\"\",IF(H73=\"\",E73,H73))","v":""},{"$f":"IF(F73=\"\",\"\",F73/100)","v":""},{"$f":"IF(G73=\"\",\"\",G73/100)","v":""},{"$f":"IF(I73=\"\",\"\",I73/100)","v":""},{"$f":"IF(J73=\"\",\"\",J73/100)","v":""},{"$f":"ROUND((INT(Q73)*60)+((Q73-INT(Q73))*100)-((INT(P73)*60)+((P73-INT(P73))*100)),0)","v":{"$error":"#VALUE!"}},{"$f":"ROUND((INT(R73)*60)+((R73-INT(R73))*100)-((INT(Q73)*60)+((Q73-INT(Q73))*100)),0)","v":{"$error":"#VALUE!"}},{"$f":"ROUND((INT(R73)*60)+((R73-INT(R73))*100)-((INT(P73)*60)+((P73-INT(P73))*100)),0)","v":{"$error":"#VALUE!"}},{"$f":"IF(AND(Q73<>0,P73<>0),IF(OR(N73=1,N73=3,N73=4),IF(OR(S73=0,ABS(S73)<='Barèmes & Options'!H$2),1,0)),\"\")","v":false},{"$f":"IF(AND(Q73<>\"\",P73<>\"\"),IF(OR(N73=5,N73=7),IF(S73>0,1,0)),\"\")","v":""},{"$f":"IF(AND(Q73<>\"\",P73<>\"\"),IF(OR(N73=2,N73=6,N73=8),IF(S73<0,1,0)),\"\")","v":""},{"$f":"IF(AND(Q73<>0,R73<>0),IF(OR(N73=1,N73=5,N73=6),IF(OR(T73=0,ABS(T73)<='Barèmes & Options'!H$2),1,0)),\"\")","v":false},{"$f":"IF(AND(Q73<>\"\",R73<>\"\"),IF(OR(N73=4,N73=8),IF(T73>0,1,0)),\"\")","v":""},{"$f":"IF(AND(Q73<>\"\",R73<>\"\"),IF(OR(N73=2,N73=3,N73=7),IF(T73<0,1,0)),\"\")","v":""},{"$f":"IF(SUM(V73:AA73)=2,IF(N73=2,IF(N73=2,IF(U73-'Barèmes & Options'!H$2<-1,0,1)),\"\"),0)","v":0},{"$f":"IF(OR(N73=2,N73=9),SUM(V73:AA73)-AB73,SUM(V73:AA73))","v":0},{"$f":"IF(OR(V73=1,W73=1,X73=1),TRUE,FALSE)","v":false},{"$f":"IF(OR(Y73=1,Z73=1,AA73=1),TRUE,FALSE)","v":false},{"$f":"IF(N73<>\"\",IF(AND(N73>=1,N73<=8,N73=ABS(N73)),IF(AND(N73<=9,N73>=1),IF(AND(AC73=1,H73<>\"\"),1,IF(AND(AC73=1,H73=\"\"),1.5,IF(AND(AC73=2,H73<>\"\"),2,IF(AND(AC73=2,H73=\"\"),3,0)))),\"\"),\"Err. Profil\"),\"\")","v":""},{"$f":"IF(O73<>\"\",IF(ROUND(M73,0)<=3,1,0),\"\")","v":""},{"$f":"IF(AND(R73<>\"\",Q73<>\"\",P73<>\"\"),IF($C73=\"\",\"SX\",IF($C73=\"F\",VLOOKUP(ROUND($L73,0)/100,Barème500,3),VLOOKUP(ROUND($L73,0)/100,Barème500,2))),\"\")","v":""},{"$f":"IF(OR(K73=\"\",K73=\"\",AH73=\"\",AG73=\"\",AF73=\"\"),\"\",IF(OR(K73<0,K73>2),\"Err ech.\",SUM(K73,AH73,AG73,AF73)))","v":""},null,null,null,null,null,{"$f":"IF(C73<>\"f\",\"m\",\"f\")","v":"m"}]
[null,null,null,null,null,null,null,null,null,null,null,{"$f":"IF(AND(R74<>\"\",Q74<>\"\",P74<>\"\"),(INT(((INT($P74)*60)+(($P74-INT($P74))*100)+(INT($Q74)*60)+(($Q74-INT($Q74))*100)+(INT($R74)*60)+(($R74-INT($R74))*100))/60)+MOD(((INT($P74)*60)+(($P74-INT($P74))*100)+(INT($Q74)*60)+(($Q74-INT($Q74))*100)+(INT($R74)*60)+(($R74-INT($R74))*100)),60)/100)*100,\"\")","v":""},{"$f":"IF(OR(O74=\"\",P74=\"\"),\"\",ABS((INT(P74)*60)+((P74-INT(P74))*100)-((INT(O74)*60)+((O74-INT(O74))*100))))","v":""},{"$f":"IF(AND(E74=\"\",H74=\"\"),\"\",IF(H74=\"\",E74,H74))","v":""},{"$f":"IF(F74=\"\",\"\",F74/100)","v":""},{"$f":"IF(G74=\"\",\"\",G74/100)","v":""},{"$f":"IF(I74=\"\",\"\",I74/100)","v":""},{"$f":"IF(J74=\"\",\"\",J74/100)","v":""},{"$f":"ROUND((INT(Q74)*60)+((Q74-INT(Q74))*100)-((INT(P74)*60)+((P74-INT(P74))*100)),0)","v":{"$error":"#VALUE!"}},{"$f":"ROUND((INT(R74)*60)+((R74-INT(R74))*100)-((INT(Q74)*60)+((Q74-INT(Q74))*100)),0)","v":{"$error":"#VALUE!"}},{"$f":"ROUND((INT(R74)*60)+((R74-INT(R74))*100)-((INT(P74)*60)+((P74-INT(P74))*100)),0)","v":{"$error":"#VALUE!"}},{"$f":"IF(AND(Q74<>0,P74<>0),IF(OR(N74=1,N74=3,N74=4),IF(OR(S74=0,ABS(S74)<='Barèmes & Options'!H$2),1,0)),\"\")","v":false},{"$f":"IF(AND(Q74<>\"\",P74<>\"\"),IF(OR(N74=5,N74=7),IF(S74>0,1,0)),\"\")","v":""},{"$f":"IF(AND(Q74<>\"\",P74<>\"\"),IF(OR(N74=2,N74=6,N74=8),IF(S74<0,1,0)),\"\")","v":""},{"$f":"IF(AND(Q74<>0,R74<>0),IF(OR(N74=1,N74=5,N74=6),IF(OR(T74=0,ABS(T74)<='Barèmes & Options'!H$2),1,0)),\"\")","v":false},{"$f":"IF(AND(Q74<>\"\",R74<>\"\"),IF(OR(N74=4,N74=8),IF(T74>0,1,0)),\"\")","v":""},{"$f":"IF(AND(Q74<>\"\",R74<>\"\"),IF(OR(N74=2,N74=3,N74=7),IF(T74<0,1,0)),\"\")","v":""},{"$f":"IF(SUM(V74:AA74)=2,IF(N74=2,IF(N74=2,IF(U74-'Barèmes & Options'!H$2<-1,0,1)),\"\"),0)","v":0},{"$f":"IF(OR(N74=2,N74=9),SUM(V74:AA74)-AB74,SUM(V74:AA74))","v":0},{"$f":"IF(OR(V74=1,W74=1,X74=1),TRUE,FALSE)","v":false},{"$f":"IF(OR(Y74=1,Z74=1,AA74=1),TRUE,FALSE)","v":false},{"$f":"IF(N74<>\"\",IF(AND(N74>=1,N74<=8,N74=ABS(N74)),IF(AND(N74<=9,N74>=1),IF(AND(AC74=1,H74<>\"\"),1,IF(AND(AC74=1,H74=\"\"),1.5,IF(AND(AC74=2,H74<>\"\"),2,IF(AND(AC74=2,H74=\"\"),3,0)))),\"\"),\"Err. Profil\"),\"\")","v":""},{"$f":"IF(O74<>\"\",IF(ROUND(M74,0)<=3,1,0),\"\")","v":""},{"$f":"IF(AND(R74<>\"\",Q74<>\"\",P74<>\"\"),IF($C74=\"\",\"SX\",IF($C74=\"F\",VLOOKUP(ROUND($L74,0)/100,Barème500,3),VLOOKUP(ROUND($L74,0)/100,Barème500,2))),\"\")","v":""},{"$f":"IF(OR(K74=\"\",K74=\"\",AH74=\"\",AG74=\"\",AF74=\"\"),\"\",IF(OR(K74<0,K74>2),\"Err ech.\",SUM(K74,AH74,AG74,AF74)))","v":""},null,null,null,null,null,{"$f":"IF(C74<>\"f\",\"m\",\"f\")","v":"m"}]
[null,null,null,null,null,null,null,null,null,null,null,{"$f":"IF(AND(R75<>\"\",Q75<>\"\",P75<>\"\"),(INT(((INT($P75)*60)+(($P75-INT($P75))*100)+(INT($Q75)*60)+(($Q75-INT($Q75))*100)+(INT($R75)*60)+(($R75-INT($R75))*100))/60)+MOD(((INT($P75)*60)+(($P75-INT($P75))*100)+(INT($Q75)*60)+(($Q75-INT($Q75))*100)+(INT($R75)*60)+(($R75-INT($R75))*100)),60)/100)*100,\"\")","v":""},{"$f":"IF(OR(O75=\"\",P75=\"\"),\"\",ABS((INT(P75)*60)+((P75-INT(P75))*100)-((INT(O75)*60)+((O75-INT(O75))*100))))","v":""},{"$f":"IF(AND(E75=\"\",H75=\"\"),\"\",IF(H75=\"\",E75,H75))","v":""},{"$f":"IF(F75=\"\",\"\",F75/100)","v":""},{"$f":"IF(G75=\"\",\"\",G75/100)","v":""},{"$f":"IF(I75=\"\",\"\",I75/100)","v":""},{"$f":"IF(J75=\"\",\"\",J75/100)","v":""},{"$f":"ROUND((INT(Q75)*60)+((Q75-INT(Q75))*100)-((INT(P75)*60)+((P75-INT(P75))*100)),0)","v":{"$error":"#VALUE!"}},{"$f":"ROUND((INT(R75)*60)+((R75-INT(R75))*100)-((INT(Q75)*60)+((Q75-INT(Q75))*100)),0)","v":{"$error":"#VALUE!"}},{"$f":"ROUND((INT(R75)*60)+((R75-INT(R75))*100)-((INT(P75)*60)+((P75-INT(P75))*100)),0)","v":{"$error":"#VALUE!"}},{"$f":"IF(AND(Q75<>0,P75<>0),IF(OR(N75=1,N75=3,N75=4),IF(OR(S75=0,ABS(S75)<='Barèmes & Options'!H$2),1,0)),\"\")","v":false},{"$f":"IF(AND(Q75<>\"\",P75<>\"\"),IF(OR(N75=5,N75=7),IF(S75>0,1,0)),\"\")","v":""},{"$f":"IF(AND(Q75<>\"\",P75<>\"\"),IF(OR(N75=2,N75=6,N75=8),IF(S75<0,1,0)),\"\")","v":""},{"$f":"IF(AND(Q75<>0,R75<>0),IF(OR(N75=1,N75=5,N75=6),IF(OR(T75=0,ABS(T75)<='Barèmes & Options'!H$2),1,0)),\"\")","v":false},{"$f":"IF(AND(Q75<>\"\",R75<>\"\"),IF(OR(N75=4,N75=8),IF(T75>0,1,0)),\"\")","v":""},{"$f":"IF(AND(Q75<>\"\",R75<>\"\"),IF(OR(N75=2,N75=3,N75=7),IF(T75<0,1,0)),\"\")","v":""},{"$f":"IF(SUM(V75:AA75)=2,IF(N75=2,IF(N75=2,IF(U75-'Barèmes & Options'!H$2<-1,0,1)),\"\"),0)","v":0},{"$f":"IF(OR(N75=2,N75=9),SUM(V75:AA75)-AB75,SUM(V75:AA75))","v":0},{"$f":"IF(OR(V75=1,W75=1,X75=1),TRUE,FALSE)","v":false},{"$f":"IF(OR(Y75=1,Z75=1,AA75=1),TRUE,FALSE)","v":false},{"$f":"IF(N75<>\"\",IF(AND(N75>=1,N75<=8,N75=ABS(N75)),IF(AND(N75<=9,N75>=1),IF(AND(AC75=1,H75<>\"\"),1,IF(AND(AC75=1,H75=\"\"),1.5,IF(AND(AC75=2,H75<>\"\"),2,IF(AND(AC75=2,H75=\"\"),3,0)))),\"\"),\"Err. Profil\"),\"\")","v":""},{"$f":"IF(O75<>\"\",IF(ROUND(M75,0)<=3,1,0),\"\")","v":""},{"$f":"IF(AND(R75<>\"\",Q75<>\"\",P75<>\"\"),IF($C75=\"\",\"SX\",IF($C75=\"F\",VLOOKUP(ROUND($L75,0)/100,Barème500,3),VLOOKUP(ROUND($L75,0)/100,Barème500,2))),\"\")","v":""},{"$f":"IF(OR(K75=\"\",K75=\"\",AH75=\"\",AG75=\"\",AF75=\"\"),\"\",IF(OR(K75<0,K75>2),\"Err ech.\",SUM(K75,AH75,AG75,AF75)))","v":""},null,null,null,null,null,{"$f":"IF(C75<>\"f\",\"m\",\"f\")","v":"m"}]
[null,null,null,null,null,null,null,null,null,null,null,{"$f":"IF(AND(R76<>\"\",Q76<>\"\",P76<>\"\"),(INT(((INT($P76)*60)+(($P76-INT($P76))*100)+(INT($Q76)*60)+(($Q76-INT($Q76))*100)+(INT($R76)*60)+(($R76-INT($R76))*100))/60)+MOD(((INT($P76)*60)+(($P76-INT($P76))*100)+(INT($Q76)*60)+(($Q76-INT($Q76))*100)+(INT($R76)*60)+(($R76-INT($R76))*100)),60)/100)*100,\"\")","v":""},{"$f":"IF(OR(O76=\"\",P76=\"\"),\"\",ABS((INT(P76)*60)+((P76-INT(P76))*100)-((INT(O76)*60)+((O76-INT(O76))*100))))","v":""},{"$f":"IF(AND(E76=\"\",H76=\"\"),\"\",IF(H76=\"\",E76,H76))","v":""},{"$f":"IF(F76=\"\",\"\",F76/100)","v":""},{"$f":"IF(G76=\"\",\"\",G76/100)","v":""},{"$f":"IF(I76=\"\",\"\",I76/100)","v":""},{"$f":"IF(J76=\"\",\"\",J76/100)","v":""},{"$f":"ROUND((INT(Q76)*60)+((Q76-INT(Q76))*100)-((INT(P76)*60)+((P76-INT(P76))*100)),0)","v":{"$error":"#VALUE!"}},{"$f":"ROUND((INT(R76)*60)+((R76-INT(R76))*100)-((INT(Q76)*60)+((Q76-INT(Q76))*100)),0)","v":{"$error":"#VALUE!"}},{"$f":"ROUND((INT(R76)*60)+((R76-INT(R76))*100)-((INT(P76)*60)+((P76-INT(P76))*100)),0)","v":{"$error":"#VALUE!"}},{"$f":"IF(AND(Q76<>0,P76<>0),IF(OR(N76=1,N76=3,N76=4),IF(OR(S76=0,ABS(S76)<='Barèmes & Options'!H$2),1,0)),\"\")","v":false},{"$f":"IF(AND(Q76<>\"\",P76<>\"\"),IF(OR(N76=5,N76=7),IF(S76>0,1,0)),\"\")","v":""},{"$f":"IF(AND(Q76<>\"\",P76<>\"\"),IF(OR(N76=2,N76=6,N76=8),IF(S76<0,1,0)),\"\")","v":""},{"$f":"IF(AND(Q76<>0,R76<>0),IF(OR(N76=1,N76=5,N76=6),IF(OR(T76=0,ABS(T76)<='Barèmes & Options'!H$2),1,0)),\"\")","v":false},{"$f":"IF(AND(Q76<>\"\",R76<>\"\"),IF(OR(N76=4,N76=8),IF(T76>0,1,0)),\"\")","v":""},{"$f":"IF(AND(Q76<>\"\",R76<>\"\"),IF(OR(N76=2,N76=3,N76=7),IF(T76<0,1,0)),\"\")","v":""},{"$f":"IF(SUM(V76:AA76)=2,IF(N76=2,IF(N76=2,IF(U76-'Barèmes & Options'!H$2<-1,0,1)),\"\"),0)","v":0},{"$f":"IF(OR(N76=2,N76=9),SUM(V76:AA76)-AB76,SUM(V76:AA76))","v":0},{"$f":"IF(OR(V76=1,W76=1,X76=1),TRUE,FALSE)","v":false},{"$f":"IF(OR(Y76=1,Z76=1,AA76=1),TRUE,FALSE)","v":false},{"$f":"IF(N76<>\"\",IF(AND(N76>=1,N76<=8,N76=ABS(N76)),IF(AND(N76<=9,N76>=1),IF(AND(AC76=1,H76<>\"\"),1,IF(AND(AC76=1,H76=\"\"),1.5,IF(AND(AC76=2,H76<>\"\"),2,IF(AND(AC76=2,H76=\"\"),3,0)))),\"\"),\"Err. Profil\"),\"\")","v":""},{"$f":"IF(O76<>\"\",IF(ROUND(M76,0)<=3,1,0),\"\")","v":""},{"$f":"IF(AND(R76<>\"\",Q76<>\"\",P76<>\"\"),IF($C76=\"\",\"SX\",IF($C76=\"F\",VLOOKUP(ROUND($L76,0)/100,Barème500,3),VLOOKUP(ROUND($L76,0)/100,Barème500,2))),\"\")","v":""},{"$f":"IF(OR(K76=\"\",K76=\"\",AH76=\"\",AG76=\"\",AF76=\"\"),\"\",IF(OR(K76<0,K76>2),\"Err ech.\",SUM(K76,AH76,AG76,AF76)))","v":""},null,null,null,null,null,{"$f":"IF(C76<>\"f\",\"m\",\"f\")","v":"m"}]
[null,null,null,null,null,null,null,null,null,null,null,{"$f":"IF(AND(R77<>\"\",Q77<>\"\",P77<>\"\"),(INT(((INT($P77)*60)+(($P77-INT($P77))*100)+(INT($Q77)*60)+(($Q77-INT($Q77))*100)+(INT($R77)*60)+(($R77-INT($R77))*100))/60)+MOD(((INT($P77)*60)+(($P77-INT($P77))*100)+(INT($Q77)*60)+(($Q77-INT($Q77))*100)+(INT($R77)*60)+(($R77-INT($R77))*100)),60)/100)*100,\"\")","v":""},{"$f":"IF(OR(O77=\"\",P77=\"\"),\"\",ABS((INT(P77)*60)+((P77-INT(P77))*100)-((INT(O77)*60)+((O77-INT(O77))*100))))","v":""},{"$f":"IF(AND(E77=\"\",H77=\"\"),\"\",IF(H77=\"\",E77,H77))","v":""},{"$f":"IF(F77=\"\",\"\",F77/100)","v":""},{"$f":"IF(G77=\"\",\"\",G77/100)","v":""},{"$f":"IF(I77=\"\",\"\",I77/100)","v":""},{"$f":"IF(J77=\"\",\"\",J77/100)","v":""},{"$f":"ROUND((INT(Q77)*60)+((Q77-INT(Q77))*100)-((INT(P77)*60)+((P77-INT(P77))*100)),0)","v":{"$error":"#VALUE!"}},{"$f":"ROUND((INT(R77)*60)+((R77-INT(R77))*100)-((INT(Q77)*60)+((Q77-INT(Q77))*100)),0)","v":{"$error":"#VALUE!"}},{"$f":"ROUND((INT(R77)*60)+((R77-INT(R77))*100)-((INT(P77)*60)+((P77-INT(P77))*100)),0)","v":{"$error":"#VALUE!"}},{"$f":"IF(AND(Q77<>0,P77<>0),IF(OR(N77=1,N77=3,N77=4),IF(OR(S77=0,ABS(S77)<='Barèmes & Options'!H$2),1,0)),\"\")","v":false},{"$f":"IF(AND(Q77<>\"\",P77<>\"\"),IF(OR(N77=5,N77=7),IF(S77>0,1,0)),\"\")","v":""},{"$f":"IF(AND(Q77<>\"\",P77<>\"\"),IF(OR(N77=2,N77=6,N77=8),IF(S77<0,1,0)),\"\")","v":""},{"$f":"IF(AND(Q77<>0,R77<>0),IF(OR(N77=1,N77=5,N77=6),IF(OR(T77=0,ABS(T77)<='Barèmes & Options'!H$2),1,0)),\"\")","v":false},{"$f":"IF(AND(Q77<>\"\",R77<>\"\"),IF(OR(N77=4,N77=8),IF(T77>0,1,0)),\"\")","v":""},{"$f":"IF(AND(Q77<>\"\",R77<>\"\"),IF(OR(N77=2,N77=3,N77=7),IF(T77<0,1,0)),\"\")","v":""},{"$f":"IF(SUM(V77:AA77)=2,IF(N77=2,IF(N77=2,IF(U77-'Barèmes & Options'!H$2<-1,0,1)),\"\"),0)","v":0},{"$f":"IF(OR(N77=2,N77=9),SUM(V77:AA77)-AB77,SUM(V77:AA77))","v":0},{"$f":"IF(OR(V77=1,W77=1,X77=1),TRUE,FALSE)","v":false},{"$f":"IF(OR(Y77=1,Z77=1,AA77=1),TRUE,FALSE)","v":false},{"$f":"IF(N77<>\"\",IF(AND(N77>=1,N77<=8,N77=ABS(N77)),IF(AND(N77<=9,N77>=1),IF(AND(AC77=1,H77<>\"\"),1,IF(AND(AC77=1,H77=\"\"),1.5,IF(AND(AC77=2,H77<>\"\"),2,IF(AND(AC77=2,H77=\"\"),3,0)))),\"\"),\"Err. Profil\"),\"\")","v":""},{"$f":"IF(O77<>\"\",IF(ROUND(M77,0)<=3,1,0),\"\")","v":""},{"$f":"IF(AND(R77<>\"\",Q77<>\"\",P77<>\"\"),IF($C77=\"\",\"SX\",IF($C77=\"F\",VLOOKUP(ROUND($L77,0)/100,Barème500,3),VLOOKUP(ROUND($L77,0)/100,Barème500,2))),\"\")","v":""},{"$f":"IF(OR(K77=\"\",K77=\"\",AH77=\"\",AG77=\"\",AF77=\"\"),\"\",IF(OR(K77<0,K77>2),\"Err ech.\",SUM(K77,AH77,AG77,AF77)))","v":""},null,null,null,null,null,{"$f":"IF(C77<>\"f\",\"m\",\"f\")","v":"m"}]
[null,null,null,null,null,null,null,null,null,null,null,{"$f":"IF(AND(R78<>\"\",Q78<>\"\",P78<>\"\"),(INT(((INT($P78)*60)+(($P78-INT($P78))*100)+(INT($Q78)*60)+(($Q78-INT($Q78))*100)+(INT($R78)*60)+(($R78-INT($R78))*100))/60)+MOD(((INT($P78)*60)+(($P78-INT($P78))*100)+(INT($Q78)*60)+(($Q78-INT($Q78))*100)+(INT($R78)*60)+(($R78-INT($R78))*100)),60)/100)*100,\"\")","v":""},{"$f":"IF(OR(O78=\"\",P78=\"\"),\"\",ABS((INT(P78)*60)+((P78-INT(P78))*100)-((INT(O78)*60)+((O78-INT(O78))*100))))","v":""},{"$f":"IF(AND(E78=\"\",H78=\"\"),\"\",IF(H78=\"\",E78,H78))","v":""},{"$f":"IF(F78=\"\",\"\",F78/100)","v":""},{"$f":"IF(G78=\"\",\"\",G78/100)","v":""},{"$f":"IF(I78=\"\",\"\",I78/100)","v":""},{"$f":"IF(J78=\"\",\"\",J78/100)","v":""},{"$f":"ROUND((INT(Q78)*60)+((Q78-INT(Q78))*100)-((INT(P78)*60)+((P78-INT(P78))*100)),0)","v":{"$error":"#VALUE!"}},{"$f":"ROUND((INT(R78)*60)+((R78-INT(R78))*100)-((INT(Q78)*60)+((Q78-INT(Q78))*100)),0)","v":{"$error":"#VALUE!"}},{"$f":"ROUND((INT(R78)*60)+((R78-INT(R78))*100)-((INT(P78)*60)+((P78-INT(P78))*100)),0)","v":{"$error":"#VALUE!"}},{"$f":"IF(AND(Q78<>0,P78<>0),IF(OR(N78=1,N78=3,N78=4),IF(OR(S78=0,ABS(S78)<='Barèmes & Options'!H$2),1,0)),\"\")","v":false},{"$f":"IF(AND(Q78<>\"\",P78<>\"\"),IF(OR(N78=5,N78=7),IF(S78>0,1,0)),\"\")","v":""},{"$f":"IF(AND(Q78<>\"\",P78<>\"\"),IF(OR(N78=2,N78=6,N78=8),IF(S78<0,1,0)),\"\")","v":""},{"$f":"IF(AND(Q78<>0,R78<>0),IF(OR(N78=1,N78=5,N78=6),IF(OR(T78=0,ABS(T78)<='Barèmes & Options'!H$2),1,0)),\"\")","v":false},{"$f":"IF(AND(Q78<>\"\",R78<>\"\"),IF(OR(N78=4,N78=8),IF(T78>0,1,0)),\"\")","v":""},{"$f":"IF(AND(Q78<>\"\",R78<>\"\"),IF(OR(N78=2,N78=3,N78=7),IF(T78<0,1,0)),\"\")","v":""},{"$f":"IF(SUM(V78:AA78)=2,IF(N78=2,IF(N78=2,IF(U78-'Barèmes & Options'!H$2<-1,0,1)),\"\"),0)","v":0},{"$f":"IF(OR(N78=2,N78=9),SUM(V78:AA78)-AB78,SUM(V78:AA78))","v":0},{"$f":"IF(OR(V78=1,W78=1,X78=1),TRUE,FALSE)","v":false},{"$f":"IF(OR(Y78=1,Z78=1,AA78=1),TRUE,FALSE)","v":false},{"$f":"IF(N78<>\"\",IF(AND(N78>=1,N78<=8,N78=ABS(N78)),IF(AND(N78<=9,N78>=1),IF(AND(AC78=1,H78<>\"\"),1,IF(AND(AC78=1,H78=\"\"),1.5,IF(AND(AC78=2,H78<>\"\"),2,IF(AND(AC78=2,H78=\"\"),3,0)))),\"\"),\"Err. Profil\"),\"\")","v":""},{"$f":"IF(O78<>\"\",IF(ROUND(M78,0)<=3,1,0),\"\")","v":""},{"$f":"IF(AND(R78<>\"\",Q78<>\"\",P78<>\"\"),IF($C78=\"\",\"SX\",IF($C78=\"F\",VLOOKUP(ROUND($L78,0)/100,Barème500,3),VLOOKUP(ROUND($L78,0)/100,Barème500,2))),\"\")","v":""},{"$f":"IF(OR(K78=\"\",K78=\"\",AH78=\"\",AG78=\"\",AF78=\"\"),\"\",IF(OR(K78<0,K78>2),\"Err ech.\",SUM(K78,AH78,AG78,AF78)))","v":""},null,null,null,null,null,{"$f":"IF(C78<>\"f\",\"m\",\"f\")","v":"m"}]
[null,null,null,null,null,null,null,null,null,null,null,{"$f":"IF(AND(R79<>\"\",Q79<>\"\",P79<>\"\"),(INT(((INT($P79)*60)+(($P79-INT($P79))*100)+(INT($Q79)*60)+(($Q79-INT($Q79))*100)+(INT($R79)*60)+(($R79-INT($R79))*100))/60)+MOD(((INT($P79)*60)+(($P79-INT($P79))*100)+(INT($Q79)*60)+(($Q79-INT($Q79))*100)+(INT($R79)*60)+(($R79-INT($R79))*100)),60)/100)*100,\"\")","v":""},{"$f":"IF(OR(O79=\"\",P79=\"\"),\"\",ABS((INT(P79)*60)+((P79-INT(P79))*100)-((INT(O79)*60)+((O79-INT(O79))*100))))","v":""},{"$f":"IF(AND(E79=\"\",H79=\"\"),\"\",IF(H79=\"\",E79,H79))","v":""},{"$f":"IF(F79=\"\",\"\",F79/100)","v":""},{"$f":"IF(G79=\"\",\"\",G79/100)","v":""},{"$f":"IF(I79=\"\",\"\",I79/100)","v":""},{"$f":"IF(J79=\"\",\"\",J79/100)","v":""},{"$f":"ROUND((INT(Q79)*60)+((Q79-INT(Q79))*100)-((INT(P79)*60)+((P79-INT(P79))*100)),0)","v":{"$error":"#VALUE!"}},{"$f":"ROUND((INT(R79)*60)+((R79-INT(R79))*100)-((INT(Q79)*60)+((Q79-INT(Q79))*100)),0)","v":{"$error":"#VALUE!"}},{"$f":"ROUND((INT(R79)*60)+((R79-INT(R79))*100)-((INT(P79)*60)+((P79-INT(P79))*100)),0)","v":{"$error":"#VALUE!"}},{"$f":"IF(AND(Q79<>0,P79<>0),IF(OR(N79=1,N79=3,N79=4),IF(OR(S79=0,ABS(S79)<='Barèmes & Options'!H$2),1,0)),\"\")","v":false},{"$f":"IF(AND(Q79<>\"\",P79<>\"\"),IF(OR(N79=5,N79=7),IF(S79>0,1,0)),\"\")","v":""},{"$f":"IF(AND(Q79<>\"\",P79<>\"\"),IF(OR(N79=2,N79=6,N79=8),IF(S79<0,1,0)),\"\")","v":""},{"$f":"IF(AND(Q79<>0,R79<>0),IF(OR(N79=1,N79=5,N79=6),IF(OR(T79=0,ABS(T79)<='Barèmes & Options'!H$2),1,0)),\"\")","v":false},{"$f":"IF(AND(Q79<>\"\",R79<>\"\"),IF(OR(N79=4,N79=8),IF(T79>0,1,0)),\"\")","v":""},{"$f":"IF(AND(Q79<>\"\",R79<>\"\"),IF(OR(N79=2,N79=3,N79=7),IF(T79<0,1,0)),\"\")","v":""},{"$f":"IF(SUM(V79:AA79)=2,IF(N79=2,IF(N79=2,IF(U79-'Barèmes & Options'!H$2<-1,0,1)),\"\"),0)","v":0},{"$f":"IF(OR(N79=2,N79=9),SUM(V79:AA79)-AB79,SUM(V79:AA79))","v":0},{"$f":"IF(OR(V79=1,W79=1,X79=1),TRUE,FALSE)","v":false},{"$f":"IF(OR(Y79=1,Z79=1,AA79=1),TRUE,FALSE)","v":false},{"$f":"IF(N79<>\"\",IF(AND(N79>=1,N79<=8,N79=ABS(N79)),IF(AND(N79<=9,N79>=1),IF(AND(AC79=1,H79<>\"\"),1,IF(AND(AC79=1,H79=\"\"),1.5,IF(AND(AC79=2,H79<>\"\"),2,IF(AND(AC79=2,H79=\"\"),3,0)))),\"\"),\"Err. Profil\"),\"\")","v":""},{"$f":"IF(O79<>\"\",IF(ROUND(M79,0)<=3,1,0),\"\")","v":""},{"$f":"IF(AND(R79<>\"\",Q79<>\"\",P79<>\"\"),IF($C79=\"\",\"SX\",IF($C79=\"F\",VLOOKUP(ROUND($L79,0)/100,Barème500,3),VLOOKUP(ROUND($L79,0)/100,Barème500,2))),\"\")","v":""},{"$f":"IF(OR(K79=\"\",K79=\"\",AH79=\"\",AG79=\"\",AF79=\"\"),\"\",IF(OR(K79<0,K79>2),\"Err ech.\",SUM(K79,AH79,AG79,AF79)))","v":""},null,null,null,null,null,{"$f":"IF(C79<>\"f\",\"m\",\"f\")","v":"m"}]
[null,null,null,null,null,null,null,null,null,null,null,{"$f":"IF(AND(R80<>\"\",Q80<>\"\",P80<>\"\"),(INT(((INT($P80)*60)+(($P80-INT($P80))*100)+(INT($Q80)*60)+(($Q80-INT($Q80))*100)+(INT($R80)*60)+(($R80-INT($R80))*100))/60)+MOD(((INT($P80)*60)+(($P80-INT($P80))*100)+(INT($Q80)*60)+(($Q80-INT($Q80))*100)+(INT($R80)*60)+(($R80-INT($R80))*100)),60)/100)*100,\"\")","v":""},{"$f":"IF(OR(O80=\"\",P80=\"\"),\"\",ABS((INT(P80)*60)+((P80-INT(P80))*100)-((INT(O80)*60)+((O80-INT(O80))*100))))","v":""},{"$f":"IF(AND(E80=\"\",H80=\"\"),\"\",IF(H80=\"\",E80,H80))","v":""},{"$f":"IF(F80=\"\",\"\",F80/100)","v":""},{"$f":"IF(G80=\"\",\"\",G80/100)","v":""},{"$f":"IF(I80=\"\",\"\",I80/100)","v":""},{"$f":"IF(J80=\"\",\"\",J80/100)","v":""},{"$f":"ROUND((INT(Q80)*60)+((Q80-INT(Q80))*100)-((INT(P80)*60)+((P80-INT(P80))*100)),0)","v":{"$error":"#VALUE!"}},{"$f":"ROUND((INT(R80)*60)+((R80-INT(R80))*100)-((INT(Q80)*60)+((Q80-INT(Q80))*100)),0)","v":{"$error":"#VALUE!"}},{"$f":"ROUND((INT(R80)*60)+((R80-INT(R80))*100)-((INT(P80)*60)+((P80-INT(P80))*100)),0)","v":{"$error":"#VALUE!"}},{"$f":"IF(AND(Q80<>0,P80<>0),IF(OR(N80=1,N80=3,N80=4),IF(OR(S80=0,ABS(S80)<='Barèmes & Options'!H$2),1,0)),\"\")","v":false},{"$f":"IF(AND(Q80<>\"\",P80<>\"\"),IF(OR(N80=5,N80=7),IF(S80>0,1,0)),\"\")","v":""},{"$f":"IF(AND(Q80<>\"\",P80<>\"\"),IF(OR(N80=2,N80=6,N80=8),IF(S80<0,1,0)),\"\")","v":""},{"$f":"IF(AND(Q80<>0,R80<>0),IF(OR(N80=1,N80=5,N80=6),IF(OR(T80=0,ABS(T80)<='Barèmes & Options'!H$2),1,0)),\"\")","v":false},{"$f":"IF(AND(Q80<>\"\",R80<>\"\"),IF(OR(N80=4,N80=8),IF(T80>0,1,0)),\"\")","v":""},{"$f":"IF(AND(Q80<>\"\",R80<>\"\"),IF(OR(N80=2,N80=3,N80=7),IF(T80<0,1,0)),\"\")","v":""},{"$f":"IF(SUM(V80:AA80)=2,IF(N80=2,IF(N80=2,IF(U80-'Barèmes & Options'!H$2<-1,0,1)),\"\"),0)","v":0},{"$f":"IF(OR(N80=2,N80=9),SUM(V80:AA80)-AB80,SUM(V80:AA80))","v":0},{"$f":"IF(OR(V80=1,W80=1,X80=1),TRUE,FALSE)","v":false},{"$f":"IF(OR(Y80=1,Z80=1,AA80=1),TRUE,FALSE)","v":false},{"$f":"IF(N80<>\"\",IF(AND(N80>=1,N80<=8,N80=ABS(N80)),IF(AND(N80<=9,N80>=1),IF(AND(AC80=1,H80<>\"\"),1,IF(AND(AC80=1,H80=\"\"),1.5,IF(AND(AC80=2,H80<>\"\"),2,IF(AND(AC80=2,H80=\"\"),3,0)))),\"\"),\"Err. Profil\"),\"\")","v":""},{"$f":"IF(O80<>\"\",IF(ROUND(M80,0)<=3,1,0),\"\")","v":""},{"$f":"IF(AND(R80<>\"\",Q80<>\"\",P80<>\"\"),IF($C80=\"\",\"SX\",IF($C80=\"F\",VLOOKUP(ROUND($L80,0)/100,Barème500,3),VLOOKUP(ROUND($L80,0)/100,Barème500,2))),\"\")","v":""},{"$f":"IF(OR(K80=\"\",K80=\"\",AH80=\"\",AG80=\"\",AF80=\"\"),\"\",IF(OR(K80<0,K80>2),\"Err ech.\",SUM(K80,AH80,AG80,AF80)))","v":""},null,null,null,null,null,{"$f":"IF(C80<>\"f\",\"m\",\"f\")","v":"m"}]
[null,null,null,null,null,null,null,null,null,null,null,{"$f":"IF(AND(R81<>\"\",Q81<>\"\",P81<>\"\"),(INT(((INT($P81)*60)+(($P81-INT($P81))*100)+(INT($Q81)*60)+(($Q81-INT($Q81))*100)+(INT($R81)*60)+(($R81-INT($R81))*100))/60)+MOD(((INT($P81)*60)+(($P81-INT($P81))*100)+(INT($Q81)*60)+(($Q81-INT($Q81))*100)+(INT($R81)*60)+(($R81-INT($R81))*100)),60)/100)*100,\"\")","v":""},{"$f":"IF(OR(O81=\"\",P81=\"\"),\"\",ABS((INT(P81)*60)+((P81-INT(P81))*100)-((INT(O81)*60)+((O81-INT(O81))*100))))","v":""},{"$f":"IF(AND(E81=\"\",H81=\"\"),\"\",IF(H81=\"\",E81,H81))","v":""},{"$f":"IF(F81=\"\",\"\",F81/100)","v":""},{"$f":"IF(G81=\"\",\"\",G81/100)","v":""},{"$f":"IF(I81=\"\",\"\",I81/100)","v":""},{"$f":"IF(J81=\"\",\"\",J81/100)","v":""},{"$f":"ROUND((INT(Q81)*60)+((Q81-INT(Q81))*100)-((INT(P81)*60)+((P81-INT(P81))*100)),0)","v":{"$error":"#VALUE!"}},{"$f":"ROUND((INT(R81)*60)+((R81-INT(R81))*100)-((INT(Q81)*60)+((Q81-INT(Q81))*100)),0)","v":{"$error":"#VALUE!"}},{"$f":"ROUND((INT(R81)*60)+((R81-INT(R81))*100)-((INT(P81)*60)+((P81-INT(P81))*100)),0)","v":{"$error":"#VALUE!"}},{"$f":"IF(AND(Q81<>0,P81<>0),IF(OR(N81=1,N81=3,N81=4),IF(OR(S81=0,ABS(S81)<='Barèmes & Options'!H$2),1,0)),\"\")","v":false},{"$f":"IF(AND(Q81<>\"\",P81<>\"\"),IF(OR(N81=5,N81=7),IF(S81>0,1,0)),\"\")","v":""},{"$f":"IF(AND(Q81<>\"\",P81<>\"\"),IF(OR(N81=2,N81=6,N81=8),IF(S81<0,1,0)),\"\")","v":""},{"$f":"IF(AND(Q81<>0,R81<>0),IF(OR(N81=1,N81=5,N81=6),IF(OR(T81=0,ABS(T81)<='Barèmes & Options'!H$2),1,0)),\"\")","v":false},{"$f":"IF(AND(Q81<>\"\",R81<>\"\"),IF(OR(N81=4,N81=8),IF(T81>0,1,0)),\"\")","v":""},{"$f":"IF(AND(Q81<>\"\",R81<>\"\"),IF(OR(N81=2,N81=3,N81=7),IF(T81<0,1,0)),\"\")","v":""},{"$f":"IF(SUM(V81:AA81)=2,IF(N81=2,IF(N81=2,IF(U81-'Barèmes & Options'!H$2<-1,0,1)),\"\"),0)","v":0},{"$f":"IF(OR(N81=2,N81=9),SUM(V81:AA81)-AB81,SUM(V81:AA81))","v":0},{"$f":"IF(OR(V81=1,W81=1,X81=1),TRUE,FALSE)","v":false},{"$f":"IF(OR(Y81=1,Z81=1,AA81=1),TRUE,FALSE)","v":false},{"$f":"IF(N81<>\"\",IF(AND(N81>=1,N81<=8,N81=ABS(N81)),IF(AND(N81<=9,N81>=1),IF(AND(AC81=1,H81<>\"\"),1,IF(AND(AC81=1,H81=\"\"),1.5,IF(AND(AC81=2,H81<>\"\"),2,IF(AND(AC81=2,H81=\"\"),3,0)))),\"\"),\"Err. Profil\"),\"\")","v":""},{"$f":"IF(O81<>\"\",IF(ROUND(M81,0)<=3,1,0),\"\")","v":""},{"$f":"IF(AND(R81<>\"\",Q81<>\"\",P81<>\"\"),IF($C81=\"\",\"SX\",IF($C81=\"F\",VLOOKUP(ROUND($L81,0)/100,Barème500,3),VLOOKUP(ROUND($L81,0)/100,Barème500,2))),\"\")","v":""},{"$f":"IF(OR(K81=\"\",K81=\"\",AH81=\"\",AG81=\"\",AF81=\"\"),\"\",IF(OR(K81<0,K81>2),\"Err ech.\",SUM(K81,AH81,AG81,AF81)))","v":""},null,null,null,null,null,{"$f":"IF(C81<>\"f\",\"m\",\"f\")","v":"m"}]
[null,null,null,null,null,null,null,null,null,null,null,{"$f":"IF(AND(R82<>\"\",Q82<>\"\",P82<>\"\"),(INT(((INT($P82)*60)+(($P82-INT($P82))*100)+(INT($Q82)*60)+(($Q82-INT($Q82))*100)+(INT($R82)*60)+(($R82-INT($R82))*100))/60)+MOD(((INT($P82)*60)+(($P82-INT($P82))*100)+(INT($Q82)*60)+(($Q82-INT($Q82))*100)+(INT($R82)*60)+(($R82-INT($R82))*100)),60)/100)*100,\"\")","v":""},{"$f":"IF(OR(O82=\"\",P82=\"\"),\"\",ABS((INT(P82)*60)+((P82-INT(P82))*100)-((INT(O82)*60)+((O82-INT(O82))*100))))","v":""},{"$f":"IF(AND(E82=\"\",H82=\"\"),\"\",IF(H82=\"\",E82,H82))","v":""},{"$f":"IF(F82=\"\",\"\",F82/100)","v":""},{"$f":"IF(G82=\"\",\"\",G82/100)","v":""},{"$f":"IF(I82=\"\",\"\",I82/100)","v":""},{"$f":"IF(J82=\"\",\"\",J82/100)","v":""},{"$f":"ROUND((INT(Q82)*60)+((Q82-INT(Q82))*100)-((INT(P82)*60)+((P82-INT(P82))*100)),0)","v":{"$error":"#VALUE!"}},{"$f":"ROUND((INT(R82)*60)+((R82-INT(R82))*100)-((INT(Q82)*60)+((Q82-INT(Q82))*100)),0)","v":{"$error":"#VALUE!"}},{"$f":"ROUND((INT(R82)*60)+((R82-INT(R82))*100)-((INT(P82)*60)+((P82-INT(P82))*100)),0)","v":{"$error":"#VALUE!"}},{"$f":"IF(AND(Q82<>0,P82<>0),IF(OR(N82=1,N82=3,N82=4),IF(OR(S82=0,ABS(S82)<='Barèmes & Options'!H$2),1,0)),\"\")","v":false},{"$f":"IF(AND(Q82<>\"\",P82<>\"\"),IF(OR(N82=5,N82=7),IF(S82>0,1,0)),\"\")","v":""},{"$f":"IF(AND(Q82<>\"\",P82<>\"\"),IF(OR(N82=2,N82=6,N82=8),IF(S82<0,1,0)),\"\")","v":""},{"$f":"IF(AND(Q82<>0,R82<>0),IF(OR(N82=1,N82=5,N82=6),IF(OR(T82=0,ABS(T82)<='Barèmes & Options'!H$2),1,0)),\"\")","v":false},{"$f":"IF(AND(Q82<>\"\",R82<>\"\"),IF(OR(N82=4,N82=8),IF(T82>0,1,0)),\"\")","v":""},{"$f":"IF(AND(Q82<>\"\",R82<>\"\"),IF(OR(N82=2,N82=3,N82=7),IF(T82<0,1,0)),\"\")","v":""},{"$f":"IF(SUM(V82:AA82)=2,IF(N82=2,IF(N82=2,IF(U82-'Barèmes & Options'!H$2<-1,0,1)),\"\"),0)","v":0},{"$f":"IF(OR(N82=2,N82=9),SUM(V82:AA82)-AB82,SUM(V82:AA82))","v":0},{"$f":"IF(OR(V82=1,W82=1,X82=1),TRUE,FALSE)","v":false},{"$f":"IF(OR(Y82=1,Z82=1,AA82=1),TRUE,FALSE)","v":false},{"$f":"IF(N82<>\"\",IF(AND(N82>=1,N82<=8,N82=ABS(N82)),IF(AND(N82<=9,N82>=1),IF(AND(AC82=1,H82<>\"\"),1,IF(AND(AC82=1,H82=\"\"),1.5,IF(AND(AC82=2,H82<>\"\"),2,IF(AND(AC82=2,H82=\"\"),3,0)))),\"\"),\"Err. Profil\"),\"\")","v":""},{"$f":"IF(O82<>\"\",IF(ROUND(M82,0)<=3,1,0),\"\")","v":""},{"$f":"IF(AND(R82<>\"\",Q82<>\"\",P82<>\"\"),IF($C82=\"\",\"SX\",IF($C82=\"F\",VLOOKUP(ROUND($L82,0)/100,Barème500,3),VLOOKUP(ROUND($L82,0)/100,Barème500,2))),\"\")","v":""},{"$f":"IF(OR(K82=\"\",K82=\"\",AH82=\"\",AG82=\"\",AF82=\"\"),\"\",IF(OR(K82<0,K82>2),\"Err ech.\",SUM(K82,AH82,AG82,AF82)))","v":""},null,null,null,null,null,{"$f":"IF(C82<>\"f\",\"m\",\"f\")","v":"m"}]
[null,null,null,null,null,null,null,null,null,null,null,{"$f":"IF(AND(R83<>\"\",Q83<>\"\",P83<>\"\"),(INT(((INT($P83)*60)+(($P83-INT($P83))*100)+(INT($Q83)*60)+(($Q83-INT($Q83))*100)+(INT($R83)*60)+(($R83-INT($R83))*100))/60)+MOD(((INT($P83)*60)+(($P83-INT($P83))*100)+(INT($Q83)*60)+(($Q83-INT($Q83))*100)+(INT($R83)*60)+(($R83-INT($R83))*100)),60)/100)*100,\"\")","v":""},{"$f":"IF(OR(O83=\"\",P83=\"\"),\"\",ABS((INT(P83)*60)+((P83-INT(P83))*100)-((INT(O83)*60)+((O83-INT(O83))*100))))","v":""},{"$f":"IF(AND(E83=\"\",H83=\"\"),\"\",IF(H83=\"\",E83,H83))","v":""},{"$f":"IF(F83=\"\",\"\",F83/100)","v":""},{"$f":"IF(G83=\"\",\"\",G83/100)","v":""},{"$f":"IF(I83=\"\",\"\",I83/100)","v":""},{"$f":"IF(J83=\"\",\"\",J83/100)","v":""},{"$f":"ROUND((INT(Q83)*60)+((Q83-INT(Q83))*100)-((INT(P83)*60)+((P83-INT(P83))*100)),0)","v":{"$error":"#VALUE!"}},{"$f":"ROUND((INT(R83)*60)+((R83-INT(R83))*100)-((INT(Q83)*60)+((Q83-INT(Q83))*100)),0)","v":{"$error":"#VALUE!"}},{"$f":"ROUND((INT(R83)*60)+((R83-INT(R83))*100)-((INT(P83)*60)+((P83-INT(P83))*100)),0)","v":{"$error":"#VALUE!"}},{"$f":"IF(AND(Q83<>0,P83<>0),IF(OR(N83=1,N83=3,N83=4),IF(OR(S83=0,ABS(S83)<='Barèmes & Options'!H$2),1,0)),\"\")","v":false},{"$f":"IF(AND(Q83<>\"\",P83<>\"\"),IF(OR(N83=5,N83=7),IF(S83>0,1,0)),\"\")","v":""},{"$f":"IF(AND(Q83<>\"\",P83<>\"\"),IF(OR(N83=2,N83=6,N83=8),IF(S83<0,1,0)),\"\")","v":""},{"$f":"IF(AND(Q83<>0,R83<>0),IF(OR(N83=1,N83=5,N83=6),IF(OR(T83=0,ABS(T83)<='Barèmes & Options'!H$2),1,0)),\"\")","v":false},{"$f":"IF(AND(Q83<>\"\",R83<>\"\"),IF(OR(N83=4,N83=8),IF(T83>0,1,0)),\"\")","v":""},{"$f":"IF(AND(Q83<>\"\",R83<>\"\"),IF(OR(N83=2,N83=3,N83=7),IF(T83<0,1,0)),\"\")","v":""},{"$f":"IF(SUM(V83:AA83)=2,IF(N83=2,IF(N83=2,IF(U83-'Barèmes & Options'!H$2<-1,0,1)),\"\"),0)","v":0},{"$f":"IF(OR(N83=2,N83=9),SUM(V83:AA83)-AB83,SUM(V83:AA83))","v":0},{"$f":"IF(OR(V83=1,W83=1,X83=1),TRUE,FALSE)","v":false},{"$f":"IF(OR(Y83=1,Z83=1,AA83=1),TRUE,FALSE)","v":false},{"$f":"IF(N83<>\"\",IF(AND(N83>=1,N83<=8,N83=ABS(N83)),IF(AND(N83<=9,N83>=1),IF(AND(AC83=1,H83<>\"\"),1,IF(AND(AC83=1,H83=\"\"),1.5,IF(AND(AC83=2,H83<>\"\"),2,IF(AND(AC83=2,H83=\"\"),3,0)))),\"\"),\"Err. Profil\"),\"\")","v":""},{"$f":"IF(O83<>\"\",IF(ROUND(M83,0)<=3,1,0),\"\")","v":""},{"$f":"IF(AND(R83<>\"\",Q83<>\"\",P83<>\"\"),IF($C83=\"\",\"SX\",IF($C83=\"F\",VLOOKUP(ROUND($L83,0)/100,Barème500,3),VLOOKUP(ROUND($L83,0)/100,Barème500,2))),\"\")","v":""},{"$f":"IF(OR(K83=\"\",K83=\"\",AH83=\"\",AG83=\"\",AF83=\"\"),\"\",IF(OR(K83<0,K83>2),\"Err ech.\",SUM(K83,AH83,AG83,AF83)))","v":""},null,null,null,null,null,{"$f":"IF(C83<>\"f\",\"m\",\"f\")","v":"m"}]
[null,null,null,null,null,null,null,null,null,null,null,{"$f":"IF(AND(R84<>\"\",Q84<>\"\",P84<>\"\"),(INT(((INT($P84)*60)+(($P84-INT($P84))*100)+(INT($Q84)*60)+(($Q84-INT($Q84))*100)+(INT($R84)*60)+(($R84-INT($R84))*100))/60)+MOD(((INT($P84)*60)+(($P84-INT($P84))*100)+(INT($Q84)*60)+(($Q84-INT($Q84))*100)+(INT($R84)*60)+(($R84-INT($R84))*100)),60)/100)*100,\"\")","v":""},{"$f":"IF(OR(O84=\"\",P84=\"\"),\"\",ABS((INT(P84)*60)+((P84-INT(P84))*100)-((INT(O84)*60)+((O84-INT(O84))*100))))","v":""},{"$f":"IF(AND(E84=\"\",H84=\"\"),\"\",IF(H84=\"\",E84,H84))","v":""},{"$f":"IF(F84=\"\",\"\",F84/100)","v":""},{"$f":"IF(G84=\"\",\"\",G84/100)","v":""},{"$f":"IF(I84=\"\",\"\",I84/100)","v":""},{"$f":"IF(J84=\"\",\"\",J84/100)","v":""},{"$f":"ROUND((INT(Q84)*60)+((Q84-INT(Q84))*100)-((INT(P84)*60)+((P84-INT(P84))*100)),0)","v":{"$error":"#VALUE!"}},{"$f":"ROUND((INT(R84)*60)+((R84-INT(R84))*100)-((INT(Q84)*60)+((Q84-INT(Q84))*100)),0)","v":{"$error":"#VALUE!"}},{"$f":"ROUND((INT(R84)*60)+((R84-INT(R84))*100)-((INT(P84)*60)+((P84-INT(P84))*100)),0)","v":{"$error":"#VALUE!"}},{"$f":"IF(AND(Q84<>0,P84<>0),IF(OR(N84=1,N84=3,N84=4),IF(OR(S84=0,ABS(S84)<='Barèmes & Options'!H$2),1,0)),\"\")","v":false},{"$f":"IF(AND(Q84<>\"\",P84<>\"\"),IF(OR(N84=5,N84=7),IF(S84>0,1,0)),\"\")","v":""},{"$f":"IF(AND(Q84<>\"\",P84<>\"\"),IF(OR(N84=2,N84=6,N84=8),IF(S84<0,1,0)),\"\")","v":""},{"$f":"IF(AND(Q84<>0,R84<>0),IF(OR(N84=1,N84=5,N84=6),IF(OR(T84=0,ABS(T84)<='Barèmes & Options'!H$2),1,0)),\"\")","v":false},{"$f":"IF(AND(Q84<>\"\",R84<>\"\"),IF(OR(N84=4,N84=8),IF(T84>0,1,0)),\"\")","v":""},{"$f":"IF(AND(Q84<>\"\",R84<>\"\"),IF(OR(N84=2,N84=3,N84=7),IF(T84<0,1,0)),\"\")","v":""},{"$f":"IF(SUM(V84:AA84)=2,IF(N84=2,IF(N84=2,IF(U84-'Barèmes & Options'!H$2<-1,0,1)),\"\"),0)","v":0},{"$f":"IF(OR(N84=2,N84=9),SUM(V84:AA84)-AB84,SUM(V84:AA84))","v":0},{"$f":"IF(OR(V84=1,W84=1,X84=1),TRUE,FALSE)","v":false},{"$f":"IF(OR(Y84=1,Z84=1,AA84=1),TRUE,FALSE)","v":false},{"$f":"IF(N84<>\"\",IF(AND(N84>=1,N84<=8,N84=ABS(N84)),IF(AND(N84<=9,N84>=1),IF(AND(AC84=1,H84<>\"\"),1,IF(AND(AC84=1,H84=\"\"),1.5,IF(AND(AC84=2,H84<>\"\"),2,IF(AND(AC84=2,H84=\"\"),3,0)))),\"\"),\"Err. Profil\"),\"\")","v":""},{"$f":"IF(O84<>\"\",IF(ROUND(M84,0)<=3,1,0),\"\")","v":""},{"$f":"IF(AND(R84<>\"\",Q84<>\"\",P84<>\"\"),IF($C84=\"\",\"SX\",IF($C84=\"F\",VLOOKUP(ROUND($L84,0)/100,Barème500,3),VLOOKUP(ROUND($L84,0)/100,Barème500,2))),\"\")","v":""},{"$f":"IF(OR(K84=\"\",K84=\"\",AH84=\"\",AG84=\"\",AF84=\"\"),\"\",IF(OR(K84<0,K84>2),\"Err ech.\",SUM(K84,AH84,AG84,AF84)))","v":""},null,null,null,null,null,{"$f":"IF(C84<>\"f\",\"m\",\"f\")","v":"m"}]
[null,null,null,null,null,null,null,null,null,null,null,{"$f":"IF(AND(R85<>\"\",Q85<>\"\",P85<>\"\"),(INT(((INT($P85)*60)+(($P85-INT($P85))*100)+(INT($Q85)*60)+(($Q85-INT($Q85))*100)+(INT($R85)*60)+(($R85-INT($R85))*100))/60)+MOD(((INT($P85)*60)+(($P85-INT($P85))*100)+(INT($Q85)*60)+(($Q85-INT($Q85))*100)+(INT($R85)*60)+(($R85-INT($R85))*100)),60)/100)*100,\"\")","v":""},{"$f":"IF(OR(O85=\"\",P85=\"\"),\"\",ABS((INT(P85)*60)+((P85-INT(P85))*100)-((INT(O85)*60)+((O85-INT(O85))*100))))","v":""},{"$f":"IF(AND(E85=\"\",H85=\"\"),\"\",IF(H85=\"\",E85,H85))","v":""},{"$f":"IF(F85=\"\",\"\",F85/100)","v":""},{"$f":"IF(G85=\"\",\"\",G85/100)","v":""},{"$f":"IF(I85=\"\",\"\",I85/100)","v":""},{"$f":"IF(J85=\"\",\"\",J85/100)","v":""},{"$f":"ROUND((INT(Q85)*60)+((Q85-INT(Q85))*100)-((INT(P85)*60)+((P85-INT(P85))*100)),0)","v":{"$error":"#VALUE!"}},{"$f":"ROUND((INT(R85)*60)+((R85-INT(R85))*100)-((INT(Q85)*60)+((Q85-INT(Q85))*100)),0)","v":{"$error":"#VALUE!"}},{"$f":"ROUND((INT(R85)*60)+((R85-INT(R85))*100)-((INT(P85)*60)+((P85-INT(P85))*100)),0)","v":{"$error":"#VALUE!"}},{"$f":"IF(AND(Q85<>0,P85<>0),IF(OR(N85=1,N85=3,N85=4),IF(OR(S85=0,ABS(S85)<='Barèmes & Options'!H$2),1,0)),\"\")","v":false},{"$f":"IF(AND(Q85<>\"\",P85<>\"\"),IF(OR(N85=5,N85=7),IF(S85>0,1,0)),\"\")","v":""},{"$f":"IF(AND(Q85<>\"\",P85<>\"\"),IF(OR(N85=2,N85=6,N85=8),IF(S85<0,1,0)),\"\")","v":""},{"$f":"IF(AND(Q85<>0,R85<>0),IF(OR(N85=1,N85=5,N85=6),IF(OR(T85=0,ABS(T85)<='Barèmes & Options'!H$2),1,0)),\"\")","v":false},{"$f":"IF(AND(Q85<>\"\",R85<>\"\"),IF(OR(N85=4,N85=8),IF(T85>0,1,0)),\"\")","v":""},{"$f":"IF(AND(Q85<>\"\",R85<>\"\"),IF(OR(N85=2,N85=3,N85=7),IF(T85<0,1,0)),\"\")","v":""},{"$f":"IF(SUM(V85:AA85)=2,IF(N85=2,IF(N85=2,IF(U85-'Barèmes & Options'!H$2<-1,0,1)),\"\"),0)","v":0},{"$f":"IF(OR(N85=2,N85=9),SUM(V85:AA85)-AB85,SUM(V85:AA85))","v":0},{"$f":"IF(OR(V85=1,W85=1,X85=1),TRUE,FALSE)","v":false},{"$f":"IF(OR(Y85=1,Z85=1,AA85=1),TRUE,FALSE)","v":false},{"$f":"IF(N85<>\"\",IF(AND(N85>=1,N85<=8,N85=ABS(N85)),IF(AND(N85<=9,N85>=1),IF(AND(AC85=1,H85<>\"\"),1,IF(AND(AC85=1,H85=\"\"),1.5,IF(AND(AC85=2,H85<>\"\"),2,IF(AND(AC85=2,H85=\"\"),3,0)))),\"\"),\"Err. Profil\"),\"\")","v":""},{"$f":"IF(O85<>\"\",IF(ROUND(M85,0)<=3,1,0),\"\")","v":""},{"$f":"IF(AND(R85<>\"\",Q85<>\"\",P85<>\"\"),IF($C85=\"\",\"SX\",IF($C85=\"F\",VLOOKUP(ROUND($L85,0)/100,Barème500,3),VLOOKUP(ROUND($L85,0)/100,Barème500,2))),\"\")","v":""},{"$f":"IF(OR(K85=\"\",K85=\"\",AH85=\"\",AG85=\"\",AF85=\"\"),\"\",IF(OR(K85<0,K85>2),\"Err ech.\",SUM(K85,AH85,AG85,AF85)))","v":""},null,null,null,null,null,{"$f":"IF(C85<>\"f\",\"m\",\"f\")","v":"m"}]
[null,null,null,null,null,null,null,null,null,null,null,{"$f":"IF(AND(R86<>\"\",Q86<>\"\",P86<>\"\"),(INT(((INT($P86)*60)+(($P86-INT($P86))*100)+(INT($Q86)*60)+(($Q86-INT($Q86))*100)+(INT($R86)*60)+(($R86-INT($R86))*100))/60)+MOD(((INT($P86)*60)+(($P86-INT($P86))*100)+(INT($Q86)*60)+(($Q86-INT($Q86))*100)+(INT($R86)*60)+(($R86-INT($R86))*100)),60)/100)*100,\"\")","v":""},{"$f":"IF(OR(O86=\"\",P86=\"\"),\"\",ABS((INT(P86)*60)+((P86-INT(P86))*100)-((INT(O86)*60)+((O86-INT(O86))*100))))","v":""},{"$f":"IF(AND(E86=\"\",H86=\"\"),\"\",IF(H86=\"\",E86,H86))","v":""},{"$f":"IF(F86=\"\",\"\",F86/100)","v":""},{"$f":"IF(G86=\"\",\"\",G86/100)","v":""},{"$f":"IF(I86=\"\",\"\",I86/100)","v":""},{"$f":"IF(J86=\"\",\"\",J86/100)","v":""},{"$f":"ROUND((INT(Q86)*60)+((Q86-INT(Q86))*100)-((INT(P86)*60)+((P86-INT(P86))*100)),0)","v":{"$error":"#VALUE!"}},{"$f":"ROUND((INT(R86)*60)+((R86-INT(R86))*100)-((INT(Q86)*60)+((Q86-INT(Q86))*100)),0)","v":{"$error":"#VALUE!"}},{"$f":"ROUND((INT(R86)*60)+((R86-INT(R86))*100)-((INT(P86)*60)+((P86-INT(P86))*100)),0)","v":{"$error":"#VALUE!"}},{"$f":"IF(AND(Q86<>0,P86<>0),IF(OR(N86=1,N86=3,N86=4),IF(OR(S86=0,ABS(S86)<='Barèmes & Options'!H$2),1,0)),\"\")","v":false},{"$f":"IF(AND(Q86<>\"\",P86<>\"\"),IF(OR(N86=5,N86=7),IF(S86>0,1,0)),\"\")","v":""},{"$f":"IF(AND(Q86<>\"\",P86<>\"\"),IF(OR(N86=2,N86=6,N86=8),IF(S86<0,1,0)),\"\")","v":""},{"$f":"IF(AND(Q86<>0,R86<>0),IF(OR(N86=1,N86=5,N86=6),IF(OR(T86=0,ABS(T86)<='Barèmes & Options'!H$2),1,0)),\"\")","v":false},{"$f":"IF(AND(Q86<>\"\",R86<>\"\"),IF(OR(N86=4,N86=8),IF(T86>0,1,0)),\"\")","v":""},{"$f":"IF(AND(Q86<>\"\",R86<>\"\"),IF(OR(N86=2,N86=3,N86=7),IF(T86<0,1,0)),\"\")","v":""},{"$f":"IF(SUM(V86:AA86)=2,IF(N86=2,IF(N86=2,IF(U86-'Barèmes & Options'!H$2<-1,0,1)),\"\"),0)","v":0},{"$f":"IF(OR(N86=2,N86=9),SUM(V86:AA86)-AB86,SUM(V86:AA86))","v":0},{"$f":"IF(OR(V86=1,W86=1,X86=1),TRUE,FALSE)","v":false},{"$f":"IF(OR(Y86=1,Z86=1,AA86=1),TRUE,FALSE)","v":false},{"$f":"IF(N86<>\"\",IF(AND(N86>=1,N86<=8,N86=ABS(N86)),IF(AND(N86<=9,N86>=1),IF(AND(AC86=1,H86<>\"\"),1,IF(AND(AC86=1,H86=\"\"),1.5,IF(AND(AC86=2,H86<>\"\"),2,IF(AND(AC86=2,H86=\"\"),3,0)))),\"\"),\"Err. Profil\"),\"\")","v":""},{"$f":"IF(O86<>\"\",IF(ROUND(M86,0)<=3,1,0),\"\")","v":""},{"$f":"IF(AND(R86<>\"\",Q86<>\"\",P86<>\"\"),IF($C86=\"\",\"SX\",IF($C86=\"F\",VLOOKUP(ROUND($L86,0)/100,Barème500,3),VLOOKUP(ROUND($L86,0)/100,Barème500,2))),\"\")","v":""},{"$f":"IF(OR(K86=\"\",K86=\"\",AH86=\"\",AG86=\"\",AF86=\"\"),\"\",IF(OR(K86<0,K86>2),\"Err ech.\",SUM(K86,AH86,AG86,AF86)))","v":""},null,null,null,null,null,{"$f":"IF(C86<>\"f\",\"m\",\"f\")","v":"m"}]
[null,null,null,null,null,null,null,null,null,null,null,{"$f":"IF(AND(R87<>\"\",Q87<>\"\",P87<>\"\"),(INT(((INT($P87)*60)+(($P87-INT($P87))*100)+(INT($Q87)*60)+(($Q87-INT($Q87))*100)+(INT($R87)*60)+(($R87-INT($R87))*100))/60)+MOD(((INT($P87)*60)+(($P87-INT($P87))*100)+(INT($Q87)*60)+(($Q87-INT($Q87))*100)+(INT($R87)*60)+(($R87-INT($R87))*100)),60)/100)*100,\"\")","v":""},{"$f":"IF(OR(O87=\"\",P87=\"\"),\"\",ABS((INT(P87)*60)+((P87-INT(P87))*100)-((INT(O87)*60)+((O87-INT(O87))*100))))","v":""},{"$f":"IF(AND(E87=\"\",H87=\"\"),\"\",IF(H87=\"\",E87,H87))","v":""},{"$f":"IF(F87=\"\",\"\",F87/100)","v":""},{"$f":"IF(G87=\"\",\"\",G87/100)","v":""},{"$f":"IF(I87=\"\",\"\",I87/100)","v":""},{"$f":"IF(J87=\"\",\"\",J87/100)","v":""},{"$f":"ROUND((INT(Q87)*60)+((Q87-INT(Q87))*100)-((INT(P87)*60)+((P87-INT(P87))*100)),0)","v":{"$error":"#VALUE!"}},{"$f":"ROUND((INT(R87)*60)+((R87-INT(R87))*100)-((INT(Q87)*60)+((Q87-INT(Q87))*100)),0)","v":{"$error":"#VALUE!"}},{"$f":"ROUND((INT(R87)*60)+((R87-INT(R87))*100)-((INT(P87)*60)+((P87-INT(P87))*100)),0)","v":{"$error":"#VALUE!"}},{"$f":"IF(AND(Q87<>0,P87<>0),IF(OR(N87=1,N87=3,N87=4),IF(OR(S87=0,ABS(S87)<='Barèmes & Options'!H$2),1,0)),\"\")","v":false},{"$f":"IF(AND(Q87<>\"\",P87<>\"\"),IF(OR(N87=5,N87=7),IF(S87>0,1,0)),\"\")","v":""},{"$f":"IF(AND(Q87<>\"\",P87<>\"\"),IF(OR(N87=2,N87=6,N87=8),IF(S87<0,1,0)),\"\")","v":""},{"$f":"IF(AND(Q87<>0,R87<>0),IF(OR(N87=1,N87=5,N87=6),IF(OR(T87=0,ABS(T87)<='Barèmes & Options'!H$2),1,0)),\"\")","v":false},{"$f":"IF(AND(Q87<>\"\",R87<>\"\"),IF(OR(N87=4,N87=8),IF(T87>0,1,0)),\"\")","v":""},{"$f":"IF(AND(Q87<>\"\",R87<>\"\"),IF(OR(N87=2,N87=3,N87=7),IF(T87<0,1,0)),\"\")","v":""},{"$f":"IF(SUM(V87:AA87)=2,IF(N87=2,IF(N87=2,IF(U87-'Barèmes & Options'!H$2<-1,0,1)),\"\"),0)","v":0},{"$f":"IF(OR(N87=2,N87=9),SUM(V87:AA87)-AB87,SUM(V87:AA87))","v":0},{"$f":"IF(OR(V87=1,W87=1,X87=1),TRUE,FALSE)","v":false},{"$f":"IF(OR(Y87=1,Z87=1,AA87=1),TRUE,FALSE)","v":false},{"$f":"IF(N87<>\"\",IF(AND(N87>=1,N87<=8,N87=ABS(N87)),IF(AND(N87<=9,N87>=1),IF(AND(AC87=1,H87<>\"\"),1,IF(AND(AC87=1,H87=\"\"),1.5,IF(AND(AC87=2,H87<>\"\"),2,IF(AND(AC87=2,H87=\"\"),3,0)))),\"\"),\"Err. Profil\"),\"\")","v":""},{"$f":"IF(O87<>\"\",IF(ROUND(M87,0)<=3,1,0),\"\")","v":""},{"$f":"IF(AND(R87<>\"\",Q87<>\"\",P87<>\"\"),IF($C87=\"\",\"SX\",IF($C87=\"F\",VLOOKUP(ROUND($L87,0)/100,Barème500,3),VLOOKUP(ROUND($L87,0)/100,Barème500,2))),\"\")","v":""},{"$f":"IF(OR(K87=\"\",K87=\"\",AH87=\"\",AG87=\"\",AF87=\"\"),\"\",IF(OR(K87<0,K87>2),\"Err ech.\",SUM(K87,AH87,AG87,AF87)))","v":""},null,null,null,null,null,{"$f":"IF(C87<>\"f\",\"m\",\"f\")","v":"m"}]
[null,null,null,null,null,null,null,null,null,null,null,{"$f":"IF(AND(R88<>\"\",Q88<>\"\",P88<>\"\"),(INT(((INT($P88)*60)+(($P88-INT($P88))*100)+(INT($Q88)*60)+(($Q88-INT($Q88))*100)+(INT($R88)*60)+(($R88-INT($R88))*100))/60)+MOD(((INT($P88)*60)+(($P88-INT($P88))*100)+(INT($Q88)*60)+(($Q88-INT($Q88))*100)+(INT($R88)*60)+(($R88-INT($R88))*100)),60)/100)*100,\"\")","v":""},{"$f":"IF(OR(O88=\"\",P88=\"\"),\"\",ABS((INT(P88)*60)+((P88-INT(P88))*100)-((INT(O88)*60)+((O88-INT(O88))*100))))","v":""},{"$f":"IF(AND(E88=\"\",H88=\"\"),\"\",IF(H88=\"\",E88,H88))","v":""},{"$f":"IF(F88=\"\",\"\",F88/100)","v":""},{"$f":"IF(G88=\"\",\"\",G88/100)","v":""},{"$f":"IF(I88=\"\",\"\",I88/100)","v":""},{"$f":"IF(J88=\"\",\"\",J88/100)","v":""},{"$f":"ROUND((INT(Q88)*60)+((Q88-INT(Q88))*100)-((INT(P88)*60)+((P88-INT(P88))*100)),0)","v":{"$error":"#VALUE!"}},{"$f":"ROUND((INT(R88)*60)+((R88-INT(R88))*100)-((INT(Q88)*60)+((Q88-INT(Q88))*100)),0)","v":{"$error":"#VALUE!"}},{"$f":"ROUND((INT(R88)*60)+((R88-INT(R88))*100)-((INT(P88)*60)+((P88-INT(P88))*100)),0)","v":{"$error":"#VALUE!"}},{"$f":"IF(AND(Q88<>0,P88<>0),IF(OR(N88=1,N88=3,N88=4),IF(OR(S88=0,ABS(S88)<='Barèmes & Options'!H$2),1,0)),\"\")","v":false},{"$f":"IF(AND(Q88<>\"\",P88<>\"\"),IF(OR(N88=5,N88=7),IF(S88>0,1,0)),\"\")","v":""},{"$f":"IF(AND(Q88<>\"\",P88<>\"\"),IF(OR(N88=2,N88=6,N88=8),IF(S88<0,1,0)),\"\")","v":""},{"$f":"IF(AND(Q88<>0,R88<>0),IF(OR(N88=1,N88=5,N88=6),IF(OR(T88=0,ABS(T88)<='Barèmes & Options'!H$2),1,0)),\"\")","v":false},{"$f":"IF(AND(Q88<>\"\",R88<>\"\"),IF(OR(N88=4,N88=8),IF(T88>0,1,0)),\"\")","v":""},{"$f":"IF(AND(Q88<>\"\",R88<>\"\"),IF(OR(N88=2,N88=3,N88=7),IF(T88<0,1,0)),\"\")","v":""},{"$f":"IF(SUM(V88:AA88)=2,IF(N88=2,IF(N88=2,IF(U88-'Barèmes & Options'!H$2<-1,0,1)),\"\"),0)","v":0},{"$f":"IF(OR(N88=2,N88=9),SUM(V88:AA88)-AB88,SUM(V88:AA88))","v":0},{"$f":"IF(OR(V88=1,W88=1,X88=1),TRUE,FALSE)","v":false},{"$f":"IF(OR(Y88=1,Z88=1,AA88=1),TRUE,FALSE)","v":false},{"$f":"IF(N88<>\"\",IF(AND(N88>=1,N88<=8,N88=ABS(N88)),IF(AND(N88<=9,N88>=1),IF(AND(AC88=1,H88<>\"\"),1,IF(AND(AC88=1,H88=\"\"),1.5,IF(AND(AC88=2,H88<>\"\"),2,IF(AND(AC88=2,H88=\"\"),3,0)))),\"\"),\"Err. Profil\"),\"\")","v":""},{"$f":"IF(O88<>\"\",IF(ROUND(M88,0)<=3,1,0),\"\")","v":""},{"$f":"IF(AND(R88<>\"\",Q88<>\"\",P88<>\"\"),IF($C88=\"\",\"SX\",IF($C88=\"F\",VLOOKUP(ROUND($L88,0)/100,Barème500,3),VLOOKUP(ROUND($L88,0)/100,Barème500,2))),\"\")","v":""},{"$f":"IF(OR(K88=\"\",K88=\"\",AH88=\"\",AG88=\"\",AF88=\"\"),\"\",IF(OR(K88<0,K88>2),\"Err ech.\",SUM(K88,AH88,AG88,AF88)))","v":""},null,null,null,null,null,{"$f":"IF(C88<>\"f\",\"m\",\"f\")","v":"m"}]
[null,null,null,null,null,null,null,null,null,null,null,{"$f":"IF(AND(R89<>\"\",Q89<>\"\",P89<>\"\"),(INT(((INT($P89)*60)+(($P89-INT($P89))*100)+(INT($Q89)*60)+(($Q89-INT($Q89))*100)+(INT($R89)*60)+(($R89-INT($R89))*100))/60)+MOD(((INT($P89)*60)+(($P89-INT($P89))*100)+(INT($Q89)*60)+(($Q89-INT($Q89))*100)+(INT($R89)*60)+(($R89-INT($R89))*100)),60)/100)*100,\"\")","v":""},{"$f":"IF(OR(O89=\"\",P89=\"\"),\"\",ABS((INT(P89)*60)+((P89-INT(P89))*100)-((INT(O89)*60)+((O89-INT(O89))*100))))","v":""},{"$f":"IF(AND(E89=\"\",H89=\"\"),\"\",IF(H89=\"\",E89,H89))","v":""},{"$f":"IF(F89=\"\",\"\",F89/100)","v":""},{"$f":"IF(G89=\"\",\"\",G89/100)","v":""},{"$f":"IF(I89=\"\",\"\",I89/100)","v":""},{"$f":"IF(J89=\"\",\"\",J89/100)","v":""},{"$f":"ROUND((INT(Q89)*60)+((Q89-INT(Q89))*100)-((INT(P89)*60)+((P89-INT(P89))*100)),0)","v":{"$error":"#VALUE!"}},{"$f":"ROUND((INT(R89)*60)+((R89-INT(R89))*100)-((INT(Q89)*60)+((Q89-INT(Q89))*100)),0)","v":{"$error":"#VALUE!"}},{"$f":"ROUND((INT(R89)*60)+((R89-INT(R89))*100)-((INT(P89)*60)+((P89-INT(P89))*100)),0)","v":{"$error":"#VALUE!"}},{"$f":"IF(AND(Q89<>0,P89<>0),IF(OR(N89=1,N89=3,N89=4),IF(OR(S89=0,ABS(S89)<='Barèmes & Options'!H$2),1,0)),\"\")","v":false},{"$f":"IF(AND(Q89<>\"\",P89<>\"\"),IF(OR(N89=5,N89=7),IF(S89>0,1,0)),\"\")","v":""},{"$f":"IF(AND(Q89<>\"\",P89<>\"\"),IF(OR(N89=2,N89=6,N89=8),IF(S89<0,1,0)),\"\")","v":""},{"$f":"IF(AND(Q89<>0,R89<>0),IF(OR(N89=1,N89=5,N89=6),IF(OR(T89=0,ABS(T89)<='Barèmes & Options'!H$2),1,0)),\"\")","v":false},{"$f":"IF(AND(Q89<>\"\",R89<>\"\"),IF(OR(N89=4,N89=8),IF(T89>0,1,0)),\"\")","v":""},{"$f":"IF(AND(Q89<>\"\",R89<>\"\"),IF(OR(N89=2,N89=3,N89=7),IF(T89<0,1,0)),\"\")","v":""},{"$f":"IF(SUM(V89:AA89)=2,IF(N89=2,IF(N89=2,IF(U89-'Barèmes & Options'!H$2<-1,0,1)),\"\"),0)","v":0},{"$f":"IF(OR(N89=2,N89=9),SUM(V89:AA89)-AB89,SUM(V89:AA89))","v":0},{"$f":"IF(OR(V89=1,W89=1,X89=1),TRUE,FALSE)","v":false},{"$f":"IF(OR(Y89=1,Z89=1,AA89=1),TRUE,FALSE)","v":false},{"$f":"IF(N89<>\"\",IF(AND(N89>=1,N89<=8,N89=ABS(N89)),IF(AND(N89<=9,N89>=1),IF(AND(AC89=1,H89<>\"\"),1,IF(AND(AC89=1,H89=\"\"),1.5,IF(AND(AC89=2,H89<>\"\"),2,IF(AND(AC89=2,H89=\"\"),3,0)))),\"\"),\"Err. Profil\"),\"\")","v":""},{"$f":"IF(O89<>\"\",IF(ROUND(M89,0)<=3,1,0),\"\")","v":""},{"$f":"IF(AND(R89<>\"\",Q89<>\"\",P89<>\"\"),IF($C89=\"\",\"SX\",IF($C89=\"F\",VLOOKUP(ROUND($L89,0)/100,Barème500,3),VLOOKUP(ROUND($L89,0)/100,Barème500,2))),\"\")","v":""},{"$f":"IF(OR(K89=\"\",K89=\"\",AH89=\"\",AG89=\"\",AF89=\"\"),\"\",IF(OR(K89<0,K89>2),\"Err ech.\",SUM(K89,AH89,AG89,AF89)))","v":""},null,null,null,null,null,{"$f":"IF(C89<>\"f\",\"m\",\"f\")","v":"m"}]
[null,null,null,null,null,null,null,null,null,null,null,{"$f":"IF(AND(R90<>\"\",Q90<>\"\",P90<>\"\"),(INT(((INT($P90)*60)+(($P90-INT($P90))*100)+(INT($Q90)*60)+(($Q90-INT($Q90))*100)+(INT($R90)*60)+(($R90-INT($R90))*100))/60)+MOD(((INT($P90)*60)+(($P90-INT($P90))*100)+(INT($Q90)*60)+(($Q90-INT($Q90))*100)+(INT($R90)*60)+(($R90-INT($R90))*100)),60)/100)*100,\"\")","v":""},{"$f":"IF(OR(O90=\"\",P90=\"\"),\"\",ABS((INT(P90)*60)+((P90-INT(P90))*100)-((INT(O90)*60)+((O90-INT(O90))*100))))","v":""},{"$f":"IF(AND(E90=\"\",H90=\"\"),\"\",IF(H90=\"\",E90,H90))","v":""},{"$f":"IF(F90=\"\",\"\",F90/100)","v":""},{"$f":"IF(G90=\"\",\"\",G90/100)","v":""},{"$f":"IF(I90=\"\",\"\",I90/100)","v":""},{"$f":"IF(J90=\"\",\"\",J90/100)","v":""},{"$f":"ROUND((INT(Q90)*60)+((Q90-INT(Q90))*100)-((INT(P90)*60)+((P90-INT(P90))*100)),0)","v":{"$error":"#VALUE!"}},{"$f":"ROUND((INT(R90)*60)+((R90-INT(R90))*100)-((INT(Q90)*60)+((Q90-INT(Q90))*100)),0)","v":{"$error":"#VALUE!"}},{"$f":"ROUND((INT(R90)*60)+((R90-INT(R90))*100)-((INT(P90)*60)+((P90-INT(P90))*100)),0)","v":{"$error":"#VALUE!"}},{"$f":"IF(AND(Q90<>0,P90<>0),IF(OR(N90=1,N90=3,N90=4),IF(OR(S90=0,ABS(S90)<='Barèmes & Options'!H$2),1,0)),\"\")","v":false},{"$f":"IF(AND(Q90<>\"\",P90<>\"\"),IF(OR(N90=5,N90=7),IF(S90>0,1,0)),\"\")","v":""},{"$f":"IF(AND(Q90<>\"\",P90<>\"\"),IF(OR(N90=2,N90=6,N90=8),IF(S90<0,1,0)),\"\")","v":""},{"$f":"IF(AND(Q90<>0,R90<>0),IF(OR(N90=1,N90=5,N90=6),IF(OR(T90=0,ABS(T90)<='Barèmes & Options'!H$2),1,0)),\"\")","v":false},{"$f":"IF(AND(Q90<>\"\",R90<>\"\"),IF(OR(N90=4,N90=8),IF(T90>0,1,0)),\"\")","v":""},{"$f":"IF(AND(Q90<>\"\",R90<>\"\"),IF(OR(N90=2,N90=3,N90=7),IF(T90<0,1,0)),\"\")","v":""},{"$f":"IF(SUM(V90:AA90)=2,IF(N90=2,IF(N90=2,IF(U90-'Barèmes & Options'!H$2<-1,0,1)),\"\"),0)","v":0},{"$f":"IF(OR(N90=2,N90=9),SUM(V90:AA90)-AB90,SUM(V90:AA90))","v":0},{"$f":"IF(OR(V90=1,W90=1,X90=1),TRUE,FALSE)","v":false},{"$f":"IF(OR(Y90=1,Z90=1,AA90=1),TRUE,FALSE)","v":false},{"$f":"IF(N90<>\"\",IF(AND(N90>=1,N90<=8,N90=ABS(N90)),IF(AND(N90<=9,N90>=1),IF(AND(AC90=1,H90<>\"\"),1,IF(AND(AC90=1,H90=\"\"),1.5,IF(AND(AC90=2,H90<>\"\"),2,IF(AND(AC90=2,H90=\"\"),3,0)))),\"\"),\"Err. Profil\"),\"\")","v":""},{"$f":"IF(O90<>\"\",IF(ROUND(M90,0)<=3,1,0),\"\")","v":""},{"$f":"IF(AND(R90<>\"\",Q90<>\"\",P90<>\"\"),IF($C90=\"\",\"SX\",IF($C90=\"F\",VLOOKUP(ROUND($L90,0)/100,Barème500,3),VLOOKUP(ROUND($L90,0)/100,Barème500,2))),\"\")","v":""},{"$f":"IF(OR(K90=\"\",K90=\"\",AH90=\"\",AG90=\"\",AF90=\"\"),\"\",IF(OR(K90<0,K90>2),\"Err ech.\",SUM(K90,AH90,AG90,AF90)))","v":""},null,null,null,null,null,{"$f":"IF(C90<>\"f\",\"m\",\"f\")","v":"m"}]
[null,null,null,null,null,null,null,null,null,null,null,{"$f":"IF(AND(R91<>\"\",Q91<>\"\",P91<>\"\"),(INT(((INT($P91)*60)+(($P91-INT($P91))*100)+(INT($Q91)*60)+(($Q91-INT($Q91))*100)+(INT($R91)*60)+(($R91-INT($R91))*100))/60)+MOD(((INT($P91)*60)+(($P91-INT($P91))*100)+(INT($Q91)*60)+(($Q91-INT($Q91))*100)+(INT($R91)*60)+(($R91-INT($R91))*100)),60)/100)*100,\"\")","v":""},{"$f":"IF(OR(O91=\"\",P91=\"\"),\"\",ABS((INT(P91)*60)+((P91-INT(P91))*100)-((INT(O91)*60)+((O91-INT(O91))*100))))","v":""},{"$f":"IF(AND(E91=\"\",H91=\"\"),\"\",IF(H91=\"\",E91,H91))","v":""},{"$f":"IF(F91=\"\",\"\",F91/100)","v":""},{"$f":"IF(G91=\"\",\"\",G91/100)","v":""},{"$f":"IF(I91=\"\",\"\",I91/100)","v":""},{"$f":"IF(J91=\"\",\"\",J91/100)","v":""},{"$f":"ROUND((INT(Q91)*60)+((Q91-INT(Q91))*100)-((INT(P91)*60)+((P91-INT(P91))*100)),0)","v":{"$error":"#VALUE!"}},{"$f":"ROUND((INT(R91)*60)+((R91-INT(R91))*100)-((INT(Q91)*60)+((Q91-INT(Q91))*100)),0)","v":{"$error":"#VALUE!"}},{"$f":"ROUND((INT(R91)*60)+((R91-INT(R91))*100)-((INT(P91)*60)+((P91-INT(P91))*100)),0)","v":{"$error":"#VALUE!"}},{"$f":"IF(AND(Q91<>0,P91<>0),IF(OR(N91=1,N91=3,N91=4),IF(OR(S91=0,ABS(S91)<='Barèmes & Options'!H$2),1,0)),\"\")","v":false},{"$f":"IF(AND(Q91<>\"\",P91<>\"\"),IF(OR(N91=5,N91=7),IF(S91>0,1,0)),\"\")","v":""},{"$f":"IF(AND(Q91<>\"\",P91<>\"\"),IF(OR(N91=2,N91=6,N91=8),IF(S91<0,1,0)),\"\")","v":""},{"$f":"IF(AND(Q91<>0,R91<>0),IF(OR(N91=1,N91=5,N91=6),IF(OR(T91=0,ABS(T91)<='Barèmes & Options'!H$2),1,0)),\"\")","v":false},{"$f":"IF(AND(Q91<>\"\",R91<>\"\"),IF(OR(N91=4,N91=8),IF(T91>0,1,0)),\"\")","v":""},{"$f":"IF(AND(Q91<>\"\",R91<>\"\"),IF(OR(N91=2,N91=3,N91=7),IF(T91<0,1,0)),\"\")","v":""},{"$f":"IF(SUM(V91:AA91)=2,IF(N91=2,IF(N91=2,IF(U91-'Barèmes & Options'!H$2<-1,0,1)),\"\"),0)","v":0},{"$f":"IF(OR(N91=2,N91=9),SUM(V91:AA91)-AB91,SUM(V91:AA91))","v":0},{"$f":"IF(OR(V91=1,W91=1,X91=1),TRUE,FALSE)","v":false},{"$f":"IF(OR(Y91=1,Z91=1,AA91=1),TRUE,FALSE)","v":false},{"$f":"IF(N91<>\"\",IF(AND(N91>=1,N91<=8,N91=ABS(N91)),IF(AND(N91<=9,N91>=1),IF(AND(AC91=1,H91<>\"\"),1,IF(AND(AC91=1,H91=\"\"),1.5,IF(AND(AC91=2,H91<>\"\"),2,IF(AND(AC91=2,H91=\"\"),3,0)))),\"\"),\"Err. Profil\"),\"\")","v":""},{"$f":"IF(O91<>\"\",IF(ROUND(M91,0)<=3,1,0),\"\")","v":""},{"$f":"IF(AND(R91<>\"\",Q91<>\"\",P91<>\"\"),IF($C91=\"\",\"SX\",IF($C91=\"F\",VLOOKUP(ROUND($L91,0)/100,Barème500,3),VLOOKUP(ROUND($L91,0)/100,Barème500,2))),\"\")","v":""},{"$f":"IF(OR(K91=\"\",K91=\"\",AH91=\"\",AG91=\"\",AF91=\"\"),\"\",IF(OR(K91<0,K91>2),\"Err ech.\",SUM(K91,AH91,AG91,AF91)))","v":""},null,null,null,null,null,{"$f":"IF(C91<>\"f\",\"m\",\"f\")","v":"m"}]
[null,null,null,null,null,null,null,null,null,null,null,{"$f":"IF(AND(R92<>\"\",Q92<>\"\",P92<>\"\"),(INT(((INT($P92)*60)+(($P92-INT($P92))*100)+(INT($Q92)*60)+(($Q92-INT($Q92))*100)+(INT($R92)*60)+(($R92-INT($R92))*100))/60)+MOD(((INT($P92)*60)+(($P92-INT($P92))*100)+(INT($Q92)*60)+(($Q92-INT($Q92))*100)+(INT($R92)*60)+(($R92-INT($R92))*100)),60)/100)*100,\"\")","v":""},{"$f":"IF(OR(O92=\"\",P92=\"\"),\"\",ABS((INT(P92)*60)+((P92-INT(P92))*100)-((INT(O92)*60)+((O92-INT(O92))*100))))","v":""},{"$f":"IF(AND(E92=\"\",H92=\"\"),\"\",IF(H92=\"\",E92,H92))","v":""},{"$f":"IF(F92=\"\",\"\",F92/100)","v":""},{"$f":"IF(G92=\"\",\"\",G92/100)","v":""},{"$f":"IF(I92=\"\",\"\",I92/100)","v":""},{"$f":"IF(J92=\"\",\"\",J92/100)","v":""},{"$f":"ROUND((INT(Q92)*60)+((Q92-INT(Q92))*100)-((INT(P92)*60)+((P92-INT(P92))*100)),0)","v":{"$error":"#VALUE!"}},{"$f":"ROUND((INT(R92)*60)+((R92-INT(R92))*100)-((INT(Q92)*60)+((Q92-INT(Q92))*100)),0)","v":{"$error":"#VALUE!"}},{"$f":"ROUND((INT(R92)*60)+((R92-INT(R92))*100)-((INT(P92)*60)+((P92-INT(P92))*100)),0)","v":{"$error":"#VALUE!"}},{"$f":"IF(AND(Q92<>0,P92<>0),IF(OR(N92=1,N92=3,N92=4),IF(OR(S92=0,ABS(S92)<='Barèmes & Options'!H$2),1,0)),\"\")","v":false},{"$f":"IF(AND(Q92<>\"\",P92<>\"\"),IF(OR(N92=5,N92=7),IF(S92>0,1,0)),\"\")","v":""},{"$f":"IF(AND(Q92<>\"\",P92<>\"\"),IF(OR(N92=2,N92=6,N92=8),IF(S92<0,1,0)),\"\")","v":""},{"$f":"IF(AND(Q92<>0,R92<>0),IF(OR(N92=1,N92=5,N92=6),IF(OR(T92=0,ABS(T92)<='Barèmes & Options'!H$2),1,0)),\"\")","v":false},{"$f":"IF(AND(Q92<>\"\",R92<>\"\"),IF(OR(N92=4,N92=8),IF(T92>0,1,0)),\"\")","v":""},{"$f":"IF(AND(Q92<>\"\",R92<>\"\"),IF(OR(N92=2,N92=3,N92=7),IF(T92<0,1,0)),\"\")","v":""},{"$f":"IF(SUM(V92:AA92)=2,IF(N92=2,IF(N92=2,IF(U92-'Barèmes & Options'!H$2<-1,0,1)),\"\"),0)","v":0},{"$f":"IF(OR(N92=2,N92=9),SUM(V92:AA92)-AB92,SUM(V92:AA92))","v":0},{"$f":"IF(OR(V92=1,W92=1,X92=1),TRUE,FALSE)","v":false},{"$f":"IF(OR(Y92=1,Z92=1,AA92=1),TRUE,FALSE)","v":false},{"$f":"IF(N92<>\"\",IF(AND(N92>=1,N92<=8,N92=ABS(N92)),IF(AND(N92<=9,N92>=1),IF(AND(AC92=1,H92<>\"\"),1,IF(AND(AC92=1,H92=\"\"),1.5,IF(AND(AC92=2,H92<>\"\"),2,IF(AND(AC92=2,H92=\"\"),3,0)))),\"\"),\"Err. Profil\"),\"\")","v":""},{"$f":"IF(O92<>\"\",IF(ROUND(M92,0)<=3,1,0),\"\")","v":""},{"$f":"IF(AND(R92<>\"\",Q92<>\"\",P92<>\"\"),IF($C92=\"\",\"SX\",IF($C92=\"F\",VLOOKUP(ROUND($L92,0)/100,Barème500,3),VLOOKUP(ROUND($L92,0)/100,Barème500,2))),\"\")","v":""},{"$f":"IF(OR(K92=\"\",K92=\"\",AH92=\"\",AG92=\"\",AF92=\"\"),\"\",IF(OR(K92<0,K92>2),\"Err ech.\",SUM(K92,AH92,AG92,AF92)))","v":""},null,null,null,null,null,{"$f":"IF(C92<>\"f\",\"m\",\"f\")","v":"m"}]
[null,null,null,null,null,null,null,null,null,null,null,{"$f":"IF(AND(R93<>\"\",Q93<>\"\",P93<>\"\"),(INT(((INT($P93)*60)+(($P93-INT($P93))*100)+(INT($Q93)*60)+(($Q93-INT($Q93))*100)+(INT($R93)*60)+(($R93-INT($R93))*100))/60)+MOD(((INT($P93)*60)+(($P93-INT($P93))*100)+(INT($Q93)*60)+(($Q93-INT($Q93))*100)+(INT($R93)*60)+(($R93-INT($R93))*100)),60)/100)*100,\"\")","v":""},{"$f":"IF(OR(O93=\"\",P93=\"\"),\"\",ABS((INT(P93)*60)+((P93-INT(P93))*100)-((INT(O93)*60)+((O93-INT(O93))*100))))","v":""},{"$f":"IF(AND(E93=\"\",H93=\"\"),\"\",IF(H93=\"\",E93,H93))","v":""},{"$f":"IF(F93=\"\",\"\",F93/100)","v":""},{"$f":"IF(G93=\"\",\"\",G93/100)","v":""},{"$f":"IF(I93=\"\",\"\",I93/100)","v":""},{"$f":"IF(J93=\"\",\"\",J93/100)","v":""},{"$f":"ROUND((INT(Q93)*60)+((Q93-INT(Q93))*100)-((INT(P93)*60)+((P93-INT(P93))*100)),0)","v":{"$error":"#VALUE!"}},{"$f":"ROUND((INT(R93)*60)+((R93-INT(R93))*100)-((INT(Q93)*60)+((Q93-INT(Q93))*100)),0)","v":{"$error":"#VALUE!"}},{"$f":"ROUND((INT(R93)*60)+((R93-INT(R93))*100)-((INT(P93)*60)+((P93-INT(P93))*100)),0)","v":{"$error":"#VALUE!"}},{"$f":"IF(AND(Q93<>0,P93<>0),IF(OR(N93=1,N93=3,N93=4),IF(OR(S93=0,ABS(S93)<='Barèmes & Options'!H$2),1,0)),\"\")","v":false},{"$f":"IF(AND(Q93<>\"\",P93<>\"\"),IF(OR(N93=5,N93=7),IF(S93>0,1,0)),\"\")","v":""},{"$f":"IF(AND(Q93<>\"\",P93<>\"\"),IF(OR(N93=2,N93=6,N93=8),IF(S93<0,1,0)),\"\")","v":""},{"$f":"IF(AND(Q93<>0,R93<>0),IF(OR(N93=1,N93=5,N93=6),IF(OR(T93=0,ABS(T93)<='Barèmes & Options'!H$2),1,0)),\"\")","v":false},{"$f":"IF(AND(Q93<>\"\",R93<>\"\"),IF(OR(N93=4,N93=8),IF(T93>0,1,0)),\"\")","v":""},{"$f":"IF(AND(Q93<>\"\",R93<>\"\"),IF(OR(N93=2,N93=3,N93=7),IF(T93<0,1,0)),\"\")","v":""},{"$f":"IF(SUM(V93:AA93)=2,IF(N93=2,IF(N93=2,IF(U93-'Barèmes & Options'!H$2<-1,0,1)),\"\"),0)","v":0},{"$f":"IF(OR(N93=2,N93=9),SUM(V93:AA93)-AB93,SUM(V93:AA93))","v":0},{"$f":"IF(OR(V93=1,W93=1,X93=1),TRUE,FALSE)","v":false},{"$f":"IF(OR(Y93=1,Z93=1,AA93=1),TRUE,FALSE)","v":false},{"$f":"IF(N93<>\"\",IF(AND(N93>=1,N93<=8,N93=ABS(N93)),IF(AND(N93<=9,N93>=1),IF(AND(AC93=1,H93<>\"\"),1,IF(AND(AC93=1,H93=\"\"),1.5,IF(AND(AC93=2,H93<>\"\"),2,IF(AND(AC93=2,H93=\"\"),3,0)))),\"\"),\"Err. Profil\"),\"\")","v":""},{"$f":"IF(O93<>\"\",IF(ROUND(M93,0)<=3,1,0),\"\")","v":""},{"$f":"IF(AND(R93<>\"\",Q93<>\"\",P93<>\"\"),IF($C93=\"\",\"SX\",IF($C93=\"F\",VLOOKUP(ROUND($L93,0)/100,Barème500,3),VLOOKUP(ROUND($L93,0)/100,Barème500,2))),\"\")","v":""},{"$f":"IF(OR(K93=\"\",K93=\"\",AH93=\"\",AG93=\"\",AF93=\"\"),\"\",IF(OR(K93<0,K93>2),\"Err ech.\",SUM(K93,AH93,AG93,AF93)))","v":""},null,null,null,null,null,{"$f":"IF(C93<>\"f\",\"m\",\"f\")","v":"m"}]
[null,null,null,null,null,null,null,null,null,null,null,{"$f":"IF(AND(R94<>\"\",Q94<>\"\",P94<>\"\"),(INT(((INT($P94)*60)+(($P94-INT($P94))*100)+(INT($Q94)*60)+(($Q94-INT($Q94))*100)+(INT($R94)*60)+(($R94-INT($R94))*100))/60)+MOD(((INT($P94)*60)+(($P94-INT($P94))*100)+(INT($Q94)*60)+(($Q94-INT($Q94))*100)+(INT($R94)*60)+(($R94-INT($R94))*100)),60)/100)*100,\"\")","v":""},{"$f":"IF(OR(O94=\"\",P94=\"\"),\"\",ABS((INT(P94)*60)+((P94-INT(P94))*100)-((INT(O94)*60)+((O94-INT(O94))*100))))","v":""},{"$f":"IF(AND(E94=\"\",H94=\"\"),\"\",IF(H94=\"\",E94,H94))","v":""},{"$f":"IF(F94=\"\",\"\",F94/100)","v":""},{"$f":"IF(G94=\"\",\"\",G94/100)","v":""},{"$f":"IF(I94=\"\",\"\",I94/100)","v":""},{"$f":"IF(J94=\"\",\"\",J94/100)","v":""},{"$f":"ROUND((INT(Q94)*60)+((Q94-INT(Q94))*100)-((INT(P94)*60)+((P94-INT(P94))*100)),0)","v":{"$error":"#VALUE!"}},{"$f":"ROUND((INT(R94)*60)+((R94-INT(R94))*100)-((INT(Q94)*60)+((Q94-INT(Q94))*100)),0)","v":{"$error":"#VALUE!"}},{"$f":"ROUND((INT(R94)*60)+((R94-INT(R94))*100)-((INT(P94)*60)+((P94-INT(P94))*100)),0)","v":{"$error":"#VALUE!"}},{"$f":"IF(AND(Q94<>0,P94<>0),IF(OR(N94=1,N94=3,N94=4),IF(OR(S94=0,ABS(S94)<='Barèmes & Options'!H$2),1,0)),\"\")","v":false},{"$f":"IF(AND(Q94<>\"\",P94<>\"\"),IF(OR(N94=5,N94=7),IF(S94>0,1,0)),\"\")","v":""},{"$f":"IF(AND(Q94<>\"\",P94<>\"\"),IF(OR(N94=2,N94=6,N94=8),IF(S94<0,1,0)),\"\")","v":""},{"$f":"IF(AND(Q94<>0,R94<>0),IF(OR(N94=1,N94=5,N94=6),IF(OR(T94=0,ABS(T94)<='Barèmes & Options'!H$2),1,0)),\"\")","v":false},{"$f":"IF(AND(Q94<>\"\",R94<>\"\"),IF(OR(N94=4,N94=8),IF(T94>0,1,0)),\"\")","v":""},{"$f":"IF(AND(Q94<>\"\",R94<>\"\"),IF(OR(N94=2,N94=3,N94=7),IF(T94<0,1,0)),\"\")","v":""},{"$f":"IF(SUM(V94:AA94)=2,IF(N94=2,IF(N94=2,IF(U94-'Barèmes & Options'!H$2<-1,0,1)),\"\"),0)","v":0},{"$f":"IF(OR(N94=2,N94=9),SUM(V94:AA94)-AB94,SUM(V94:AA94))","v":0},{"$f":"IF(OR(V94=1,W94=1,X94=1),TRUE,FALSE)","v":false},{"$f":"IF(OR(Y94=1,Z94=1,AA94=1),TRUE,FALSE)","v":false},{"$f":"IF(N94<>\"\",IF(AND(N94>=1,N94<=8,N94=ABS(N94)),IF(AND(N94<=9,N94>=1),IF(AND(AC94=1,H94<>\"\"),1,IF(AND(AC94=1,H94=\"\"),1.5,IF(AND(AC94=2,H94<>\"\"),2,IF(AND(AC94=2,H94=\"\"),3,0)))),\"\"),\"Err. Profil\"),\"\")","v":""},{"$f":"IF(O94<>\"\",IF(ROUND(M94,0)<=3,1,0),\"\")","v":""},{"$f":"IF(AND(R94<>\"\",Q94<>\"\",P94<>\"\"),IF($C94=\"\",\"SX\",IF($C94=\"F\",VLOOKUP(ROUND($L94,0)/100,Barème500,3),VLOOKUP(ROUND($L94,0)/100,Barème500,2))),\"\")","v":""},{"$f":"IF(OR(K94=\"\",K94=\"\",AH94=\"\",AG94=\"\",AF94=\"\"),\"\",IF(OR(K94<0,K94>2),\"Err ech.\",SUM(K94,AH94,AG94,AF94)))","v":""},null,null,null,null,null,{"$f":"IF(C94<>\"f\",\"m\",\"f\")","v":"m"}]
[null,null,null,null,null,null,null,null,null,null,null,{"$f":"IF(AND(R95<>\"\",Q95<>\"\",P95<>\"\"),(INT(((INT($P95)*60)+(($P95-INT($P95))*100)+(INT($Q95)*60)+(($Q95-INT($Q95))*100)+(INT($R95)*60)+(($R95-INT($R95))*100))/60)+MOD(((INT($P95)*60)+(($P95-INT($P95))*100)+(INT($Q95)*60)+(($Q95-INT($Q95))*100)+(INT($R95)*60)+(($R95-INT($R95))*100)),60)/100)*100,\"\")","v":""},{"$f":"IF(OR(O95=\"\",P95=\"\"),\"\",ABS((INT(P95)*60)+((P95-INT(P95))*100)-((INT(O95)*60)+((O95-INT(O95))*100))))","v":""},{"$f":"IF(AND(E95=\"\",H95=\"\"),\"\",IF(H95=\"\",E95,H95))","v":""},{"$f":"IF(F95=\"\",\"\",F95/100)","v":""},{"$f":"IF(G95=\"\",\"\",G95/100)","v":""},{"$f":"IF(I95=\"\",\"\",I95/100)","v":""},{"$f":"IF(J95=\"\",\"\",J95/100)","v":""},{"$f":"ROUND((INT(Q95)*60)+((Q95-INT(Q95))*100)-((INT(P95)*60)+((P95-INT(P95))*100)),0)","v":{"$error":"#VALUE!"}},{"$f":"ROUND((INT(R95)*60)+((R95-INT(R95))*100)-((INT(Q95)*60)+((Q95-INT(Q95))*100)),0)","v":{"$error":"#VALUE!"}},{"$f":"ROUND((INT(R95)*60)+((R95-INT(R95))*100)-((INT(P95)*60)+((P95-INT(P95))*100)),0)","v":{"$error":"#VALUE!"}},{"$f":"IF(AND(Q95<>0,P95<>0),IF(OR(N95=1,N95=3,N95=4),IF(OR(S95=0,ABS(S95)<='Barèmes & Options'!H$2),1,0)),\"\")","v":false},{"$f":"IF(AND(Q95<>\"\",P95<>\"\"),IF(OR(N95=5,N95=7),IF(S95>0,1,0)),\"\")","v":""},{"$f":"IF(AND(Q95<>\"\",P95<>\"\"),IF(OR(N95=2,N95=6,N95=8),IF(S95<0,1,0)),\"\")","v":""},{"$f":"IF(AND(Q95<>0,R95<>0),IF(OR(N95=1,N95=5,N95=6),IF(OR(T95=0,ABS(T95)<='Barèmes & Options'!H$2),1,0)),\"\")","v":false},{"$f":"IF(AND(Q95<>\"\",R95<>\"\"),IF(OR(N95=4,N95=8),IF(T95>0,1,0)),\"\")","v":""},{"$f":"IF(AND(Q95<>\"\",R95<>\"\"),IF(OR(N95=2,N95=3,N95=7),IF(T95<0,1,0)),\"\")","v":""},{"$f":"IF(SUM(V95:AA95)=2,IF(N95=2,IF(N95=2,IF(U95-'Barèmes & Options'!H$2<-1,0,1)),\"\"),0)","v":0},{"$f":"IF(OR(N95=2,N95=9),SUM(V95:AA95)-AB95,SUM(V95:AA95))","v":0},{"$f":"IF(OR(V95=1,W95=1,X95=1),TRUE,FALSE)","v":false},{"$f":"IF(OR(Y95=1,Z95=1,AA95=1),TRUE,FALSE)","v":false},{"$f":"IF(N95<>\"\",IF(AND(N95>=1,N95<=8,N95=ABS(N95)),IF(AND(N95<=9,N95>=1),IF(AND(AC95=1,H95<>\"\"),1,IF(AND(AC95=1,H95=\"\"),1.5,IF(AND(AC95=2,H95<>\"\"),2,IF(AND(AC95=2,H95=\"\"),3,0)))),\"\"),\"Err. Profil\"),\"\")","v":""},{"$f":"IF(O95<>\"\",IF(ROUND(M95,0)<=3,1,0),\"\")","v":""},{"$f":"IF(AND(R95<>\"\",Q95<>\"\",P95<>\"\"),IF($C95=\"\",\"SX\",IF($C95=\"F\",VLOOKUP(ROUND($L95,0)/100,Barème500,3),VLOOKUP(ROUND($L95,0)/100,Barème500,2))),\"\")","v":""},{"$f":"IF(OR(K95=\"\",K95=\"\",AH95=\"\",AG95=\"\",AF95=\"\"),\"\",IF(OR(K95<0,K95>2),\"Err ech.\",SUM(K95,AH95,AG95,AF95)))","v":""},null,null,null,null,null,{"$f":"IF(C95<>\"f\",\"m\",\"f\")","v":"m"}]
[null,null,null,null,null,null,null,null,null,null,null,{"$f":"IF(AND(R96<>\"\",Q96<>\"\",P96<>\"\"),(INT(((INT($P96)*60)+(($P96-INT($P96))*100)+(INT($Q96)*60)+(($Q96-INT($Q96))*100)+(INT($R96)*60)+(($R96-INT($R96))*100))/60)+MOD(((INT($P96)*60)+(($P96-INT($P96))*100)+(INT($Q96)*60)+(($Q96-INT($Q96))*100)+(INT($R96)*60)+(($R96-INT($R96))*100)),60)/100)*100,\"\")","v":""},{"$f":"IF(OR(O96=\"\",P96=\"\"),\"\",ABS((INT(P96)*60)+((P96-INT(P96))*100)-((INT(O96)*60)+((O96-INT(O96))*100))))","v":""},{"$f":"IF(AND(E96=\"\",H96=\"\"),\"\",IF(H96=\"\",E96,H96))","v":""},{"$f":"IF(F96=\"\",\"\",F96/100)","v":""},{"$f":"IF(G96=\"\",\"\",G96/100)","v":""},{"$f":"IF(I96=\"\",\"\",I96/100)","v":""},{"$f":"IF(J96=\"\",\"\",J96/100)","v":""},{"$f":"ROUND((INT(Q96)*60)+((Q96-INT(Q96))*100)-((INT(P96)*60)+((P96-INT(P96))*100)),0)","v":{"$error":"#VALUE!"}},{"$f":"ROUND((INT(R96)*60)+((R96-INT(R96))*100)-((INT(Q96)*60)+((Q96-INT(Q96))*100)),0)","v":{"$error":"#VALUE!"}},{"$f":"ROUND((INT(R96)*60)+((R96-INT(R96))*100)-((INT(P96)*60)+((P96-INT(P96))*100)),0)","v":{"$error":"#VALUE!"}},{"$f":"IF(AND(Q96<>0,P96<>0),IF(OR(N96=1,N96=3,N96=4),IF(OR(S96=0,ABS(S96)<='Barèmes & Options'!H$2),1,0)),\"\")","v":false},{"$f":"IF(AND(Q96<>\"\",P96<>\"\"),IF(OR(N96=5,N96=7),IF(S96>0,1,0)),\"\")","v":""},{"$f":"IF(AND(Q96<>\"\",P96<>\"\"),IF(OR(N96=2,N96=6,N96=8),IF(S96<0,1,0)),\"\")","v":""},{"$f":"IF(AND(Q96<>0,R96<>0),IF(OR(N96=1,N96=5,N96=6),IF(OR(T96=0,ABS(T96)<='Barèmes & Options'!H$2),1,0)),\"\")","v":false},{"$f":"IF(AND(Q96<>\"\",R96<>\"\"),IF(OR(N96=4,N96=8),IF(T96>0,1,0)),\"\")","v":""},{"$f":"IF(AND(Q96<>\"\",R96<>\"\"),IF(OR(N96=2,N96=3,N96=7),IF(T96<0,1,0)),\"\")","v":""},{"$f":"IF(SUM(V96:AA96)=2,IF(N96=2,IF(N96=2,IF(U96-'Barèmes & Options'!H$2<-1,0,1)),\"\"),0)","v":0},{"$f":"IF(OR(N96=2,N96=9),SUM(V96:AA96)-AB96,SUM(V96:AA96))","v":0},{"$f":"IF(OR(V96=1,W96=1,X96=1),TRUE,FALSE)","v":false},{"$f":"IF(OR(Y96=1,Z96=1,AA96=1),TRUE,FALSE)","v":false},{"$f":"IF(N96<>\"\",IF(AND(N96>=1,N96<=8,N96=ABS(N96)),IF(AND(N96<=9,N96>=1),IF(AND(AC96=1,H96<>\"\"),1,IF(AND(AC96=1,H96=\"\"),1.5,IF(AND(AC96=2,H96<>\"\"),2,IF(AND(AC96=2,H96=\"\"),3,0)))),\"\"),\"Err. Profil\"),\"\")","v":""},{"$f":"IF(O96<>\"\",IF(ROUND(M96,0)<=3,1,0),\"\")","v":""},{"$f":"IF(AND(R96<>\"\",Q96<>\"\",P96<>\"\"),IF($C96=\"\",\"SX\",IF($C96=\"F\",VLOOKUP(ROUND($L96,0)/100,Barème500,3),VLOOKUP(ROUND($L96,0)/100,Barème500,2))),\"\")","v":""},{"$f":"IF(OR(K96=\"\",K96=\"\",AH96=\"\",AG96=\"\",AF96=\"\"),\"\",IF(OR(K96<0,K96>2),\"Err ech.\",SUM(K96,AH96,AG96,AF96)))","v":""},null,null,null,null,null,{"$f":"IF(C96<>\"f\",\"m\",\"f\")","v":"m"}]
[null,null,null,null,null,null,null,null,null,null,null,{"$f":"IF(AND(R97<>\"\",Q97<>\"\",P97<>\"\"),(INT(((INT($P97)*60)+(($P97-INT($P97))*100)+(INT($Q97)*60)+(($Q97-INT($Q97))*100)+(INT($R97)*60)+(($R97-INT($R97))*100))/60)+MOD(((INT($P97)*60)+(($P97-INT($P97))*100)+(INT($Q97)*60)+(($Q97-INT($Q97))*100)+(INT($R97)*60)+(($R97-INT($R97))*100)),60)/100)*100,\"\")","v":""},{"$f":"IF(OR(O97=\"\",P97=\"\"),\"\",ABS((INT(P97)*60)+((P97-INT(P97))*100)-((INT(O97)*60)+((O97-INT(O97))*100))))","v":""},{"$f":"IF(AND(E97=\"\",H97=\"\"),\"\",IF(H97=\"\",E97,H97))","v":""},{"$f":"IF(F97=\"\",\"\",F97/100)","v":""},{"$f":"IF(G97=\"\",\"\",G97/100)","v":""},{"$f":"IF(I97=\"\",\"\",I97/100)","v":""},{"$f":"IF(J97=\"\",\"\",J97/100)","v":""},{"$f":"ROUND((INT(Q97)*60)+((Q97-INT(Q97))*100)-((INT(P97)*60)+((P97-INT(P97))*100)),0)","v":{"$error":"#VALUE!"}},{"$f":"ROUND((INT(R97)*60)+((R97-INT(R97))*100)-((INT(Q97)*60)+((Q97-INT(Q97))*100)),0)","v":{"$error":"#VALUE!"}},{"$f":"ROUND((INT(R97)*60)+((R97-INT(R97))*100)-((INT(P97)*60)+((P97-INT(P97))*100)),0)","v":{"$error":"#VALUE!"}},{"$f":"IF(AND(Q97<>0,P97<>0),IF(OR(N97=1,N97=3,N97=4),IF(OR(S97=0,ABS(S97)<='Barèmes & Options'!H$2),1,0)),\"\")","v":false},{"$f":"IF(AND(Q97<>\"\",P97<>\"\"),IF(OR(N97=5,N97=7),IF(S97>0,1,0)),\"\")","v":""},{"$f":"IF(AND(Q97<>\"\",P97<>\"\"),IF(OR(N97=2,N97=6,N97=8),IF(S97<0,1,0)),\"\")","v":""},{"$f":"IF(AND(Q97<>0,R97<>0),IF(OR(N97=1,N97=5,N97=6),IF(OR(T97=0,ABS(T97)<='Barèmes & Options'!H$2),1,0)),\"\")","v":false},{"$f":"IF(AND(Q97<>\"\",R97<>\"\"),IF(OR(N97=4,N97=8),IF(T97>0,1,0)),\"\")","v":""},{"$f":"IF(AND(Q97<>\"\",R97<>\"\"),IF(OR(N97=2,N97=3,N97=7),IF(T97<0,1,0)),\"\")","v":""},{"$f":"IF(SUM(V97:AA97)=2,IF(N97=2,IF(N97=2,IF(U97-'Barèmes & Options'!H$2<-1,0,1)),\"\"),0)","v":0},{"$f":"IF(OR(N97=2,N97=9),SUM(V97:AA97)-AB97,SUM(V97:AA97))","v":0},{"$f":"IF(OR(V97=1,W97=1,X97=1),TRUE,FALSE)","v":false},{"$f":"IF(OR(Y97=1,Z97=1,AA97=1),TRUE,FALSE)","v":false},{"$f":"IF(N97<>\"\",IF(AND(N97>=1,N97<=8,N97=ABS(N97)),IF(AND(N97<=9,N97>=1),IF(AND(AC97=1,H97<>\"\"),1,IF(AND(AC97=1,H97=\"\"),1.5,IF(AND(AC97=2,H97<>\"\"),2,IF(AND(AC97=2,H97=\"\"),3,0)))),\"\"),\"Err. Profil\"),\"\")","v":""},{"$f":"IF(O97<>\"\",IF(ROUND(M97,0)<=3,1,0),\"\")","v":""},{"$f":"IF(AND(R97<>\"\",Q97<>\"\",P97<>\"\"),IF($C97=\"\",\"SX\",IF($C97=\"F\",VLOOKUP(ROUND($L97,0)/100,Barème500,3),VLOOKUP(ROUND($L97,0)/100,Barème500,2))),\"\")","v":""},{"$f":"IF(OR(K97=\"\",K97=\"\",AH97=\"\",AG97=\"\",AF97=\"\"),\"\",IF(OR(K97<0,K97>2),\"Err ech.\",SUM(K97,AH97,AG97,AF97)))","v":""},null,null,null,null,null,{"$f":"IF(C97<>\"f\",\"m\",\"f\")","v":"m"}]
[null,null,null,null,null,null,null,null,null,null,null,{"$f":"IF(AND(R98<>\"\",Q98<>\"\",P98<>\"\"),(INT(((INT($P98)*60)+(($P98-INT($P98))*100)+(INT($Q98)*60)+(($Q98-INT($Q98))*100)+(INT($R98)*60)+(($R98-INT($R98))*100))/60)+MOD(((INT($P98)*60)+(($P98-INT($P98))*100)+(INT($Q98)*60)+(($Q98-INT($Q98))*100)+(INT($R98)*60)+(($R98-INT($R98))*100)),60)/100)*100,\"\")","v":""},{"$f":"IF(OR(O98=\"\",P98=\"\"),\"\",ABS((INT(P98)*60)+((P98-INT(P98))*100)-((INT(O98)*60)+((O98-INT(O98))*100))))","v":""},{"$f":"IF(AND(E98=\"\",H98=\"\"),\"\",IF(H98=\"\",E98,H98))","v":""},{"$f":"IF(F98=\"\",\"\",F98/100)","v":""},{"$f":"IF(G98=\"\",\"\",G98/100)","v":""},{"$f":"IF(I98=\"\",\"\",I98/100)","v":""},{"$f":"IF(J98=\"\",\"\",J98/100)","v":""},{"$f":"ROUND((INT(Q98)*60)+((Q98-INT(Q98))*100)-((INT(P98)*60)+((P98-INT(P98))*100)),0)","v":{"$error":"#VALUE!"}},{"$f":"ROUND((INT(R98)*60)+((R98-INT(R98))*100)-((INT(Q98)*60)+((Q98-INT(Q98))*100)),0)","v":{"$error":"#VALUE!"}},{"$f":"ROUND((INT(R98)*60)+((R98-INT(R98))*100)-((INT(P98)*60)+((P98-INT(P98))*100)),0)","v":{"$error":"#VALUE!"}},{"$f":"IF(AND(Q98<>0,P98<>0),IF(OR(N98=1,N98=3,N98=4),IF(OR(S98=0,ABS(S98)<='Barèmes & Options'!H$2),1,0)),\"\")","v":false},{"$f":"IF(AND(Q98<>\"\",P98<>\"\"),IF(OR(N98=5,N98=7),IF(S98>0,1,0)),\"\")","v":""},{"$f":"IF(AND(Q98<>\"\",P98<>\"\"),IF(OR(N98=2,N98=6,N98=8),IF(S98<0,1,0)),\"\")","v":""},{"$f":"IF(AND(Q98<>0,R98<>0),IF(OR(N98=1,N98=5,N98=6),IF(OR(T98=0,ABS(T98)<='Barèmes & Options'!H$2),1,0)),\"\")","v":false},{"$f":"IF(AND(Q98<>\"\",R98<>\"\"),IF(OR(N98=4,N98=8),IF(T98>0,1,0)),\"\")","v":""},{"$f":"IF(AND(Q98<>\"\",R98<>\"\"),IF(OR(N98=2,N98=3,N98=7),IF(T98<0,1,0)),\"\")","v":""},{"$f":"IF(SUM(V98:AA98)=2,IF(N98=2,IF(N98=2,IF(U98-'Barèmes & Options'!H$2<-1,0,1)),\"\"),0)","v":0},{"$f":"IF(OR(N98=2,N98=9),SUM(V98:AA98)-AB98,SUM(V98:AA98))","v":0},{"$f":"IF(OR(V98=1,W98=1,X98=1),TRUE,FALSE)","v":false},{"$f":"IF(OR(Y98=1,Z98=1,AA98=1),TRUE,FALSE)","v":false},{"$f":"IF(N98<>\"\",IF(AND(N98>=1,N98<=8,N98=ABS(N98)),IF(AND(N98<=9,N98>=1),IF(AND(AC98=1,H98<>\"\"),1,IF(AND(AC98=1,H98=\"\"),1.5,IF(AND(AC98=2,H98<>\"\"),2,IF(AND(AC98=2,H98=\"\"),3,0)))),\"\"),\"Err. Profil\"),\"\")","v":""},{"$f":"IF(O98<>\"\",IF(ROUND(M98,0)<=3,1,0),\"\")","v":""},{"$f":"IF(AND(R98<>\"\",Q98<>\"\",P98<>\"\"),IF($C98=\"\",\"SX\",IF($C98=\"F\",VLOOKUP(ROUND($L98,0)/100,Barème500,3),VLOOKUP(ROUND($L98,0)/100,Barème500,2))),\"\")","v":""},{"$f":"IF(OR(K98=\"\",K98=\"\",AH98=\"\",AG98=\"\",AF98=\"\"),\"\",IF(OR(K98<0,K98>2),\"Err ech.\",SUM(K98,AH98,AG98,AF98)))","v":""},null,null,null,null,null,{"$f":"IF(C98<>\"f\",\"m\",\"f\")","v":"m"}]
[null,null,null,null,null,null,null,null,null,null,null,{"$f":"IF(AND(R99<>\"\",Q99<>\"\",P99<>\"\"),(INT(((INT($P99)*60)+(($P99-INT($P99))*100)+(INT($Q99)*60)+(($Q99-INT($Q99))*100)+(INT($R99)*60)+(($R99-INT($R99))*100))/60)+MOD(((INT($P99)*60)+(($P99-INT($P99))*100)+(INT($Q99)*60)+(($Q99-INT($Q99))*100)+(INT($R99)*60)+(($R99-INT($R99))*100)),60)/100)*100,\"\")","v":""},{"$f":"IF(OR(O99=\"\",P99=\"\"),\"\",ABS((INT(P99)*60)+((P99-INT(P99))*100)-((INT(O99)*60)+((O99-INT(O99))*100))))","v":""},{"$f":"IF(AND(E99=\"\",H99=\"\"),\"\",IF(H99=\"\",E99,H99))","v":""},{"$f":"IF(F99=\"\",\"\",F99/100)","v":""},{"$f":"IF(G99=\"\",\"\",G99/100)","v":""},{"$f":"IF(I99=\"\",\"\",I99/100)","v":""},{"$f":"IF(J99=\"\",\"\",J99/100)","v":""},{"$f":"ROUND((INT(Q99)*60)+((Q99-INT(Q99))*100)-((INT(P99)*60)+((P99-INT(P99))*100)),0)","v":{"$error":"#VALUE!"}},{"$f":"ROUND((INT(R99)*60)+((R99-INT(R99))*100)-((INT(Q99)*60)+((Q99-INT(Q99))*100)),0)","v":{"$error":"#VALUE!"}},{"$f":"ROUND((INT(R99)*60)+((R99-INT(R99))*100)-((INT(P99)*60)+((P99-INT(P99))*100)),0)","v":{"$error":"#VALUE!"}},{"$f":"IF(AND(Q99<>0,P99<>0),IF(OR(N99=1,N99=3,N99=4),IF(OR(S99=0,ABS(S99)<='Barèmes & Options'!H$2),1,0)),\"\")","v":false},{"$f":"IF(AND(Q99<>\"\",P99<>\"\"),IF(OR(N99=5,N99=7),IF(S99>0,1,0)),\"\")","v":""},{"$f":"IF(AND(Q99<>\"\",P99<>\"\"),IF(OR(N99=2,N99=6,N99=8),IF(S99<0,1,0)),\"\")","v":""},{"$f":"IF(AND(Q99<>0,R99<>0),IF(OR(N99=1,N99=5,N99=6),IF(OR(T99=0,ABS(T99)<='Barèmes & Options'!H$2),1,0)),\"\")","v":false},{"$f":"IF(AND(Q99<>\"\",R99<>\"\"),IF(OR(N99=4,N99=8),IF(T99>0,1,0)),\"\")","v":""},{"$f":"IF(AND(Q99<>\"\",R99<>\"\"),IF(OR(N99=2,N99=3,N99=7),IF(T99<0,1,0)),\"\")","v":""},{"$f":"IF(SUM(V99:AA99)=2,IF(N99=2,IF(N99=2,IF(U99-'Barèmes & Options'!H$2<-1,0,1)),\"\"),0)","v":0},{"$f":"IF(OR(N99=2,N99=9),SUM(V99:AA99)-AB99,SUM(V99:AA99))","v":0},{"$f":"IF(OR(V99=1,W99=1,X99=1),TRUE,FALSE)","v":false},{"$f":"IF(OR(Y99=1,Z99=1,AA99=1),TRUE,FALSE)","v":false},{"$f":"IF(N99<>\"\",IF(AND(N99>=1,N99<=8,N99=ABS(N99)),IF(AND(N99<=9,N99>=1),IF(AND(AC99=1,H99<>\"\"),1,IF(AND(AC99=1,H99=\"\"),1.5,IF(AND(AC99=2,H99<>\"\"),2,IF(AND(AC99=2,H99=\"\"),3,0)))),\"\"),\"Err. Profil\"),\"\")","v":""},{"$f":"IF(O99<>\"\",IF(ROUND(M99,0)<=3,1,0),\"\")","v":""},{"$f":"IF(AND(R99<>\"\",Q99<>\"\",P99<>\"\"),IF($C99=\"\",\"SX\",IF($C99=\"F\",VLOOKUP(ROUND($L99,0)/100,Barème500,3),VLOOKUP(ROUND($L99,0)/100,Barème500,2))),\"\")","v":""},{"$f":"IF(OR(K99=\"\",K99=\"\",AH99=\"\",AG99=\"\",AF99=\"\"),\"\",IF(OR(K99<0,K99>2),\"Err ech.\",SUM(K99,AH99,AG99,AF99)))","v":""},null,null,null,null,null,{"$f":"IF(C99<>\"f\",\"m\",\"f\")","v":"m"}]
[null,null,null,null,null,null,null,null,null,null,null,{"$f":"IF(AND(R100<>\"\",Q100<>\"\",P100<>\"\"),(INT(((INT($P100)*60)+(($P100-INT($P100))*100)+(INT($Q100)*60)+(($Q100-INT($Q100))*100)+(INT($R100)*60)+(($R100-INT($R100))*100))/60)+MOD(((INT($P100)*60)+(($P100-INT($P100))*100)+(INT($Q100)*60)+(($Q100-INT($Q100))*100)+(INT($R100)*60)+(($R100-INT($R100))*100)),60)/100)*100,\"\")","v":""},{"$f":"IF(OR(O100=\"\",P100=\"\"),\"\",ABS((INT(P100)*60)+((P100-INT(P100))*100)-((INT(O100)*60)+((O100-INT(O100))*100))))","v":""},{"$f":"IF(AND(E100=\"\",H100=\"\"),\"\",IF(H100=\"\",E100,H100))","v":""},{"$f":"IF(F100=\"\",\"\",F100/100)","v":""},{"$f":"IF(G100=\"\",\"\",G100/100)","v":""},{"$f":"IF(I100=\"\",\"\",I100/100)","v":""},{"$f":"IF(J100=\"\",\"\",J100/100)","v":""},{"$f":"ROUND((INT(Q100)*60)+((Q100-INT(Q100))*100)-((INT(P100)*60)+((P100-INT(P100))*100)),0)","v":{"$error":"#VALUE!"}},{"$f":"ROUND((INT(R100)*60)+((R100-INT(R100))*100)-((INT(Q100)*60)+((Q100-INT(Q100))*100)),0)","v":{"$error":"#VALUE!"}},{"$f":"ROUND((INT(R100)*60)+((R100-INT(R100))*100)-((INT(P100)*60)+((P100-INT(P100))*100)),0)","v":{"$error":"#VALUE!"}},{"$f":"IF(AND(Q100<>0,P100<>0),IF(OR(N100=1,N100=3,N100=4),IF(OR(S100=0,ABS(S100)<='Barèmes & Options'!H$2),1,0)),\"\")","v":false},{"$f":"IF(AND(Q100<>\"\",P100<>\"\"),IF(OR(N100=5,N100=7),IF(S100>0,1,0)),\"\")","v":""},{"$f":"IF(AND(Q100<>\"\",P100<>\"\"),IF(OR(N100=2,N100=6,N100=8),IF(S100<0,1,0)),\"\")","v":""},{"$f":"IF(AND(Q100<>0,R100<>0),IF(OR(N100=1,N100=5,N100=6),IF(OR(T100=0,ABS(T100)<='Barèmes & Options'!H$2),1,0)),\"\")","v":false},{"$f":"IF(AND(Q100<>\"\",R100<>\"\"),IF(OR(N100=4,N100=8),IF(T100>0,1,0)),\"\")","v":""},{"$f":"IF(AND(Q100<>\"\",R100<>\"\"),IF(OR(N100=2,N100=3,N100=7),IF(T100<0,1,0)),\"\")","v":""},{"$f":"IF(SUM(V100:AA100)=2,IF(N100=2,IF(N100=2,IF(U100-'Barèmes & Options'!H$2<-1,0,1)),\"\"),0)","v":0},{"$f":"IF(OR(N100=2,N100=9),SUM(V100:AA100)-AB100,SUM(V100:AA100))","v":0},{"$f":"IF(OR(V100=1,W100=1,X100=1),TRUE,FALSE)","v":false},{"$f":"IF(OR(Y100=1,Z100=1,AA100=1),TRUE,FALSE)","v":false},{"$f":"IF(N100<>\"\",IF(AND(N100>=1,N100<=8,N100=ABS(N100)),IF(AND(N100<=9,N100>=1),IF(AND(AC100=1,H100<>\"\"),1,IF(AND(AC100=1,H100=\"\"),1.5,IF(AND(AC100=2,H100<>\"\"),2,IF(AND(AC100=2,H100=\"\"),3,0)))),\"\"),\"Err. Profil\"),\"\")","v":""},{"$f":"IF(O100<>\"\",IF(ROUND(M100,0)<=3,1,0),\"\")","v":""},{"$f":"IF(AND(R100<>\"\",Q100<>\"\",P100<>\"\"),IF($C100=\"\",\"SX\",IF($C100=\"F\",VLOOKUP(ROUND($L100,0)/100,Barème500,3),VLOOKUP(ROUND($L100,0)/100,Barème500,2))),\"\")","v":""},{"$f":"IF(OR(K100=\"\",K100=\"\",AH100=\"\",AG100=\"\",AF100=\"\"),\"\",IF(OR(K100<0,K100>2),\"Err ech.\",SUM(K100,AH100,AG100,AF100)))","v":""},null,null,null,null,null,{"$f":"IF(C100<>\"f\",\"m\",\"f\")","v":"m"}]
[null,null,null,null,null,null,null,null,null,null,null,{"$f":"IF(AND(R101<>\"\",Q101<>\"\",P101<>\"\"),(INT(((INT($P101)*60)+(($P101-INT($P101))*100)+(INT($Q101)*60)+(($Q101-INT($Q101))*100)+(INT($R101)*60)+(($R101-INT($R101))*100))/60)+MOD(((INT($P101)*60)+(($P101-INT($P101))*100)+(INT($Q101)*60)+(($Q101-INT($Q101))*100)+(INT($R101)*60)+(($R101-INT($R101))*100)),60)/100)*100,\"\")","v":""},{"$f":"IF(OR(O101=\"\",P101=\"\"),\"\",ABS((INT(P101)*60)+((P101-INT(P101))*100)-((INT(O101)*60)+((O101-INT(O101))*100))))","v":""},{"$f":"IF(AND(E101=\"\",H101=\"\"),\"\",IF(H101=\"\",E101,H101))","v":""},{"$f":"IF(F101=\"\",\"\",F101/100)","v":""},{"$f":"IF(G101=\"\",\"\",G101/100)","v":""},{"$f":"IF(I101=\"\",\"\",I101/100)","v":""},{"$f":"IF(J101=\"\",\"\",J101/100)","v":""},{"$f":"ROUND((INT(Q101)*60)+((Q101-INT(Q101))*100)-((INT(P101)*60)+((P101-INT(P101))*100)),0)","v":{"$error":"#VALUE!"}},{"$f":"ROUND((INT(R101)*60)+((R101-INT(R101))*100)-((INT(Q101)*60)+((Q101-INT(Q101))*100)),0)","v":{"$error":"#VALUE!"}},{"$f":"ROUND((INT(R101)*60)+((R101-INT(R101))*100)-((INT(P101)*60)+((P101-INT(P101))*100)),0)","v":{"$error":"#VALUE!"}},{"$f":"IF(AND(Q101<>0,P101<>0),IF(OR(N101=1,N101=3,N101=4),IF(OR(S101=0,ABS(S101)<='Barèmes & Options'!H$2),1,0)),\"\")","v":false},{"$f":"IF(AND(Q101<>\"\",P101<>\"\"),IF(OR(N101=5,N101=7),IF(S101>0,1,0)),\"\")","v":""},{"$f":"IF(AND(Q101<>\"\",P101<>\"\"),IF(OR(N101=2,N101=6,N101=8),IF(S101<0,1,0)),\"\")","v":""},{"$f":"IF(AND(Q101<>0,R101<>0),IF(OR(N101=1,N101=5,N101=6),IF(OR(T101=0,ABS(T101)<='Barèmes & Options'!H$2),1,0)),\"\")","v":false},{"$f":"IF(AND(Q101<>\"\",R101<>\"\"),IF(OR(N101=4,N101=8),IF(T101>0,1,0)),\"\")","v":""},{"$f":"IF(AND(Q101<>\"\",R101<>\"\"),IF(OR(N101=2,N101=3,N101=7),IF(T101<0,1,0)),\"\")","v":""},{"$f":"IF(SUM(V101:AA101)=2,IF(N101=2,IF(N101=2,IF(U101-'Barèmes & Options'!H$2<-1,0,1)),\"\"),0)","v":0},{"$f":"IF(OR(N101=2,N101=9),SUM(V101:AA101)-AB101,SUM(V101:AA101))","v":0},{"$f":"IF(OR(V101=1,W101=1,X101=1),TRUE,FALSE)","v":false},{"$f":"IF(OR(Y101=1,Z101=1,AA101=1),TRUE,FALSE)","v":false},{"$f":"IF(N101<>\"\",IF(AND(N101>=1,N101<=8,N101=ABS(N101)),IF(AND(N101<=9,N101>=1),IF(AND(AC101=1,H101<>\"\"),1,IF(AND(AC101=1,H101=\"\"),1.5,IF(AND(AC101=2,H101<>\"\"),2,IF(AND(AC101=2,H101=\"\"),3,0)))),\"\"),\"Err. Profil\"),\"\")","v":""},{"$f":"IF(O101<>\"\",IF(ROUND(M101,0)<=3,1,0),\"\")","v":""},{"$f":"IF(AND(R101<>\"\",Q101<>\"\",P101<>\"\"),IF($C101=\"\",\"SX\",IF($C101=\"F\",VLOOKUP(ROUND($L101,0)/100,Barème500,3),VLOOKUP(ROUND($L101,0)/100,Barème500,2))),\"\")","v":""},{"$f":"IF(OR(K101=\"\",K101=\"\",AH101=\"\",AG101=\"\",AF101=\"\"),\"\",IF(OR(K101<0,K101>2),\"Err ech.\",SUM(K101,AH101,AG101,AF101)))","v":""},null,null,null,null,null,{"$f":"IF(C101<>\"f\",\"m\",\"f\")","v":"m"}]

{"sheet":"Barèmes & Options","index":2,"n_rows":218,"n_cols":8,"rows_kept":218,"cut":false,"hidden":false,"merged":[[0,0,0,2]]}
["Barème 1500"]
["temps","G","F",null,null,null,"Tolérance En sec. :",3]
[3,14,14]
[4.0999999999999996,14,14]
[4.1100000000000003,13.9,14]
[4.12,13.8,14]
[4.13,13.6,14]
[4.1399999999999997,13.5,14]
[4.1500000000000004,13.3,14]
[4.16,13.1,14]
[4.17,12.9,14]
[4.18,12.7,14]
[4.1900000000000004,12.6,14]
[4.2,12.5,14]
[4.21,12.4,14]
[4.22,12.2,14]
[4.2300000000000004,12.1,14]
[4.24,11.9,14]
[4.25,11.8,14]
[4.26,11.7,14]
[4.2699999999999996,11.5,14]
[4.28,11.3,14]
[4.29,11.2,14]
[4.3,11.1,14]
[4.3099999999999996,10.9,14]
[4.32,10.8,14]
[4.33,10.6,14]
[4.34,10.5,14]
[4.3499999999999996,10.4,14]
[4.3600000000000003,10.3,14]
[4.37,10.199999999999999,14]
[4.38,10.1,14]
[4.3899999999999997,10,14]
[4.4000000000000004,9.8000000000000007,14]
[4.41,9.6999999999999993,14]
[4.42,9.6,14]
[4.43,9.5,14]
[4.45,9.4,14]
[4.46,9.3000000000000007,14]
[4.47,9.1999999999999993,14]
[4.4800000000000004,9.1,14]
[4.49,9,14]
[4.5,8.9,14]
[4.51,8.8000000000000007,14]
[4.5199999999999996,8.6999999999999993,14]
[4.53,8.6,14]
[4.55,8.5,14]
[4.5599999999999996,8.4,14]
[4.57,8.3000000000000007,14]
[4.58,8.1999999999999993,14]
[4.59,8.1,14]
[5,8,14]
[5.0199999999999996,7.9,14]
[5.04,7.8,14]
[5.05,7.7,14]
[5.0599999999999996,7.6,14]
[5.07,7.5,14]
[5.08,7.4,14]
[5.0999999999999996,7.3,14]
[5.1100000000000003,7.2,14]
[5.13,7.1,14]
[5.14,7,14]
[5.15,6.9,14]
[5.16,6.8,14]
[5.17,6.7,14]
[5.18,6.6,14]
[5.2,6.5,14]
[5.22,6.4,14]
[5.24,6.3,14]
[5.26,6.2,14]
[5.28,6.1,14]
[5.3,6,14]
[5.31,5.9,13.9]
[5.32,5.9,13.8]
[5.33,5.8,13.7]
[5.34,5.8,13.5]
[5.35,5.7,13.3]
[5.36,5.7,13.2]
[5.37,5.6,13.1]
[5.38,5.6,13]
[5.39,5.5,12.9]
[5.4,5.5,12.8]
[5.41,5.4,12.6]
[5.42,5.4,12.5]
[5.43,5.4,12.4]
[5.44,5.3,12.3]
[5.45,5.3,12.2]
[5.46,5.3,12]
[5.47,5.2,11.9]
[5.48,5.2,11.8]
[5.49,5.0999999999999996,11.7]
[5.5,5.0999999999999996,11.6]
[5.51,5,11.5]
[5.52,5,11.4]
[5.53,4.9000000000000004,11.3]
[5.55,4.8,11.2]
[5.56,4.8,11.1]
[5.57,4.8,11]
[5.58,4.7,10.9]
[5.59,4.7,10.8]
[6,4.7,10.7]
[6.01,4.5999999999999996,10.6]
[6.03,4.5,10.5]
[6.05,4.4000000000000004,10.4]
[6.07,4.4000000000000004,10.3]
[6.08,4.3,10.3]
[6.09,4.3,10.199999999999999]
[6.1,4.2,10.199999999999999]
[6.11,4.2,10.1]
[6.13,4.0999999999999996,10]
[6.15,4,9.9]
[6.17,3.9,9.8000000000000007]
[6.19,3.9,9.6999999999999993]
[6.2,3.8,9.6999999999999993]
[6.21,3.8,9.6]
[6.23,3.7,9.5]
[6.25,3.6,9.4]
[6.27,3.6,9.3000000000000007]
[6.28,3.5,9.3000000000000007]
[6.29,3.5,9.1999999999999993]
[6.3,3.4,9.1999999999999993]
[6.31,3.4,9.1]
[6.33,3.3,9]
[6.35,3.3,8.9]
[6.36,3.2,8.9]
[6.37,3.2,8.8000000000000007]
[6.39,3.1,8.6999999999999993]
[6.41,3.1,8.6]
[6.43,3,8.6]
[6.44,3,8.5]
[6.46,2.9,8.5]
[6.47,2.9,8.4]
[6.49,2.8,8.3000000000000007]
[6.51,2.7,8.1999999999999993]
[6.53,2.7,8.1]
[6.54,2.6,8.1]
[6.55,2.6,8]
[6.57,2.5,7.9]
[7,2.4,7.8]
[7.03,2.2999999999999998,7.7]
[7.05,2.2999999999999998,7.6]
[7.07,2.2000000000000002,7.5]
[7.1,2.2000000000000002,7.4]
[7.11,2.1,7.4]
[7.13,2.1,7.3]
[7.16,2,7.2]
[7.18,1.9,7.1]
[7.2,1.8,7]
[7.22,1.7,6.9]
[7.24,1.7,6.8]
[7.27,1.6,6.7]
[7.3,1.6,6.6]
[7.33,1.5,6.5]
[7.36,1.5,6.4]
[7.38,1.4,6.3]
[7.4,1.3,6.2]
[7.43,1.2,6.1]
[7.46,1.2,6]
[7.49,1.1000000000000001,5.9]
[7.52,1.1000000000000001,5.8]
[7.54,1,5.7]
[7.56,0.9,5.6]
[7.59,0.8,5.5]
[8.02,0.8,5.4]
[8.0500000000000007,0.7,5.3]
[8.08,0.6,5.2]
[8.11,0.5,5.0999999999999996]
[8.1300000000000008,0.4,5]
[8.15,0.3,4.9000000000000004]
[8.18,0.2,4.8]
[8.2100000000000009,0.1,4.7]
[8.24,0,4.5999999999999996]
[8.27,0,4.5]
[8.3000000000000007,0,4.4000000000000004]
[8.33,0,4.3]
[8.3699999999999992,0,4.2]
[8.4,0,4.0999999999999996]
[8.43,0,4]
[8.4600000000000009,0,3.9]
[8.49,0,3.8]
[8.52,0,3.7]
[8.5500000000000007,0,3.6]
[8.59,0,3.5]
[9.0299999999999994,0,3.4]
[9.06,0,3.3]
[9.09,0,3.2]
[9.1199999999999992,0,3.1]
[9.16,0,3]
[9.1999999999999993,0,2.9]
[9.24,0,2.8]
[9.27,0,2.7]
[9.3000000000000007,0,2.6]
[9.34,0,2.5]
[9.3800000000000008,0,2.4]
[9.42,0,2.2999999999999998]
[9.4600000000000009,0,2.2000000000000002]
[9.5,0,2.1]
[9.5500000000000007,0,2]
[10,0,1.9]
[10.050000000000001,0,1.8]
[10.1,0,1.7]
[10.14,0,1.6]
[10.17,0,1.5]
[10.199999999999999,0,1.4]
[10.25,0,1.3]
[10.3,0,1.2]
[10.35,0,1.1000000000000001]
[10.4,0,1]
[10.43,0,0.9]
[10.47,0,0.8]
[10.5,0,0.7]
[10.55,0,0.6]
[11,0,0.5]
[11.05,0,0.4]
[11.1,0,0.3]
[11.15,0,0.2]
[11.2,0,0.1]
[11.25,0,0]

{"sheet":"Présentation des profils","index":3,"n_rows":0,"n_cols":0,"rows_kept":0,"cut":false,"hidden":false,"merged":[]}