{"text_format":"1","workbook":"xlsx","n_sheets":4,"sheets":["Accueil","Evaluation","Barèmes & Options","Présentation des profils"],"not_rendered":{"charts":0,"images":1,"macros":1,"external_links":0,"defined_names":393,"comments":1,"pivot_tables":0},"unopened":[],"bounds":{"document_bytes":16777216,"sheet_cells":100000,"rows_first":2000,"rows_last":500,"rows_between":2000,"halvings":0,"cell_chars":16384,"cell_head_chars":4096},"cells_cut":0,"cells_raw":0,"read":"whole","date_system":"1900"}

{"sheet":"Accueil","index":0,"n_rows":0,"n_cols":0,"rows_kept":0,"cut":false,"hidden":false,"merged":[]}

{"sheet":"Evaluation","index":1,"n_rows":101,"n_cols":43,"rows_kept":101,"cut":false,"hidden":false,"merged":[[0,0,0,34]]}
["Course de demi-fond Bac GT - N4 - 2018"]
[]
["Nom","Prénom","Sexe F ou M","Classe","Profil","Projet C1","500-1","Profil si régulation","500-2","500-3","Points echauff. / 2","Temps Total","Ecart Projet","profil choisi","Projet C1","500-1","500-2","500-3","c2-c1","c3-c2","c3-c1","respect c1-c2=","respect c1-c2+","respect c1-c2-","respect C2-C3=","respect C2-C3+","respect C2-C3-","Respect Profile 9","points respect","Respect C1","Respect C2","points profil / 3","Point projet C1 / 1","Points perf / 14","Note / 20",null,null,null,null,null,"Sexe"]
[null,null,null,null,null,null,null,null,null,null,null,{"$f":"IF(AND(R4<>\"\",Q4<>\"\",P4<>\"\"),(INT(((INT($P4)*60)+(($P4-INT($P4))*100)+(INT($Q4)*60)+(($Q4-INT($Q4))*100)+(INT($R4)*60)+(($R4-INT($R4))*100))/60)+MOD(((INT($P4)*60)+(($P4-INT($P4))*100)+(INT($Q4)*60)+(($Q4-INT($Q4))*100)+(INT($R4)*60)+(($R4-INT($R4))*100)),60)/100)*100,\"\")","v":""},{"$f":"IF(OR(O4=\"\",P4=\"\"),\"\",ABS((INT(P4)*60)+((P4-INT(P4))*100)-((INT(O4)*60)+((O4-INT(O4))*100))))","v":""},{"$f":"IF(AND(E4=\"\",H4=\"\"),\"\",IF(H4=\"\",E4,H4))","v":""},{"$f":"IF(F4=\"\",\"\",F4/100)","v":""},{"$f":"IF(G4=\"\",\"\",G4/100)","v":""},{"$f":"IF(I4=\"\",\"\",I4/100)","v":""},{"$f":"IF(J4=\"\",\"\",J4/100)","v":""},{"$f":"ROUND((INT(Q4)*60)+((Q4-INT(Q4))*100)-((INT(P4)*60)+((P4-INT(P4))*100)),0)","v":{"$error":"#VALUE!"}},{"$f":"ROUND((INT(R4)*60)+((R4-INT(R4))*100)-((INT(Q4)*60)+((Q4-INT(Q4))*100)),0)","v":{"$error":"#VALUE!"}},{"$f":"ROUND((INT(R4)*60)+((R4-INT(R4))*100)-((INT(P4)*60)+((P4-INT(P4))*100)),0)","v":{"$error":"#VALUE!"}},{"$f":"IF(AND(Q4<>0,P4<>0),IF(OR(N4=1,N4=3,N4=4),IF(OR(S4=0,ABS(S4)<='Barèmes & Options'!H$2),1,0)),\"\")","v":false},{"$f":"IF(AND(Q4<>\"\",P4<>\"\"),IF(OR(N4=5,N4=7),IF(S4>0,1,0)),\"\")","v":""},{"$f":"IF(AND(Q4<>\"\",P4<>\"\"),IF(OR(N4=2,N4=6,N4=8),IF(S4<0,1,0)),\"\")","v":""},{"$f":"IF(AND(Q4<>0,R4<>0),IF(OR(N4=1,N4=5,N4=6),IF(OR(T4=0,ABS(T4)<='Barèmes & Options'!H$2),1,0)),\"\")","v":false},{"$f":"IF(AND(Q4<>\"\",R4<>\"\"),IF(OR(N4=4,N4=8),IF(T4>0,1,0)),\"\")","v":""},{"$f":"IF(AND(Q4<>\"\",R4<>\"\"),IF(OR(N4=2,N4=3,N4=7),IF(T4<0,1,0)),\"\")","v":""},{"$f":"IF(SUM(V4:AA4)=2,IF(N4=2,IF(N4=2,IF(U4-'Barèmes & Options'!H$2<-1,0,1)),\"\"),0)","v":0},{"$f":"IF(OR(N4=2,N4=9),SUM(V4:AA4)-AB4,SUM(V4:AA4))","v":0},{"$f":"IF(OR(V4=1,W4=1,X4=1),TRUE,FALSE)","v":false},{"$f":"IF(OR(Y4=1,Z4=1,AA4=1),TRUE,FALSE)","v":false},{"$f":"IF(N4<>\"\",IF(AND(N4>=1,N4<=8,N4=ABS(N4)),IF(AND(N4<=9,N4>=1),IF(AND(AC4=1,H4<>\"\"),1,IF(AND(AC4=1,H4=\"\"),1.5,IF(AND(AC4=2,H4<>\"\"),2,IF(AND(AC4=2,H4=\"\"),3,0)))),\"\"),\"Err. Profil\"),\"\")","v":""},{"$f":"IF(O4<>\"\",IF(ROUND(M4,0)<=3,1,0),\"\")","v":""},{"$f":"IF(AND(R4<>\"\",Q4<>\"\",P4<>\"\"),IF($C4=\"\",\"SX\",IF($C4=\"F\",VLOOKUP(ROUND($L4,0)/100,Barème500,3),VLOOKUP(ROUND($L4,0)/100,Barème500,2))),\"\")","v":""},{"$f":"IF(OR(K4=\"\",K4=\"\",AH4=\"\",AG4=\"\",AF4=\"\"),\"\",IF(OR(K4<0,K4>2),\"Err ech.\",SUM(K4,AH4,AG4,AF4)))","v":""},null,"Moyenne F. :",{"$f":"IF(ISERROR(AP4),\"\",AP4)","v":""},null,null,{"$f":"IF(C4<>\"f\",\"m\",\"f\")","v":"m"},{"$f":"AVERAGEIF(AO4:AO101,\"f\",AI4:AI101)","v":{"$error":"#DIV/0!"}},"filles"]
[null,null,null,null,null,null,null,null,null,null,null,{"$f":"IF(AND(R5<>\"\",Q5<>\"\",P5<>\"\"),(INT(((INT($P5)*60)+(($P5-INT($P5))*100)+(INT($Q5)*60)+(($Q5-INT($Q5))*100)+(INT($R5)*60)+(($R5-INT($R5))*100))/60)+MOD(((INT($P5)*60)+(($P5-INT($P5))*100)+(INT($Q5)*60)+(($Q5-INT($Q5))*100)+(INT($R5)*60)+(($R5-INT($R5))*100)),60)/100)*100,\"\")","v":""},{"$f":"IF(OR(O5=\"\",P5=\"\"),\"\",ABS((INT(P5)*60)+((P5-INT(P5))*100)-((INT(O5)*60)+((O5-INT(O5))*100))))","v":""},{"$f":"IF(AND(E5=\"\",H5=\"\"),\"\",IF(H5=\"\",E5,H5))","v":""},{"$f":"IF(F5=\"\",\"\",F5/100)","v":""},{"$f":"IF(G5=\"\",\"\",G5/100)","v":""},{"$f":"IF(I5=\"\",\"\",I5/100)","v":""},{"$f":"IF(J5=\"\",\"\",J5/100)","v":""},{"$f":"ROUND((INT(Q5)*60)+((Q5-INT(Q5))*100)-((INT(P5)*60)+((P5-INT(P5))*100)),0)","v":{"$error":"#VALUE!"}},{"$f":"ROUND((INT(R5)*60)+((R5-INT(R5))*100)-((INT(Q5)*60)+((Q5-INT(Q5))*100)),0)","v":{"$error":"#VALUE!"}},{"$f":"ROUND((INT(R5)*60)+((R5-INT(R5))*100)-((INT(P5)*60)+((P5-INT(P5))*100)),0)","v":{"$error":"#VALUE!"}},{"$f":"IF(AND(Q5<>0,P5<>0),IF(OR(N5=1,N5=3,N5=4),IF(OR(S5=0,ABS(S5)<='Barèmes & Options'!H$2),1,0)),\"\")","v":false},{"$f":"IF(AND(Q5<>\"\",P5<>\"\"),IF(OR(N5=5,N5=7),IF(S5>0,1,0)),\"\")","v":""},{"$f":"IF(AND(Q5<>\"\",P5<>\"\"),IF(OR(N5=2,N5=6,N5=8),IF(S5<0,1,0)),\"\")","v":""},{"$f":"IF(AND(Q5<>0,R5<>0),IF(OR(N5=1,N5=5,N5=6),IF(OR(T5=0,ABS(T5)<='Barèmes & Options'!H$2),1,0)),\"\")","v":false},{"$f":"IF(AND(Q5<>\"\",R5<>\"\"),IF(OR(N5=4,N5=8),IF(T5>0,1,0)),\"\")","v":""},{"$f":"IF(AND(Q5<>\"\",R5<>\"\"),IF(OR(N5=2,N5=3,N5=7),IF(T5<0,1,0)),\"\")","v":""},{"$f":"IF(SUM(V5:AA5)=2,IF(N5=2,IF(N5=2,IF(U5-'Barèmes & Options'!H$2<-1,0,1)),\"\"),0)","v":0},{"$f":"IF(OR(N5=2,N5=9),SUM(V5:AA5)-AB5,SUM(V5:AA5))","v":0},{"$f":"IF(OR(V5=1,W5=1,X5=1),TRUE,FALSE)","v":false},{"$f":"IF(OR(Y5=1,Z5=1,AA5=1),TRUE,FALSE)","v":false},{"$f":"IF(N5<>\"\",IF(AND(N5>=1,N5<=8,N5=ABS(N5)),IF(AND(N5<=9,N5>=1),IF(AND(AC5=1,H5<>\"\"),1,IF(AND(AC5=1,H5=\"\"),1.5,IF(AND(AC5=2,H5<>\"\"),2,IF(AND(AC5=2,H5=\"\"),3,0)))),\"\"),\"Err. Profil\"),\"\")","v":""},{"$f":"IF(O5<>\"\",IF(ROUND(M5,0)<=3,1,0),\"\")","v":""},{"$f":"IF(AND(R5<>\"\",Q5<>\"\",P5<>\"\"),IF($C5=\"\",\"SX\",IF($C5=\"F\",VLOOKUP(ROUND($L5,0)/100,Barème500,3),VLOOKUP(ROUND($L5,0)/100,Barème500,2))),\"\")","v":""},{"$f":"IF(OR(K5=\"\",K5=\"\",AH5=\"\",AG5=\"\",AF5=\"\"),\"\",IF(OR(K5<0,K5>2),\"Err ech.\",SUM(K5,AH5,AG5,AF5)))","v":""},null,"moyenne G. :",{"$f":"IF(ISERROR(AP5),\"\",AP5)","v":""},null,null,{"$f":"IF(C5<>\"f\",\"m\",\"f\")","v":"m"},{"$f":"AVERAGEIF(AO4:AO101,\"m\",AI4:AI101)","v":{"$error":"#DIV/0!"}},"garçons"]
[null,null,null,null,null,null,null,null,null,null,null,{"$f":"IF(AND(R6<>\"\",Q6<>\"\",P6<>\"\"),(INT(((INT($P6)*60)+(($P6-INT($P6))*100)+(INT($Q6)*60)+(($Q6-INT($Q6))*100)+(INT($R6)*60)+(($R6-INT($R6))*100))/60)+MOD(((INT($P6)*60)+(($P6-INT($P6))*100)+(INT($Q6)*60)+(($Q6-INT($Q6))*100)+(INT($R6)*60)+(($R6-INT($R6))*100)),60)/100)*100,\"\")","v":""},{"$f":"IF(OR(O6=\"\",P6=\"\"),\"\",ABS((INT(P6)*60)+((P6-INT(P6))*100)-((INT(O6)*60)+((O6-INT(O6))*100))))","v":""},{"$f":"IF(AND(E6=\"\",H6=\"\"),\"\",IF(H6=\"\",E6,H6))","v":""},{"$f":"IF(F6=\"\",\"\",F6/100)","v":""},{"$f":"IF(G6=\"\",\"\",G6/100)","v":""},{"$f":"IF(I6=\"\",\"\",I6/100)","v":""},{"$f":"IF(J6=\"\",\"\",J6/100)","v":""},{"$f":"ROUND((INT(Q6)*60)+((Q6-INT(Q6))*100)-((INT(P6)*60)+((P6-INT(P6))*100)),0)","v":{"$error":"#VALUE!"}},{"$f":"ROUND((INT(R6)*60)+((R6-INT(R6))*100)-((INT(Q6)*60)+((Q6-INT(Q6))*100)),0)","v":{"$error":"#VALUE!"}},{"$f":"ROUND((INT(R6)*60)+((R6-INT(R6))*100)-((INT(P6)*60)+((P6-INT(P6))*100)),0)","v":{"$error":"#VALUE!"}},{"$f":"IF(AND(Q6<>0,P6<>0),IF(OR(N6=1,N6=3,N6=4),IF(OR(S6=0,ABS(S6)<='Barèmes & Options'!H$2),1,0)),\"\")","v":false},{"$f":"IF(AND(Q6<>\"\",P6<>\"\"),IF(OR(N6=5,N6=7),IF(S6>0,1,0)),\"\")","v":""},{"$f":"IF(AND(Q6<>\"\",P6<>\"\"),IF(OR(N6=2,N6=6,N6=8),IF(S6<0,1,0)),\"\")","v":""},{"$f":"IF(AND(Q6<>0,R6<>0),IF(OR(N6=1,N6=5,N6=6),IF(OR(T6=0,ABS(T6)<='Barèmes & Options'!H$2),1,0)),\"\")","v":false},{"$f":"IF(AND(Q6<>\"\",R6<>\"\"),IF(OR(N6=4,N6=8),IF(T6>0,1,0)),\"\")","v":""},{"$f":"IF(AND(Q6<>\"\",R6<>\"\"),IF(OR(N6=2,N6=3,N6=7),IF(T6<0,1,0)),\"\")","v":""},{"$f":"IF(SUM(V6:AA6)=2,IF(N6=2,IF(N6=2,IF(U6-'Barèmes & Options'!H$2<-1,0,1)),\"\"),0)","v":0},{"$f":"IF(OR(N6=2,N6=9),SUM(V6:AA6)-AB6,SUM(V6:AA6))","v":0},{"$f":"IF(OR(V6=1,W6=1,X6=1),TRUE,FALSE)","v":false},{"$f":"IF(OR(Y6=1,Z6=1,AA6=1),TRUE,FALSE)","v":false},{"$f":"IF(N6<>\"\",IF(AND(N6>=1,N6<=8,N6=ABS(N6)),IF(AND(N6<=9,N6>=1),IF(AND(AC6=1,H6<>\"\"),1,IF(AND(AC6=1,H6=\"\"),1.5,IF(AND(AC6=2,H6<>\"\"),2,IF(AND(AC6=2,H6=\"\"),3,0)))),\"\"),\"Err. Profil\"),\"\")","v":""},{"$f":"IF(O6<>\"\",IF(ROUND(M6,0)<=3,1,0),\"\")","v":""},{"$f":"IF(AND(R6<>\"\",Q6<>\"\",P6<>\"\"),IF($C6=\"\",\"SX\",IF($C6=\"F\",VLOOKUP(ROUND($L6,0)/100,Barème500,3),VLOOKUP(ROUND($L6,0)/100,Barème500,2))),\"\")","v":""},{"$f":"IF(OR(K6=\"\",K6=\"\",AH6=\"\",AG6=\"\",AF6=\"\"),\"\",IF(OR(K6<0,K6>2),\"Err ech.\",SUM(K6,AH6,AG6,AF6)))","v":""},null,"Moyenne :",{"$f":"IF(ISERROR(AP6),\"\",AP6)","v":""},null,null,{"$f":"IF(C6<>\"f\",\"m\",\"f\")","v":"m"},{"$f":"AVERAGE(AI4:AI101)","v":{"$error":"#DIV/0!"}},"géné"]
[null,null,null,null,null,null,null,null,null,null,null,{"$f":"IF(AND(R7<>\"\",Q7<>\"\",P7<>\"\"),(INT(((INT($P7)*60)+(($P7-INT($P7))*100)+(INT($Q7)*60)+(($Q7-INT($Q7))*100)+(INT($R7)*60)+(($R7-INT($R7))*100))/60)+MOD(((INT($P7)*60)+(($P7-INT($P7))*100)+(INT($Q7)*60)+(($Q7-INT($Q7))*100)+(INT($R7)*60)+(($R7-INT($R7))*100)),60)/100)*100,\"\")","v":""},{"$f":"IF(OR(O7=\"\",P7=\"\"),\"\",ABS((INT(P7)*60)+((P7-INT(P7))*100)-((INT(O7)*60)+((O7-INT(O7))*100))))","v":""},{"$f":"IF(AND(E7=\"\",H7=\"\"),\"\",IF(H7=\"\",E7,H7))","v":""},{"$f":"IF(F7=\"\",\"\",F7/100)","v":""},{"$f":"IF(G7=\"\",\"\",G7/100)","v":""},{"$f":"IF(I7=\"\",\"\",I7/100)","v":""},{"$f":"IF(J7=\"\",\"\",J7/100)","v":""},{"$f":"ROUND((INT(Q7)*60)+((Q7-INT(Q7))*100)-((INT(P7)*60)+((P7-INT(P7))*100)),0)","v":{"$error":"#VALUE!"}},{"$f":"ROUND((INT(R7)*60)+((R7-INT(R7))*100)-((INT(Q7)*60)+((Q7-INT(Q7))*100)),0)","v":{"$error":"#VALUE!"}},{"$f":"ROUND((INT(R7)*60)+((R7-INT(R7))*100)-((INT(P7)*60)+((P7-INT(P7))*100)),0)","v":{"$error":"#VALUE!"}},{"$f":"IF(AND(Q7<>0,P7<>0),IF(OR(N7=1,N7=3,N7=4),IF(OR(S7=0,ABS(S7)<='Barèmes & Options'!H$2),1,0)),\"\")","v":false},{"$f":"IF(AND(Q7<>\"\",P7<>\"\"),IF(OR(N7=5,N7=7),IF(S7>0,1,0)),\"\")","v":""},{"$f":"IF(AND(Q7<>\"\",P7<>\"\"),IF(OR(N7=2,N7=6,N7=8),IF(S7<0,1,0)),\"\")","v":""},{"$f":"IF(AND(Q7<>0,R7<>0),IF(OR(N7=1,N7=5,N7=6),IF(OR(T7=0,ABS(T7)<='Barèmes & Options'!H$2),1,0)),\"\")","v":false},{"$f":"IF(AND(Q7<>\"\",R7<>\"\"),IF(OR(N7=4,N7=8),IF(T7>0,1,0)),\"\")","v":""},{"$f":"IF(AND(Q7<>\"\",R7<>\"\"),IF(OR(N7=2,N7=3,N7=7),IF(T7<0,1,0)),\"\")","v":""},{"$f":"IF(SUM(V7:AA7)=2,IF(N7=2,IF(N7=2,IF(U7-'Barèmes & Options'!H$2<-1,0,1)),\"\"),0)","v":0},{"$f":"IF(OR(N7=2,N7=9),SUM(V7:AA7)-AB7,SUM(V7:AA7))","v":0},{"$f":"IF(OR(V7=1,W7=1,X7=1),TRUE,FALSE)","v":false},{"$f":"IF(OR(Y7=1,Z7=1,AA7=1),TRUE,FALSE)","v":false},{"$f":"IF(N7<>\"\",IF(AND(N7>=1,N7<=8,N7=ABS(N7)),IF(AND(N7<=9,N7>=1),IF(AND(AC7=1,H7<>\"\"),1,IF(AND(AC7=1,H7=\"\"),1.5,IF(AND(AC7=2,H7<>\"\"),2,IF(AND(AC7=2,H7=\"\"),3,0)))),\"\"),\"Err. Profil\"),\"\")","v":""},{"$f":"IF(O7<>\"\",IF(ROUND(M7,0)<=3,1,0),\"\")","v":""},{"$f":"IF(AND(R7<>\"\",Q7<>\"\",P7<>\"\"),IF($C7=\"\",\"SX\",IF($C7=\"F\",VLOOKUP(ROUND($L7,0)/100,Barème500,3),VLOOKUP(ROUND($L7,0)/100,Barème500,2))),\"\")","v":""},{"$f":"IF(OR(K7=\"\",K7=\"\",AH7=\"\",AG7=\"\",AF7=\"\"),\"\",IF(OR(K7<0,K7>2),\"Err ech.\",SUM(K7,AH7,AG7,AF7)))","v":""},null,"Note max :",{"$f":"IF(COUNT(AI4:AI101)>0,MAX(AI4:AI101),\"\")","v":""},null,null,{"$f":"IF(C7<>\"f\",\"m\",\"f\")","v":"m"}]
[null,null,null,null,null,null,null,null,null,null,null,{"$f":"IF(AND(R8<>\"\",Q8<>\"\",P8<>\"\"),(INT(((INT($P8)*60)+(($P8-INT($P8))*100)+(INT($Q8)*60)+(($Q8-INT($Q8))*100)+(INT($R8)*60)+(($R8-INT($R8))*100))/60)+MOD(((INT($P8)*60)+(($P8-INT($P8))*100)+(INT($Q8)*60)+(($Q8-INT($Q8))*100)+(INT($R8)*60)+(($R8-INT($R8))*100)),60)/100)*100,\"\")","v":""},{"$f":"IF(OR(O8=\"\",P8=\"\"),\"\",ABS((INT(P8)*60)+((P8-INT(P8))*100)-((INT(O8)*60)+((O8-INT(O8))*100))))","v":""},{"$f":"IF(AND(E8=\"\",H8=\"\"),\"\",IF(H8=\"\",E8,H8))","v":""},{"$f":"IF(F8=\"\",\"\",F8/100)","v":""},{"$f":"IF(G8=\"\",\"\",G8/100)","v":""},{"$f":"IF(I8=\"\",\"\",I8/100)","v":""},{"$f":"IF(J8=\"\",\"\",J8/100)","v":""},{"$f":"ROUND((INT(Q8)*60)+((Q8-INT(Q8))*100)-((INT(P8)*60)+((P8-INT(P8))*100)),0)","v":{"$error":"#VALUE!"}},{"$f":"ROUND((INT(R8)*60)+((R8-INT(R8))*100)-((INT(Q8)*60)+((Q8-INT(Q8))*100)),0)","v":{"$error":"#VALUE!"}},{"$f":"ROUND((INT(R8)*60)+((R8-INT(R8))*100)-((INT(P8)*60)+((P8-INT(P8))*100)),0)","v":{"$error":"#VALUE!"}},{"$f":"IF(AND(Q8<>0,P8<>0),IF(OR(N8=1,N8=3,N8=4),IF(OR(S8=0,ABS(S8)<='Barèmes & Options'!H$2),1,0)),\"\")","v":false},{"$f":"IF(AND(Q8<>\"\",P8<>\"\"),IF(OR(N8=5,N8=7),IF(S8>0,1,0)),\"\")","v":""},{"$f":"IF(AND(Q8<>\"\",P8<>\"\"),IF(OR(N8=2,N8=6,N8=8),IF(S8<0,1,0)),\"\")","v":""},{"$f":"IF(AND(Q8<>0,R8<>0),IF(OR(N8=1,N8=5,N8=6),IF(OR(T8=0,ABS(T8)<='Barèmes & Options'!H$2),1,0)),\"\")","v":false},{"$f":"IF(AND(Q8<>\"\",R8<>\"\"),IF(OR(N8=4,N8=8),IF(T8>0,1,0)),\"\")","v":""},{"$f":"IF(AND(Q8<>\"\",R8<>\"\"),IF(OR(N8=2,N8=3,N8=7),IF(T8<0,1,0)),\"\")","v":""},{"$f":"IF(SUM(V8:AA8)=2,IF(N8=2,IF(N8=2,IF(U8-'Barèmes & Options'!H$2<-1,0,1)),\"\"),0)","v":0},{"$f":"IF(OR(N8=2,N8=9),SUM(V8:AA8)-AB8,SUM(V8:AA8))","v":0},{"$f":"IF(OR(V8=1,W8=1,X8=1),TRUE,FALSE)","v":false},{"$f":"IF(OR(Y8=1,Z8=1,AA8=1),TRUE,FALSE)","v":false},{"$f":"IF(N8<>\"\",IF(AND(N8>=1,N8<=8,N8=ABS(N8)),IF(AND(N8<=9,N8>=1),IF(AND(AC8=1,H8<>\"\"),1,IF(AND(AC8=1,H8=\"\"),1.5,IF(AND(AC8=2,H8<>\"\"),2,IF(AND(AC8=2,H8=\"\"),3,0)))),\"\"),\"Err. Profil\"),\"\")","v":""},{"$f":"IF(O8<>\"\",IF(ROUND(M8,0)<=3,1,0),\"\")","v":""},{"$f":"IF(AND(R8<>\"\",Q8<>\"\",P8<>\"\"),IF($C8=\"\",\"SX\",IF($C8=\"F\",VLOOKUP(ROUND($L8,0)/100,Barème500,3),VLOOKUP(ROUND($L8,0)/100,Barème500,2))),\"\")","v":""},{"$f":"IF(OR(K8=\"\",K8=\"\",AH8=\"\",AG8=\"\",AF8=\"\"),\"\",IF(OR(K8<0,K8>2),\"Err ech.\",SUM(K8,AH8,AG8,AF8)))","v":""},null,"Note min :",{"$f":"IF(COUNT(AI4:AI101)>0,MIN(AI4:AI101),\"\")","v":""},null,null,{"$f":"IF(C8<>\"f\",\"m\",\"f\")","v":"m"}]
[null,null,null,null,null,null,null,null,null,null,null,{"$f":"IF(AND(R9<>\"\",Q9<>\"\",P9<>\"\"),(INT(((INT($P9)*60)+(($P9-INT($P9))*100)+(INT($Q9)*60)+(($Q9-INT($Q9))*100)+(INT($R9)*60)+(($R9-INT($R9))*100))/60)+MOD(((INT($P9)*60)+(($P9-INT($P9))*100)+(INT($Q9)*60)+(($Q9-INT($Q9))*100)+(INT($R9)*60)+(($R9-INT($R9))*100)),60)/100)*100,\"\")","v":""},{"$f":"IF(OR(O9=\"\",P9=\"\"),\"\",ABS((INT(P9)*60)+((P9-INT(P9))*100)-((INT(O9)*60)+((O9-INT(O9))*100))))","v":""},{"$f":"IF(AND(E9=\"\",H9=\"\"),\"\",IF(H9=\"\",E9,H9))","v":""},{"$f":"IF(F9=\"\",\"\",F9/100)","v":""},{"$f":"IF(G9=\"\",\"\",G9/100)","v":""},{"$f":"IF(I9=\"\",\"\",I9/100)","v":""},{"$f":"IF(J9=\"\",\"\",J9/100)","v":""},{"$f":"ROUND((INT(Q9)*60)+((Q9-INT(Q9))*100)-((INT(P9)*60)+((P9-INT(P9))*100)),0)","v":{"$error":"#VALUE!"}},{"$f":"ROUND((INT(R9)*60)+((R9-INT(R9))*100)-((INT(Q9)*60)+((Q9-INT(Q9))*100)),0)","v":{"$error":"#VALUE!"}},{"$f":"ROUND((INT(R9)*60)+((R9-INT(R9))*100)-((INT(P9)*60)+((P9-INT(P9))*100)),0)","v":{"$error":"#VALUE!"}},{"$f":"IF(AND(Q9<>0,P9<>0),IF(OR(N9=1,N9=3,N9=4),IF(OR(S9=0,ABS(S9)<='Barèmes & Options'!H$2),1,0)),\"\")","v":false},{"$f":"IF(AND(Q9<>\"\",P9<>\"\"),IF(OR(N9=5,N9=7),IF(S9>0,1,0)),\"\")","v":""},{"$f":"IF(AND(Q9<>\"\",P9<>\"\"),IF(OR(N9=2,N9=6,N9=8),IF(S9<0,1,0)),\"\")","v":""},{"$f":"IF(AND(Q9<>0,R9<>0),IF(OR(N9=1,N9=5,N9=6),IF(OR(T9=0,ABS(T9)<='Barèmes & Options'!H$2),1,0)),\"\")","v":false},{"$f":"IF(AND(Q9<>\"\",R9<>\"\"),IF(OR(N9=4,N9=8),IF(T9>0,1,0)),\"\")","v":""},{"$f":"IF(AND(Q9<>\"\",R9<>\"\"),IF(OR(N9=2,N9=3,N9=7),IF(T9<0,1,0)),\"\")","v":""},{"$f":"IF(SUM(V9:AA9)=2,IF(N9=2,IF(N9=2,IF(U9-'Barèmes & Options'!H$2<-1,0,1)),\"\"),0)","v":0},{"$f":"IF(OR(N9=2,N9=9),SUM(V9:AA9)-AB9,SUM(V9:AA9))","v":0},{"$f":"IF(OR(V9=1,W9=1,X9=1),TRUE,FALSE)","v":false},{"$f":"IF(OR(Y9=1,Z9=1,AA9=1),TRUE,FALSE)","v":false},{"$f":"IF(N9<>\"\",IF(AND(N9>=1,N9<=8,N9=ABS(N9)),IF(AND(N9<=9,N9>=1),IF(AND(AC9=1,H9<>\"\"),1,IF(AND(AC9=1,H9=\"\"),1.5,IF(AND(AC9=2,H9<>\"\"),2,IF(AND(AC9=2,H9=\"\"),3,0)))),\"\"),\"Err. Profil\"),\"\")","v":""},{"$f":"IF(O9<>\"\",IF(ROUND(M9,0)<=3,1,0),\"\")","v":""},{"$f":"IF(AND(R9<>\"\",Q9<>\"\",P9<>\"\"),IF($C9=\"\",\"SX\",IF($C9=\"F\",VLOOKUP(ROUND($L9,0)/100,Barème500,3),VLOOKUP(ROUND($L9,0)/100,Barème500,2))),\"\")","v":""},{"$f":"IF(OR(K9=\"\",K9=\"\",AH9=\"\",AG9=\"\",AF9=\"\"),\"\",IF(OR(K9<0,K9>2),\"Err ech.\",SUM(K9,AH9,AG9,AF9)))","v":""},null,null,null,null,null,{"$f":"IF(C9<>\"f\",\"m\",\"f\")","v":"m"}]
[null,null,null,null,null,null,null,null,null,null,null,{"$f":"IF(AND(R10<>\"\",Q10<>\"\",P10<>\"\"),(INT(((INT($P10)*60)+(($P10-INT($P10))*100)+(INT($Q10)*60)+(($Q10-INT($Q10))*100)+(INT($R10)*60)+(($R10-INT($R10))*100))/60)+MOD(((INT($P10)*60)+(($P10-INT($P10))*100)+(INT($Q10)*60)+(($Q10-INT($Q10))*100)+(INT($R10)*60)+(($R10-INT($R10))*100)),60)/100)*100,\"\")","v":""},{"$f":"IF(OR(O10=\"\",P10=\"\"),\"\",ABS((INT(P10)*60)+((P10-INT(P10))*100)-((INT(O10)*60)+((O10-INT(O10))*100))))","v":""},{"$f":"IF(AND(E10=\"\",H10=\"\"),\"\",IF(H10=\"\",E10,H10))","v":""},{"$f":"IF(F10=\"\",\"\",F10/100)","v":""},{"$f":"IF(G10=\"\",\"\",G10/100)","v":""},{"$f":"IF(I10=\"\",\"\",I10/100)","v":""},{"$f":"IF(J10=\"\",\"\",J10/100)","v":""},{"$f":"ROUND((INT(Q10)*60)+((Q10-INT(Q10))*100)-((INT(P10)*60)+((P10-INT(P10))*100)),0)","v":{"$error":"#VALUE!"}},{"$f":"ROUND((INT(R10)*60)+((R10-INT(R10))*100)-((INT(Q10)*60)+((Q10-INT(Q10))*100)),0)","v":{"$error":"#VALUE!"}},{"$f":"ROUND((INT(R10)*60)+((R10-INT(R10))*100)-((INT(P10)*60)+((P10-INT(P10))*100)),0)","v":{"$error":"#VALUE!"}},{"$f":"IF(AND(Q10<>0,P10<>0),IF(OR(N10=1,N10=3,N10=4),IF(OR(S10=0,ABS(S10)<='Barèmes & Options'!H$2),1,0)),\"\")","v":false},{"$f":"IF(AND(Q10<>\"\",P10<>\"\"),IF(OR(N10=5,N10=7),IF(S10>0,1,0)),\"\")","v":""},{"$f":"IF(AND(Q10<>\"\",P10<>\"\"),IF(OR(N10=2,N10=6,N10=8),IF(S10<0,1,0)),\"\")","v":""},{"$f":"IF(AND(Q10<>0,R10<>0),IF(OR(N10=1,N10=5,N10=6),IF(OR(T10=0,ABS(T10)<='Barèmes & Options'!H$2),1,0)),\"\")","v":false},{"$f":"IF(AND(Q10<>\"\",R10<>\"\"),IF(OR(N10=4,N10=8),IF(T10>0,1,0)),\"\")","v":""},{"$f":"IF(AND(Q10<>\"\",R10<>\"\"),IF(OR(N10=2,N10=3,N10=7),IF(T10<0,1,0)),\"\")","v":""},{"$f":"IF(SUM(V10:AA10)=2,IF(N10=2,IF(N10=2,IF(U10-'Barèmes & Options'!H$2<-1,0,1)),\"\"),0)","v":0},{"$f":"IF(OR(N10=2,N10=9),SUM(V10:AA10)-AB10,SUM(V10:AA10))","v":0},{"$f":"IF(OR(V10=1,W10=1,X10=1),TRUE,FALSE)","v":false},{"$f":"IF(OR(Y10=1,Z10=1,AA10=1),TRUE,FALSE)","v":false},{"$f":"IF(N10<>\"\",IF(AND(N10>=1,N10<=8,N10=ABS(N10)),IF(AND(N10<=9,N10>=1),IF(AND(AC10=1,H10<>\"\"),1,IF(AND(AC10=1,H10=\"\"),1.5,IF(AND(AC10=2,H10<>\"\"),2,IF(AND(AC10=2,H10=\"\"),3,0)))),\"\"),\"Err. Profil\"),\"\")","v":""},{"$f":"IF(O10<>\"\",IF(ROUND(M10,0)<=3,1,0),\"\")","v":""},{"$f":"IF(AND(R10<>\"\",Q10<>\"\",P10<>\"\"),IF($C10=\"\",\"SX\",IF($C10=\"F\",VLOOKUP(ROUND($L10,0)/100,Barème500,3),VLOOKUP(ROUND($L10,0)/100,Barème500,2))),\"\")","v":""},{"$f":"IF(OR(K10=\"\",K10=\"\",AH10=\"\",AG10=\"\",AF10=\"\"),\"\",IF(OR(K10<0,K10>2),\"Err ech.\",SUM(K10,AH10,AG10,AF10)))","v":""},null,"Date :",null,null,null,{"$f":"IF(C10<>\"f\",\"m\",\"f\")","v":"m"}]
{"$rows_left_out":92}
{"sheet":"Barèmes & Options","index":2,"n_rows":218,"n_cols":8,"rows_kept":218,"cut":false,"hidden":false,"merged":[[0,0,0,2]]}
["Barème 1500"]
["temps","G","F",null,null,null,"Tolérance En sec. :",3]
[3,14,14]
[4.0999999999999996,14,14]
[4.1100000000000003,13.9,14]
[4.12,13.8,14]
[4.13,13.6,14]
[4.1399999999999997,13.5,14]
[4.1500000000000004,13.3,14]
[4.16,13.1,14]
{"$rows_left_out":209}
{"sheet":"Présentation des profils","index":3,"n_rows":0,"n_cols":0,"rows_kept":0,"cut":false,"hidden":false,"merged":[]}