{"text_format":"1","workbook":"xlsx","n_sheets":2,"sheets":["Tableau","Barème"],"not_rendered":{"charts":0,"images":0,"macros":1,"external_links":0,"defined_names":400,"comments":0,"pivot_tables":0},"unopened":[],"bounds":{"document_bytes":16777216,"sheet_cells":100000,"rows_first":2000,"rows_last":500,"rows_between":2000,"halvings":0,"cell_chars":16384,"cell_head_chars":4096},"cells_cut":0,"cells_raw":0,"read":"whole","date_system":"1900"}

{"sheet":"Tableau","index":0,"n_rows":101,"n_cols":27,"rows_kept":101,"cut":false,"hidden":false,"merged":[]}
["Nom","Prénom","Sexe F ou G/M","Classe","Projet","Perf 1","Perf 2","Perf 3","Perf 4","Perf 5","Perf 6","Meilleur Perf","Perf moyenne","Ecart","Note record /10","Note moyenne /4","Note ecart /2","Note technique/4","Note Javelot",null,"Sexe fin"]
[null,null,null,null,null,null,null,null,null,null,null,{"$f":"IF(COUNTA(F2:K2)>0,MAX(F2:K2),\"\")","v":""},{"$f":"IF(COUNTA(F2:K2)<3,\"\",(LARGE(F2:K2,1)+LARGE(F2:K2,2)+LARGE(F2:K2,3))/3)","v":""},{"$f":"IF(M2<>\"\", IF(E2<>\"\",(ABS(M2-E2)/E2)*100,\"Projet ?\"),\"\")","v":""},{"$f":"IF(L2<>\"\",IF(OR(C2=\"G\",C2=\"M\"),LOOKUP(L2,Barème!$D$5:$D$82,Barème!$C$5:$C$82),IF(C2=\"F\",LOOKUP(L2,Barème!$B$5:$B$82,Barème!$C$5:$C$82),\"(F ou G)\")),\"\")","v":""},{"$f":"IF(M2<>\"\",IF(OR(C2=\"G\",C2=\"M\"),LOOKUP(M2,Barème!$H$5:$H$82,Barème!$G$5:$G$82),IF(C2=\"F\",LOOKUP(M2,Barème!$F$5:$F$82,Barème!$G$5:$G$82),\"(F ou G)\")),\"\")","v":""},{"$f":"IF(N2<>\"\",IF($N2<=5,2,IF(AND($N2>5,$N2<=10),1,IF(AND($N2>10,$N2<=20),0.5,0))),\"\")","v":""},null,{"$f":"IF(OR(O2=\"\",P2=\"\",N2=\"\",N2=\"Projet ?\",O2=\"(F ou G)\"),\"\",IF(R2=\"\",\"Note tech ?\",IF(AND(R2<=4,R2>=0),R2+Q2+P2+O2,\"Err Nt tech.\")))","v":""},null,{"$f":"IF(C2=\"g\",\"G\",IF(C2=\"m\",\"G\",IF(C2=\"F\",\"F\",\"\")))","v":""}]
[null,null,null,null,null,null,null,null,null,null,null,{"$f":"IF(COUNTA(F3:K3)>0,MAX(F3:K3),\"\")","v":""},{"$f":"IF(COUNTA(F3:K3)<3,\"\",(LARGE(F3:K3,1)+LARGE(F3:K3,2)+LARGE(F3:K3,3))/3)","v":""},"",{"$f":"IF(L3<>\"\",IF(OR(C3=\"G\",C3=\"M\"),LOOKUP(L3,Barème!$D$5:$D$82,Barème!$C$5:$C$82),IF(C3=\"F\",LOOKUP(L3,Barème!$B$5:$B$82,Barème!$C$5:$C$82),\"(F ou G)\")),\"\")","v":""},{"$f":"IF(M3<>\"\",IF(OR(C3=\"G\",C3=\"M\"),LOOKUP(M3,Barème!$H$5:$H$82,Barème!$G$5:$G$82),IF(C3=\"F\",LOOKUP(M3,Barème!$F$5:$F$82,Barème!$G$5:$G$82),\"(F ou G)\")),\"\")","v":""},"",null,"",null,"","Moyenne F :",{"$f":"IF(ISERROR(AA3),\"\",AVERAGEIF(U2:U101,\"=F\",S2:S101))","v":""},null,null,null,{"$f":"AVERAGEIF(U2:U101,\"=F\",S2:S101)","v":{"$error":"#DIV/0!"}}]
[null,null,null,null,null,null,null,null,null,null,null,"","","",{"$f":"IF(L4<>\"\",IF(OR(C4=\"G\",C4=\"M\"),LOOKUP(L4,Barème!$D$5:$D$82,Barème!$C$5:$C$82),IF(C4=\"F\",LOOKUP(L4,Barème!$B$5:$B$82,Barème!$C$5:$C$82),\"(F ou G)\")),\"\")","v":""},{"$f":"IF(M4<>\"\",IF(OR(C4=\"G\",C4=\"M\"),LOOKUP(M4,Barème!$H$5:$H$82,Barème!$G$5:$G$82),IF(C4=\"F\",LOOKUP(M4,Barème!$F$5:$F$82,Barème!$G$5:$G$82),\"(F ou G)\")),\"\")","v":""},"",null,"",null,"","Moyenne G :",{"$f":"IF(ISERROR(AA4),\"\",AVERAGEIF(U2:U101,\"=G\",S2:S101))","v":""},null,null,null,{"$f":"AVERAGEIF(U2:U101,\"=G\",S2:S101)","v":{"$error":"#DIV/0!"}}]
[null,null,null,null,null,null,null,null,null,null,null,"","","",{"$f":"IF(L5<>\"\",IF(OR(C5=\"G\",C5=\"M\"),LOOKUP(L5,Barème!$D$5:$D$82,Barème!$C$5:$C$82),IF(C5=\"F\",LOOKUP(L5,Barème!$B$5:$B$82,Barème!$C$5:$C$82),\"(F ou G)\")),\"\")","v":""},{"$f":"IF(M5<>\"\",IF(OR(C5=\"G\",C5=\"M\"),LOOKUP(M5,Barème!$H$5:$H$82,Barème!$G$5:$G$82),IF(C5=\"F\",LOOKUP(M5,Barème!$F$5:$F$82,Barème!$G$5:$G$82),\"(F ou G)\")),\"\")","v":""},"",null,"",null,"","Moyenne :",{"$f":"IF(AND(W3=\"\",W4=\"\"),\"\",AVERAGE(S2:S101))","v":""},null,null,null,{"$f":"AVERAGE(S2:S101)","v":{"$error":"#DIV/0!"}}]
[null,null,null,null,null,null,null,null,null,null,null,"","","",{"$f":"IF(L6<>\"\",IF(OR(C6=\"G\",C6=\"M\"),LOOKUP(L6,Barème!$D$5:$D$82,Barème!$C$5:$C$82),IF(C6=\"F\",LOOKUP(L6,Barème!$B$5:$B$82,Barème!$C$5:$C$82),\"(F ou G)\")),\"\")","v":""},{"$f":"IF(M6<>\"\",IF(OR(C6=\"G\",C6=\"M\"),LOOKUP(M6,Barème!$H$5:$H$82,Barème!$G$5:$G$82),IF(C6=\"F\",LOOKUP(M6,Barème!$F$5:$F$82,Barème!$G$5:$G$82),\"(F ou G)\")),\"\")","v":""},"",null,"",null,"","Note Max :",{"$f":"IF(SUM(S2:S101)>0,MAX(S2:S101),\"\")","v":""}]
[null,null,null,null,null,null,null,null,null,null,null,"","","",{"$f":"IF(L7<>\"\",IF(OR(C7=\"G\",C7=\"M\"),LOOKUP(L7,Barème!$D$5:$D$82,Barème!$C$5:$C$82),IF(C7=\"F\",LOOKUP(L7,Barème!$B$5:$B$82,Barème!$C$5:$C$82),\"(F ou G)\")),\"\")","v":""},{"$f":"IF(M7<>\"\",IF(OR(C7=\"G\",C7=\"M\"),LOOKUP(M7,Barème!$H$5:$H$82,Barème!$G$5:$G$82),IF(C7=\"F\",LOOKUP(M7,Barème!$F$5:$F$82,Barème!$G$5:$G$82),\"(F ou G)\")),\"\")","v":""},"",null,"",null,"","Note Min :",{"$f":"IF(SUM(S2:S101)>0,MIN(S2:S101),\"\")","v":""}]
[null,null,null,null,null,null,null,null,null,null,null,"","","",{"$f":"IF(L8<>\"\",IF(OR(C8=\"G\",C8=\"M\"),LOOKUP(L8,Barème!$D$5:$D$82,Barème!$C$5:$C$82),IF(C8=\"F\",LOOKUP(L8,Barème!$B$5:$B$82,Barème!$C$5:$C$82),\"(F ou G)\")),\"\")","v":""},{"$f":"IF(M8<>\"\",IF(OR(C8=\"G\",C8=\"M\"),LOOKUP(M8,Barème!$H$5:$H$82,Barème!$G$5:$G$82),IF(C8=\"F\",LOOKUP(M8,Barème!$F$5:$F$82,Barème!$G$5:$G$82),\"(F ou G)\")),\"\")","v":""},"",null,"",null,""]
[null,null,null,null,null,null,null,null,null,null,null,"","","",{"$f":"IF(L9<>\"\",IF(OR(C9=\"G\",C9=\"M\"),LOOKUP(L9,Barème!$D$5:$D$82,Barème!$C$5:$C$82),IF(C9=\"F\",LOOKUP(L9,Barème!$B$5:$B$82,Barème!$C$5:$C$82),\"(F ou G)\")),\"\")","v":""},{"$f":"IF(M9<>\"\",IF(OR(C9=\"G\",C9=\"M\"),LOOKUP(M9,Barème!$H$5:$H$82,Barème!$G$5:$G$82),IF(C9=\"F\",LOOKUP(M9,Barème!$F$5:$F$82,Barème!$G$5:$G$82),\"(F ou G)\")),\"\")","v":""},"",null,"",null,"","Date épreuve : "]
[null,null,null,null,null,null,null,null,null,null,null,"","","",{"$f":"IF(L10<>\"\",IF(OR(C10=\"G\",C10=\"M\"),LOOKUP(L10,Barème!$D$5:$D$82,Barème!$C$5:$C$82),IF(C10=\"F\",LOOKUP(L10,Barème!$B$5:$B$82,Barème!$C$5:$C$82),\"(F ou G)\")),\"\")","v":""},{"$f":"IF(M10<>\"\",IF(OR(C10=\"G\",C10=\"M\"),LOOKUP(M10,Barème!$H$5:$H$82,Barème!$G$5:$G$82),IF(C10=\"F\",LOOKUP(M10,Barème!$F$5:$F$82,Barème!$G$5:$G$82),\"(F ou G)\")),\"\")","v":""},"",null,"",null,""]
[null,null,null,null,null,null,null,null,null,null,null,"","","",{"$f":"IF(L11<>\"\",IF(OR(C11=\"G\",C11=\"M\"),LOOKUP(L11,Barème!$D$5:$D$82,Barème!$C$5:$C$82),IF(C11=\"F\",LOOKUP(L11,Barème!$B$5:$B$82,Barème!$C$5:$C$82),\"(F ou G)\")),\"\")","v":""},{"$f":"IF(M11<>\"\",IF(OR(C11=\"G\",C11=\"M\"),LOOKUP(M11,Barème!$H$5:$H$82,Barème!$G$5:$G$82),IF(C11=\"F\",LOOKUP(M11,Barème!$F$5:$F$82,Barème!$G$5:$G$82),\"(F ou G)\")),\"\")","v":""},"",null,"",null,""]
[null,null,null,null,null,null,null,null,null,null,null,"","","",{"$f":"IF(L12<>\"\",IF(OR(C12=\"G\",C12=\"M\"),LOOKUP(L12,Barème!$D$5:$D$82,Barème!$C$5:$C$82),IF(C12=\"F\",LOOKUP(L12,Barème!$B$5:$B$82,Barème!$C$5:$C$82),\"(F ou G)\")),\"\")","v":""},{"$f":"IF(M12<>\"\",IF(OR(C12=\"G\",C12=\"M\"),LOOKUP(M12,Barème!$H$5:$H$82,Barème!$G$5:$G$82),IF(C12=\"F\",LOOKUP(M12,Barème!$F$5:$F$82,Barème!$G$5:$G$82),\"(F ou G)\")),\"\")","v":""},"",null,"",null,""]
[null,null,null,null,null,null,null,null,null,null,null,"","","",{"$f":"IF(L13<>\"\",IF(OR(C13=\"G\",C13=\"M\"),LOOKUP(L13,Barème!$D$5:$D$82,Barème!$C$5:$C$82),IF(C13=\"F\",LOOKUP(L13,Barème!$B$5:$B$82,Barème!$C$5:$C$82),\"(F ou G)\")),\"\")","v":""},{"$f":"IF(M13<>\"\",IF(OR(C13=\"G\",C13=\"M\"),LOOKUP(M13,Barème!$H$5:$H$82,Barème!$G$5:$G$82),IF(C13=\"F\",LOOKUP(M13,Barème!$F$5:$F$82,Barème!$G$5:$G$82),\"(F ou G)\")),\"\")","v":""},"",null,"",null,""]
[null,null,null,null,null,null,null,null,null,null,null,"","","",{"$f":"IF(L14<>\"\",IF(OR(C14=\"G\",C14=\"M\"),LOOKUP(L14,Barème!$D$5:$D$82,Barème!$C$5:$C$82),IF(C14=\"F\",LOOKUP(L14,Barème!$B$5:$B$82,Barème!$C$5:$C$82),\"(F ou G)\")),\"\")","v":""},{"$f":"IF(M14<>\"\",IF(OR(C14=\"G\",C14=\"M\"),LOOKUP(M14,Barème!$H$5:$H$82,Barème!$G$5:$G$82),IF(C14=\"F\",LOOKUP(M14,Barème!$F$5:$F$82,Barème!$G$5:$G$82),\"(F ou G)\")),\"\")","v":""},"",null,"",null,""]
[null,null,null,null,null,null,null,null,null,null,null,null,null,null,{"$f":"IF(L15<>\"\",IF(OR(C15=\"G\",C15=\"M\"),LOOKUP(L15,Barème!$D$5:$D$82,Barème!$C$5:$C$82),IF(C15=\"F\",LOOKUP(L15,Barème!$B$5:$B$82,Barème!$C$5:$C$82),\"(F ou G)\")),\"\")","v":""},{"$f":"IF(M15<>\"\",IF(OR(C15=\"G\",C15=\"M\"),LOOKUP(M15,Barème!$H$5:$H$82,Barème!$G$5:$G$82),IF(C15=\"F\",LOOKUP(M15,Barème!$F$5:$F$82,Barème!$G$5:$G$82),\"(F ou G)\")),\"\")","v":""},null,null,null,null,""]
[null,null,null,null,null,null,null,null,null,null,null,null,null,null,{"$f":"IF(L16<>\"\",IF(OR(C16=\"G\",C16=\"M\"),LOOKUP(L16,Barème!$D$5:$D$82,Barème!$C$5:$C$82),IF(C16=\"F\",LOOKUP(L16,Barème!$B$5:$B$82,Barème!$C$5:$C$82),\"(F ou G)\")),\"\")","v":""},{"$f":"IF(M16<>\"\",IF(OR(C16=\"G\",C16=\"M\"),LOOKUP(M16,Barème!$H$5:$H$82,Barème!$G$5:$G$82),IF(C16=\"F\",LOOKUP(M16,Barème!$F$5:$F$82,Barème!$G$5:$G$82),\"(F ou G)\")),\"\")","v":""},null,null,null,null,""]
[null,null,null,null,null,null,null,null,null,null,null,null,null,null,{"$f":"IF(L17<>\"\",IF(OR(C17=\"G\",C17=\"M\"),LOOKUP(L17,Barème!$D$5:$D$82,Barème!$C$5:$C$82),IF(C17=\"F\",LOOKUP(L17,Barème!$B$5:$B$82,Barème!$C$5:$C$82),\"(F ou G)\")),\"\")","v":""},{"$f":"IF(M17<>\"\",IF(OR(C17=\"G\",C17=\"M\"),LOOKUP(M17,Barème!$H$5:$H$82,Barème!$G$5:$G$82),IF(C17=\"F\",LOOKUP(M17,Barème!$F$5:$F$82,Barème!$G$5:$G$82),\"(F ou G)\")),\"\")","v":""},null,null,null,null,""]
[null,null,null,null,null,null,null,null,null,null,null,null,null,null,{"$f":"IF(L18<>\"\",IF(OR(C18=\"G\",C18=\"M\"),LOOKUP(L18,Barème!$D$5:$D$82,Barème!$C$5:$C$82),IF(C18=\"F\",LOOKUP(L18,Barème!$B$5:$B$82,Barème!$C$5:$C$82),\"(F ou G)\")),\"\")","v":""},{"$f":"IF(M18<>\"\",IF(OR(C18=\"G\",C18=\"M\"),LOOKUP(M18,Barème!$H$5:$H$82,Barème!$G$5:$G$82),IF(C18=\"F\",LOOKUP(M18,Barème!$F$5:$F$82,Barème!$G$5:$G$82),\"(F ou G)\")),\"\")","v":""},null,null,null,null,""]
[null,null,null,null,null,null,null,null,null,null,null,null,null,null,{"$f":"IF(L19<>\"\",IF(OR(C19=\"G\",C19=\"M\"),LOOKUP(L19,Barème!$D$5:$D$82,Barème!$C$5:$C$82),IF(C19=\"F\",LOOKUP(L19,Barème!$B$5:$B$82,Barème!$C$5:$C$82),\"(F ou G)\")),\"\")","v":""},{"$f":"IF(M19<>\"\",IF(OR(C19=\"G\",C19=\"M\"),LOOKUP(M19,Barème!$H$5:$H$82,Barème!$G$5:$G$82),IF(C19=\"F\",LOOKUP(M19,Barème!$F$5:$F$82,Barème!$G$5:$G$82),\"(F ou G)\")),\"\")","v":""},null,null,null,null,""]
[null,null,null,null,null,null,null,null,null,null,null,null,null,null,{"$f":"IF(L20<>\"\",IF(OR(C20=\"G\",C20=\"M\"),LOOKUP(L20,Barème!$D$5:$D$82,Barème!$C$5:$C$82),IF(C20=\"F\",LOOKUP(L20,Barème!$B$5:$B$82,Barème!$C$5:$C$82),\"(F ou G)\")),\"\")","v":""},{"$f":"IF(M20<>\"\",IF(OR(C20=\"G\",C20=\"M\"),LOOKUP(M20,Barème!$H$5:$H$82,Barème!$G$5:$G$82),IF(C20=\"F\",LOOKUP(M20,Barème!$F$5:$F$82,Barème!$G$5:$G$82),\"(F ou G)\")),\"\")","v":""},null,null,null,null,""]
[null,null,null,null,null,null,null,null,null,null,null,null,null,null,{"$f":"IF(L21<>\"\",IF(OR(C21=\"G\",C21=\"M\"),LOOKUP(L21,Barème!$D$5:$D$82,Barème!$C$5:$C$82),IF(C21=\"F\",LOOKUP(L21,Barème!$B$5:$B$82,Barème!$C$5:$C$82),\"(F ou G)\")),\"\")","v":""},{"$f":"IF(M21<>\"\",IF(OR(C21=\"G\",C21=\"M\"),LOOKUP(M21,Barème!$H$5:$H$82,Barème!$G$5:$G$82),IF(C21=\"F\",LOOKUP(M21,Barème!$F$5:$F$82,Barème!$G$5:$G$82),\"(F ou G)\")),\"\")","v":""},null,null,null,null,""]
[null,null,null,null,null,null,null,null,null,null,null,null,null,null,{"$f":"IF(L22<>\"\",IF(OR(C22=\"G\",C22=\"M\"),LOOKUP(L22,Barème!$D$5:$D$82,Barème!$C$5:$C$82),IF(C22=\"F\",LOOKUP(L22,Barème!$B$5:$B$82,Barème!$C$5:$C$82),\"(F ou G)\")),\"\")","v":""},{"$f":"IF(M22<>\"\",IF(OR(C22=\"G\",C22=\"M\"),LOOKUP(M22,Barème!$H$5:$H$82,Barème!$G$5:$G$82),IF(C22=\"F\",LOOKUP(M22,Barème!$F$5:$F$82,Barème!$G$5:$G$82),\"(F ou G)\")),\"\")","v":""},null,null,null,null,""]
[null,null,null,null,null,null,null,null,null,null,null,null,null,null,{"$f":"IF(L23<>\"\",IF(OR(C23=\"G\",C23=\"M\"),LOOKUP(L23,Barème!$D$5:$D$82,Barème!$C$5:$C$82),IF(C23=\"F\",LOOKUP(L23,Barème!$B$5:$B$82,Barème!$C$5:$C$82),\"(F ou G)\")),\"\")","v":""},{"$f":"IF(M23<>\"\",IF(OR(C23=\"G\",C23=\"M\"),LOOKUP(M23,Barème!$H$5:$H$82,Barème!$G$5:$G$82),IF(C23=\"F\",LOOKUP(M23,Barème!$F$5:$F$82,Barème!$G$5:$G$82),\"(F ou G)\")),\"\")","v":""},null,null,null,null,""]
[null,null,null,null,null,null,null,null,null,null,null,null,null,null,{"$f":"IF(L24<>\"\",IF(OR(C24=\"G\",C24=\"M\"),LOOKUP(L24,Barème!$D$5:$D$82,Barème!$C$5:$C$82),IF(C24=\"F\",LOOKUP(L24,Barème!$B$5:$B$82,Barème!$C$5:$C$82),\"(F ou G)\")),\"\")","v":""},{"$f":"IF(M24<>\"\",IF(OR(C24=\"G\",C24=\"M\"),LOOKUP(M24,Barème!$H$5:$H$82,Barème!$G$5:$G$82),IF(C24=\"F\",LOOKUP(M24,Barème!$F$5:$F$82,Barème!$G$5:$G$82),\"(F ou G)\")),\"\")","v":""},null,null,null,null,""]
[null,null,null,null,null,null,null,null,null,null,null,null,null,null,{"$f":"IF(L25<>\"\",IF(OR(C25=\"G\",C25=\"M\"),LOOKUP(L25,Barème!$D$5:$D$82,Barème!$C$5:$C$82),IF(C25=\"F\",LOOKUP(L25,Barème!$B$5:$B$82,Barème!$C$5:$C$82),\"(F ou G)\")),\"\")","v":""},{"$f":"IF(M25<>\"\",IF(OR(C25=\"G\",C25=\"M\"),LOOKUP(M25,Barème!$H$5:$H$82,Barème!$G$5:$G$82),IF(C25=\"F\",LOOKUP(M25,Barème!$F$5:$F$82,Barème!$G$5:$G$82),\"(F ou G)\")),\"\")","v":""},null,null,null,null,""]
[null,null,null,null,null,null,null,null,null,null,null,null,null,null,{"$f":"IF(L26<>\"\",IF(OR(C26=\"G\",C26=\"M\"),LOOKUP(L26,Barème!$D$5:$D$82,Barème!$C$5:$C$82),IF(C26=\"F\",LOOKUP(L26,Barème!$B$5:$B$82,Barème!$C$5:$C$82),\"(F ou G)\")),\"\")","v":""},{"$f":"IF(M26<>\"\",IF(OR(C26=\"G\",C26=\"M\"),LOOKUP(M26,Barème!$H$5:$H$82,Barème!$G$5:$G$82),IF(C26=\"F\",LOOKUP(M26,Barème!$F$5:$F$82,Barème!$G$5:$G$82),\"(F ou G)\")),\"\")","v":""},null,null,null,null,""]
[null,null,null,null,null,null,null,null,null,null,null,null,null,null,{"$f":"IF(L27<>\"\",IF(OR(C27=\"G\",C27=\"M\"),LOOKUP(L27,Barème!$D$5:$D$82,Barème!$C$5:$C$82),IF(C27=\"F\",LOOKUP(L27,Barème!$B$5:$B$82,Barème!$C$5:$C$82),\"(F ou G)\")),\"\")","v":""},{"$f":"IF(M27<>\"\",IF(OR(C27=\"G\",C27=\"M\"),LOOKUP(M27,Barème!$H$5:$H$82,Barème!$G$5:$G$82),IF(C27=\"F\",LOOKUP(M27,Barème!$F$5:$F$82,Barème!$G$5:$G$82),\"(F ou G)\")),\"\")","v":""},null,null,null,null,""]
[null,null,null,null,null,null,null,null,null,null,null,null,null,null,{"$f":"IF(L28<>\"\",IF(OR(C28=\"G\",C28=\"M\"),LOOKUP(L28,Barème!$D$5:$D$82,Barème!$C$5:$C$82),IF(C28=\"F\",LOOKUP(L28,Barème!$B$5:$B$82,Barème!$C$5:$C$82),\"(F ou G)\")),\"\")","v":""},{"$f":"IF(M28<>\"\",IF(OR(C28=\"G\",C28=\"M\"),LOOKUP(M28,Barème!$H$5:$H$82,Barème!$G$5:$G$82),IF(C28=\"F\",LOOKUP(M28,Barème!$F$5:$F$82,Barème!$G$5:$G$82),\"(F ou G)\")),\"\")","v":""},null,null,null,null,""]
[null,null,null,null,null,null,null,null,null,null,null,null,null,null,{"$f":"IF(L29<>\"\",IF(OR(C29=\"G\",C29=\"M\"),LOOKUP(L29,Barème!$D$5:$D$82,Barème!$C$5:$C$82),IF(C29=\"F\",LOOKUP(L29,Barème!$B$5:$B$82,Barème!$C$5:$C$82),\"(F ou G)\")),\"\")","v":""},{"$f":"IF(M29<>\"\",IF(OR(C29=\"G\",C29=\"M\"),LOOKUP(M29,Barème!$H$5:$H$82,Barème!$G$5:$G$82),IF(C29=\"F\",LOOKUP(M29,Barème!$F$5:$F$82,Barème!$G$5:$G$82),\"(F ou G)\")),\"\")","v":""},null,null,null,null,""]
[null,null,null,null,null,null,null,null,null,null,null,null,null,null,{"$f":"IF(L30<>\"\",IF(OR(C30=\"G\",C30=\"M\"),LOOKUP(L30,Barème!$D$5:$D$82,Barème!$C$5:$C$82),IF(C30=\"F\",LOOKUP(L30,Barème!$B$5:$B$82,Barème!$C$5:$C$82),\"(F ou G)\")),\"\")","v":""},{"$f":"IF(M30<>\"\",IF(OR(C30=\"G\",C30=\"M\"),LOOKUP(M30,Barème!$H$5:$H$82,Barème!$G$5:$G$82),IF(C30=\"F\",LOOKUP(M30,Barème!$F$5:$F$82,Barème!$G$5:$G$82),\"(F ou G)\")),\"\")","v":""},null,null,null,null,""]
[null,null,null,null,null,null,null,null,null,null,null,null,null,null,{"$f":"IF(L31<>\"\",IF(OR(C31=\"G\",C31=\"M\"),LOOKUP(L31,Barème!$D$5:$D$82,Barème!$C$5:$C$82),IF(C31=\"F\",LOOKUP(L31,Barème!$B$5:$B$82,Barème!$C$5:$C$82),\"(F ou G)\")),\"\")","v":""},{"$f":"IF(M31<>\"\",IF(OR(C31=\"G\",C31=\"M\"),LOOKUP(M31,Barème!$H$5:$H$82,Barème!$G$5:$G$82),IF(C31=\"F\",LOOKUP(M31,Barème!$F$5:$F$82,Barème!$G$5:$G$82),\"(F ou G)\")),\"\")","v":""},null,null,null,null,""]
[null,null,null,null,null,null,null,null,null,null,null,null,null,null,{"$f":"IF(L32<>\"\",IF(OR(C32=\"G\",C32=\"M\"),LOOKUP(L32,Barème!$D$5:$D$82,Barème!$C$5:$C$82),IF(C32=\"F\",LOOKUP(L32,Barème!$B$5:$B$82,Barème!$C$5:$C$82),\"(F ou G)\")),\"\")","v":""},{"$f":"IF(M32<>\"\",IF(OR(C32=\"G\",C32=\"M\"),LOOKUP(M32,Barème!$H$5:$H$82,Barème!$G$5:$G$82),IF(C32=\"F\",LOOKUP(M32,Barème!$F$5:$F$82,Barème!$G$5:$G$82),\"(F ou G)\")),\"\")","v":""},null,null,null,null,""]
[null,null,null,null,null,null,null,null,null,null,null,null,null,null,{"$f":"IF(L33<>\"\",IF(OR(C33=\"G\",C33=\"M\"),LOOKUP(L33,Barème!$D$5:$D$82,Barème!$C$5:$C$82),IF(C33=\"F\",LOOKUP(L33,Barème!$B$5:$B$82,Barème!$C$5:$C$82),\"(F ou G)\")),\"\")","v":""},{"$f":"IF(M33<>\"\",IF(OR(C33=\"G\",C33=\"M\"),LOOKUP(M33,Barème!$H$5:$H$82,Barème!$G$5:$G$82),IF(C33=\"F\",LOOKUP(M33,Barème!$F$5:$F$82,Barème!$G$5:$G$82),\"(F ou G)\")),\"\")","v":""},null,null,null,null,""]
[null,null,null,null,null,null,null,null,null,null,null,null,null,null,{"$f":"IF(L34<>\"\",IF(OR(C34=\"G\",C34=\"M\"),LOOKUP(L34,Barème!$D$5:$D$82,Barème!$C$5:$C$82),IF(C34=\"F\",LOOKUP(L34,Barème!$B$5:$B$82,Barème!$C$5:$C$82),\"(F ou G)\")),\"\")","v":""},{"$f":"IF(M34<>\"\",IF(OR(C34=\"G\",C34=\"M\"),LOOKUP(M34,Barème!$H$5:$H$82,Barème!$G$5:$G$82),IF(C34=\"F\",LOOKUP(M34,Barème!$F$5:$F$82,Barème!$G$5:$G$82),\"(F ou G)\")),\"\")","v":""},null,null,null,null,{"$f":"IF(C34=\"g\",\"G\",IF(C34=\"m\",\"G\",IF(C34=\"F\",\"F\",\"\")))","v":""}]
[null,null,null,null,null,null,null,null,null,null,null,null,null,null,{"$f":"IF(L35<>\"\",IF(OR(C35=\"G\",C35=\"M\"),LOOKUP(L35,Barème!$D$5:$D$82,Barème!$C$5:$C$82),IF(C35=\"F\",LOOKUP(L35,Barème!$B$5:$B$82,Barème!$C$5:$C$82),\"(F ou G)\")),\"\")","v":""},{"$f":"IF(M35<>\"\",IF(OR(C35=\"G\",C35=\"M\"),LOOKUP(M35,Barème!$H$5:$H$82,Barème!$G$5:$G$82),IF(C35=\"F\",LOOKUP(M35,Barème!$F$5:$F$82,Barème!$G$5:$G$82),\"(F ou G)\")),\"\")","v":""},null,null,null,null,""]
[null,null,null,null,null,null,null,null,null,null,null,null,null,null,{"$f":"IF(L36<>\"\",IF(OR(C36=\"G\",C36=\"M\"),LOOKUP(L36,Barème!$D$5:$D$82,Barème!$C$5:$C$82),IF(C36=\"F\",LOOKUP(L36,Barème!$B$5:$B$82,Barème!$C$5:$C$82),\"(F ou G)\")),\"\")","v":""},{"$f":"IF(M36<>\"\",IF(OR(C36=\"G\",C36=\"M\"),LOOKUP(M36,Barème!$H$5:$H$82,Barème!$G$5:$G$82),IF(C36=\"F\",LOOKUP(M36,Barème!$F$5:$F$82,Barème!$G$5:$G$82),\"(F ou G)\")),\"\")","v":""},null,null,null,null,""]
[null,null,null,null,null,null,null,null,null,null,null,{"$f":"IF(COUNTA(F37:K37)>0,MAX(F37:K37),\"\")","v":""},{"$f":"IF(COUNTA(F37:K37)<3,\"\",(LARGE(F37:K37,1)+LARGE(F37:K37,2)+LARGE(F37:K37,3))/3)","v":""},{"$f":"IF(M37<>\"\", IF(E37<>\"\",(ABS(M37-E37)/E37)*100,\"Projet ?\"),\"\")","v":""},{"$f":"IF(L37<>\"\",IF(OR(C37=\"G\",C37=\"M\"),LOOKUP(L37,Barème!$D$5:$D$82,Barème!$C$5:$C$82),IF(C37=\"F\",LOOKUP(L37,Barème!$B$5:$B$82,Barème!$C$5:$C$82),\"(F ou G)\")),\"\")","v":""},{"$f":"IF(M37<>\"\",IF(OR(C37=\"G\",C37=\"M\"),LOOKUP(M37,Barème!$H$5:$H$82,Barème!$G$5:$G$82),IF(C37=\"F\",LOOKUP(M37,Barème!$F$5:$F$82,Barème!$G$5:$G$82),\"(F ou G)\")),\"\")","v":""},{"$f":"IF(N37<>\"\",IF($N37<=5,2,IF(AND($N37>5,$N37<=10),1,IF(AND($N37>10,$N37<=20),0.5,0))),\"\")","v":""},null,{"$f":"IF(OR(O37=\"\",P37=\"\",N37=\"\",N37=\"Projet ?\",O37=\"(F ou G)\"),\"\",IF(R37=\"\",\"Note tech ?\",IF(AND(R37<=4,R37>=0),R37+Q37+P37+O37,\"Err Nt tech.\")))","v":""},null,""]
[null,null,null,null,null,null,null,null,null,null,null,"","","",{"$f":"IF(L38<>\"\",IF(OR(C38=\"G\",C38=\"M\"),LOOKUP(L38,Barème!$D$5:$D$82,Barème!$C$5:$C$82),IF(C38=\"F\",LOOKUP(L38,Barème!$B$5:$B$82,Barème!$C$5:$C$82),\"(F ou G)\")),\"\")","v":""},{"$f":"IF(M38<>\"\",IF(OR(C38=\"G\",C38=\"M\"),LOOKUP(M38,Barème!$H$5:$H$82,Barème!$G$5:$G$82),IF(C38=\"F\",LOOKUP(M38,Barème!$F$5:$F$82,Barème!$G$5:$G$82),\"(F ou G)\")),\"\")","v":""},"",null,"",null,""]
[null,null,null,null,null,null,null,null,null,null,null,"","","",{"$f":"IF(L39<>\"\",IF(OR(C39=\"G\",C39=\"M\"),LOOKUP(L39,Barème!$D$5:$D$82,Barème!$C$5:$C$82),IF(C39=\"F\",LOOKUP(L39,Barème!$B$5:$B$82,Barème!$C$5:$C$82),\"(F ou G)\")),\"\")","v":""},{"$f":"IF(M39<>\"\",IF(OR(C39=\"G\",C39=\"M\"),LOOKUP(M39,Barème!$H$5:$H$82,Barème!$G$5:$G$82),IF(C39=\"F\",LOOKUP(M39,Barème!$F$5:$F$82,Barème!$G$5:$G$82),\"(F ou G)\")),\"\")","v":""},"",null,"",null,""]
[null,null,null,null,null,null,null,null,null,null,null,"","","",{"$f":"IF(L40<>\"\",IF(OR(C40=\"G\",C40=\"M\"),LOOKUP(L40,Barème!$D$5:$D$82,Barème!$C$5:$C$82),IF(C40=\"F\",LOOKUP(L40,Barème!$B$5:$B$82,Barème!$C$5:$C$82),\"(F ou G)\")),\"\")","v":""},{"$f":"IF(M40<>\"\",IF(OR(C40=\"G\",C40=\"M\"),LOOKUP(M40,Barème!$H$5:$H$82,Barème!$G$5:$G$82),IF(C40=\"F\",LOOKUP(M40,Barème!$F$5:$F$82,Barème!$G$5:$G$82),\"(F ou G)\")),\"\")","v":""},"",null,"",null,""]
{"$rows_left_out":62}
{"sheet":"Barème","index":1,"n_rows":82,"n_cols":8,"rows_kept":82,"cut":false,"hidden":false,"merged":[]}
[]
[]
[]
[null,"Perf fille","Note","Perf garçon",null,"Moy fille","Note","Moy garçon"]
[null,0,0,0,null,0,0,0]
[null,8.59,0,11.19,null,7.79,0,8.99]
[null,8.6,0.5,11.2,null,7.8,0.2,9]
[null,{"$f":"((B10-B7)/3)+B7","v":8.6999999999999993},0.74999999999999989,{"$f":"((D10-D7)/3)+D7","v":11.533333333333333},null,{"$f":"((F10-F7)/3)+F7","v":7.8666666666666663},0.3,{"$f":"((H10-H7)/3)+H7","v":9.3333333333333339}]
[null,{"$f":"((B10-B7)/3)+B8","v":8.7999999999999989},0.87499999999999989,{"$f":"((D10-D7)/3)+D8","v":11.866666666666667},null,{"$f":"((F10-F7)/3)+F8","v":7.9333333333333327},0.35,{"$f":"((H10-H7)/3)+H8","v":9.6666666666666679}]
[null,8.9,1,12.2,null,8,0.4,10]
[null,{"$f":"(B10+B12)/2","v":8.9750000000000014},1.125,{"$f":"(D10+D12)/2","v":12.35},null,{"$f":"(F10+F12)/2","v":8.0500000000000007},0.45,{"$f":"(H10+H12)/2","v":10.25}]
[null,{"$f":"(B14+B10)/2","v":9.0500000000000007},1.25,{"$f":"(D14+D10)/2","v":12.5},null,{"$f":"(F14+F10)/2","v":8.1},0.5,{"$f":"(H14+H10)/2","v":10.5}]
[null,{"$f":"(B12+B14)/2","v":9.125},1.375,{"$f":"(D12+D14)/2","v":12.65},null,{"$f":"(F12+F14)/2","v":8.1499999999999986},0.55000000000000004,{"$f":"(H12+H14)/2","v":10.75}]
[null,9.1999999999999993,1.4999999999999998,12.8,null,8.1999999999999993,0.6,11]
[null,{"$f":"(B14+B16)/2","v":9.2749999999999986},1.625,{"$f":"(D14+D16)/2","v":12.950000000000001},null,{"$f":"(F14+F16)/2","v":8.375},0.65,{"$f":"(H14+H16)/2","v":11.3}]
[null,{"$f":"(B18+B14)/2","v":9.35},1.7499999999999998,{"$f":"(D18+D14)/2","v":13.100000000000001},null,{"$f":"(F18+F14)/2","v":8.5500000000000007},0.7,{"$f":"(H18+H14)/2","v":11.6}]
[null,{"$f":"(B16+B18)/2","v":9.4250000000000007},1.875,{"$f":"(D16+D18)/2","v":13.25},null,{"$f":"(F16+F18)/2","v":8.7250000000000014},0.75,{"$f":"(H16+H18)/2","v":11.899999999999999}]
[null,9.5,2,13.4,null,8.9,0.8,12.2]
[null,{"$f":"(B18+B20)/2","v":9.625},2.125,{"$f":"(D18+D20)/2","v":13.55},null,{"$f":"(F18+F20)/2","v":9.0500000000000007},0.85,{"$f":"(H18+H20)/2","v":12.35}]
[null,{"$f":"(B22+B18)/2","v":9.75},2.25,{"$f":"(D22+D18)/2","v":13.7},null,{"$f":"(F22+F18)/2","v":9.1999999999999993},0.9,{"$f":"(H22+H18)/2","v":12.5}]
[null,{"$f":"(B20+B22)/2","v":9.875},2.3749999999999996,{"$f":"(D20+D22)/2","v":13.85},null,{"$f":"(F20+F22)/2","v":9.35},0.95,{"$f":"(H20+H22)/2","v":12.65}]
[null,10,2.5,14,null,9.5,1,12.8]
[null,{"$f":"(B22+B24)/2","v":10.125},2.625,{"$f":"(D22+D24)/2","v":14.3},null,{"$f":"(F22+F24)/2","v":9.625},1.05,{"$f":"(H22+H24)/2","v":12.950000000000001}]
[null,{"$f":"(B26+B22)/2","v":10.25},2.75,{"$f":"(D26+D22)/2","v":14.6},null,{"$f":"(F26+F22)/2","v":9.75},1.1000000000000001,{"$f":"(H26+H22)/2","v":13.100000000000001}]
[null,{"$f":"(B24+B26)/2","v":10.375},2.8749999999999996,{"$f":"(D24+D26)/2","v":14.899999999999999},null,{"$f":"(F24+F26)/2","v":9.875},1.1499999999999999,{"$f":"(H24+H26)/2","v":13.25}]
[null,10.5,2.9999999999999996,15.2,null,10,1.2,13.4]
[null,{"$f":"(B26+B28)/2","v":10.65},3.125,{"$f":"(D26+D28)/2","v":15.5},null,{"$f":"(F26+F28)/2","v":10.125},1.25,{"$f":"(H26+H28)/2","v":13.55}]
[null,{"$f":"(B30+B26)/2","v":10.8},3.25,{"$f":"(D30+D26)/2","v":15.799999999999999},null,{"$f":"(F30+F26)/2","v":10.25},1.3,{"$f":"(H30+H26)/2","v":13.7}]
[null,{"$f":"(B28+B30)/2","v":10.95},3.375,{"$f":"(D28+D30)/2","v":16.099999999999998},null,{"$f":"(F28+F30)/2","v":10.375},1.35,{"$f":"(H28+H30)/2","v":13.85}]
[null,11.1,3.4999999999999996,16.399999999999999,null,10.5,1.4,14]
[null,{"$f":"(B30+B32)/2","v":11.25},3.6249999999999996,{"$f":"(D30+D32)/2","v":16.7},null,{"$f":"(F30+F32)/2","v":10.65},1.45,{"$f":"(H30+H32)/2","v":14.3}]
[null,{"$f":"(B34+B30)/2","v":11.399999999999999},3.75,{"$f":"(D34+D30)/2","v":17},null,{"$f":"(F34+F30)/2","v":10.8},1.5,{"$f":"(H34+H30)/2","v":14.6}]
[null,{"$f":"(B32+B34)/2","v":11.549999999999999},3.875,{"$f":"(D32+D34)/2","v":17.3},null,{"$f":"(F32+F34)/2","v":10.95},1.55,{"$f":"(H32+H34)/2","v":14.899999999999999}]
[null,11.7,4,17.600000000000001,null,11.1,1.6,15.2]
[null,{"$f":"(B34+B36)/2","v":11.85},4.1249999999999991,{"$f":"(D34+D36)/2","v":17.900000000000002},null,{"$f":"(F34+F36)/2","v":11.25},1.65,{"$f":"(H34+H36)/2","v":15.5}]
[null,{"$f":"(B38+B34)/2","v":12},4.25,{"$f":"(D38+D34)/2","v":18.200000000000003},null,{"$f":"(F38+F34)/2","v":11.399999999999999},1.7,{"$f":"(H38+H34)/2","v":15.799999999999999}]
[null,{"$f":"(B36+B38)/2","v":12.15},4.375,{"$f":"(D36+D38)/2","v":18.5},null,{"$f":"(F36+F38)/2","v":11.549999999999999},1.75,{"$f":"(H36+H38)/2","v":16.099999999999998}]
[null,12.3,4.5,18.8,null,11.7,1.8,16.399999999999999]
[null,{"$f":"(B38+B40)/2","v":12.450000000000001},4.625,{"$f":"(D38+D40)/2","v":19.100000000000001},null,{"$f":"(F38+F40)/2","v":11.85},1.85,{"$f":"(H38+H40)/2","v":16.7}]
[null,{"$f":"(B42+B38)/2","v":12.600000000000001},4.7499999999999991,{"$f":"(D42+D38)/2","v":19.399999999999999},null,{"$f":"(F42+F38)/2","v":12},1.9,{"$f":"(H42+H38)/2","v":17}]
{"$rows_left_out":42}