{"text_format":"1","workbook":"xlsx","n_sheets":4,"sheets":["Accueil","Evaluation","Barèmes & Options","Présentation des profils"],"not_rendered":{"charts":0,"images":1,"macros":1,"external_links":0,"defined_names":393,"comments":1,"pivot_tables":0},"unopened":[],"bounds":{"document_bytes":16777216,"sheet_cells":100000,"rows_first":2000,"rows_last":500,"rows_between":2000,"halvings":0,"cell_chars":16384,"cell_head_chars":4096},"cells_cut":0,"cells_raw":0,"read":"whole","date_system":"1900"}

{"sheet":"Accueil","index":0,"n_rows":0,"n_cols":0,"rows_kept":0,"cut":false,"hidden":false,"merged":[]}

{"sheet":"Evaluation","index":1,"n_rows":101,"n_cols":37,"rows_kept":101,"cut":false,"hidden":false,"merged":[[0,0,0,28]]}
["Course de demi-fond Bac GT - N4 - 2018"]
[]
["Nom","Prénom","Sexe F ou M","Classe","Profil choisi","Projet C1","500-1","Ecart","Profil si régulation","profil choisi","500-2","500-3","Temps Total","c2-c1","c3-c2","c3-c1","respect c1-c2=","respect c1-c2+","respect c1-c2-","respect C2-C3=","respect C2-C3+","respect C2-C3-","Respect Profile 9","points respect","points profil","Point projet C1","Points perf","Points echauffement","Note",null,null,null,null,null,"Sexe"]
[null,null,null,null,null,null,null,{"$f":"IF(OR(F4=\"\",G4=\"\"),\"\",ABS((INT(G4)*60)+((G4-INT(G4))*100)-((INT(F4)*60)+((F4-INT(F4))*100))))","v":""},null,{"$f":"IF(AND(E4=\"\",I4=\"\"),\"\",IF(I4=\"\",E4,I4))","v":""},null,null,{"$f":"IF(AND(L4<>\"\",K4<>\"\",G4<>\"\"),INT(((INT($G4)*60)+(($G4-INT($G4))*100)+(INT($K4)*60)+(($K4-INT($K4))*100)+(INT($L4)*60)+(($L4-INT($L4))*100))/60)+MOD(((INT($G4)*60)+(($G4-INT($G4))*100)+(INT($K4)*60)+(($K4-INT($K4))*100)+(INT($L4)*60)+(($L4-INT($L4))*100)),60)/100,\"\")","v":""},{"$f":"(INT(K4)*60)+((K4-INT(K4))*100)-((INT(G4)*60)+((G4-INT(G4))*100))","v":0},{"$f":"(INT(L4)*60)+((L4-INT(L4))*100)-((INT(K4)*60)+((K4-INT(K4))*100))","v":0},{"$f":"(INT(L4)*60)+((L4-INT(L4))*100)-((INT(G4)*60)+((G4-INT(G4))*100))","v":0},{"$f":"IF(AND(K4<>0,G4<>0),IF(OR(J4=1,J4=3,J4=4),IF(OR(N4=0,ABS(N4)<='Barèmes & Options'!H$2),1,0)),\"\")","v":""},{"$f":"IF(AND(K4<>\"\",G4<>\"\"),IF(OR(J4=5,J4=7),IF(OR(N4>0,N4+'Barèmes & Options'!H$2>0),1,0)),\"\")","v":""},{"$f":"IF(AND(K4<>\"\",G4<>\"\"),IF(OR(J4=2,J4=6,J4=8),IF(OR(N4<0,N4-'Barèmes & Options'!H$2<0),1,0)),\"\")","v":""},{"$f":"IF(AND(K4<>0,L4<>0),IF(OR(J4=1,J4=5,J4=6),IF(OR(O4=0,ABS(O4)<='Barèmes & Options'!H$2),1,0)),\"\")","v":""},{"$f":"IF(AND(K4<>\"\",L4<>\"\"),IF(OR(J4=4,J4=8),IF(OR(O4>0,O4+'Barèmes & Options'!H$2>0),1,0)),\"\")","v":""},{"$f":"IF(AND(K4<>\"\",L4<>\"\"),IF(OR(J4=2,J4=3,J4=7),IF(OR(O4<0,O4-'Barèmes & Options'!H$2<0),1,0)),\"\")","v":""},{"$f":"IF(SUM(Q4:V4)=2,IF(J4=2,IF(J4=2,IF(P4-'Barèmes & Options'!H$2<-1,0,1)),\"\"),0)","v":0},{"$f":"IF(OR(J4=2,J4=9),SUM(Q4:V4)-W4,SUM(Q4:V4))","v":0},{"$f":"IF(J4<>\"\",IF(AND(J4>=1,J4<=8,J4=ABS(J4)),IF(AND(J4<=9,J4>=1),IF(AND(X4=1,I4<>\"\"),1,IF(AND(X4=1,I4=\"\"),2,IF(AND(X4=2,I4<>\"\"),2.5,IF(AND(X4=2,I4=\"\"),3,0)))),\"\"),\"Err. Profil\"),\"\")","v":""},{"$f":"IF(F4<>\"\",IF(H4<=3,1,0),\"\")","v":""},{"$f":"IF(AND(L4>0,K4>0,G4>0),IF($C4=\"\",\"\",IF($C4=\"F\",VLOOKUP($M4,Barème500,3),VLOOKUP($M4,Barème500,2))),\"\")","v":""},null,{"$f":"IF(OR(AB3=\"\",AB4=\"\",AA4=\"\",Z4=\"\",Y4=\"\"),\"\",IF(OR(AB4<0,AB4>2),\"Err ech.\",SUM(AB4,AA4,Z4,Y4)))","v":""},null,"Moyenne F. :",{"$f":"IF(ISERROR(AJ4),\"\",AJ4)","v":""},null,null,{"$f":"IF(C4<>\"f\",\"m\",\"f\")","v":"m"},{"$f":"AVERAGEIF(AI4:AI101,\"f\",AC4:AC101)","v":{"$error":"#DIV/0!"}},"filles"]
[null,null,null,null,null,null,null,{"$f":"IF(OR(F5=\"\",G5=\"\"),\"\",ABS((INT(G5)*60)+((G5-INT(G5))*100)-((INT(F5)*60)+((F5-INT(F5))*100))))","v":""},null,{"$f":"IF(AND(E5=\"\",I5=\"\"),\"\",IF(I5=\"\",E5,I5))","v":""},null,null,{"$f":"IF(AND(L5<>\"\",K5<>\"\",G5<>\"\"),INT(((INT($G5)*60)+(($G5-INT($G5))*100)+(INT($K5)*60)+(($K5-INT($K5))*100)+(INT($L5)*60)+(($L5-INT($L5))*100))/60)+MOD(((INT($G5)*60)+(($G5-INT($G5))*100)+(INT($K5)*60)+(($K5-INT($K5))*100)+(INT($L5)*60)+(($L5-INT($L5))*100)),60)/100,\"\")","v":""},{"$f":"(INT(K5)*60)+((K5-INT(K5))*100)-((INT(G5)*60)+((G5-INT(G5))*100))","v":0},{"$f":"(INT(L5)*60)+((L5-INT(L5))*100)-((INT(K5)*60)+((K5-INT(K5))*100))","v":0},{"$f":"(INT(L5)*60)+((L5-INT(L5))*100)-((INT(G5)*60)+((G5-INT(G5))*100))","v":0},{"$f":"IF(AND(K5<>0,G5<>0),IF(OR(J5=1,J5=3,J5=4),IF(OR(N5=0,ABS(N5)<='Barèmes & Options'!H$2),1,0)),\"\")","v":""},{"$f":"IF(AND(K5<>\"\",G5<>\"\"),IF(OR(J5=5,J5=7),IF(OR(N5>0,N5+'Barèmes & Options'!H$2>0),1,0)),\"\")","v":""},{"$f":"IF(AND(K5<>\"\",G5<>\"\"),IF(OR(J5=2,J5=6,J5=8),IF(OR(N5<0,N5-'Barèmes & Options'!H$2<0),1,0)),\"\")","v":""},{"$f":"IF(AND(K5<>0,L5<>0),IF(OR(J5=1,J5=5,J5=6),IF(OR(O5=0,ABS(O5)<='Barèmes & Options'!H$2),1,0)),\"\")","v":""},{"$f":"IF(AND(K5<>\"\",L5<>\"\"),IF(OR(J5=4,J5=8),IF(OR(O5>0,O5+'Barèmes & Options'!H$2>0),1,0)),\"\")","v":""},{"$f":"IF(AND(K5<>\"\",L5<>\"\"),IF(OR(J5=2,J5=3,J5=7),IF(OR(O5<0,O5-'Barèmes & Options'!H$2<0),1,0)),\"\")","v":""},{"$f":"IF(SUM(Q5:V5)=2,IF(J5=2,IF(J5=2,IF(P5-'Barèmes & Options'!H$2<-1,0,1)),\"\"),0)","v":0},{"$f":"IF(OR(J5=2,J5=9),SUM(Q5:V5)-W5,SUM(Q5:V5))","v":0},{"$f":"IF(J5<>\"\",IF(AND(J5>=1,J5<=8,J5=ABS(J5)),IF(AND(J5<=9,J5>=1),IF(AND(X5=1,I5<>\"\"),1,IF(AND(X5=1,I5=\"\"),2,IF(AND(X5=2,I5<>\"\"),2.5,IF(AND(X5=2,I5=\"\"),3,0)))),\"\"),\"Err. Profil\"),\"\")","v":""},"","",null,{"$f":"IF(OR(AB4=\"\",AB5=\"\",AA5=\"\",Z5=\"\",Y5=\"\"),\"\",IF(OR(AB5<0,AB5>2),\"Err ech.\",SUM(AB5,AA5,Z5,Y5)))","v":""},null,"moyenne G. :",{"$f":"IF(ISERROR(AJ5),\"\",AJ5)","v":""},null,null,"m",{"$f":"AVERAGEIF(AI4:AI101,\"m\",AC4:AC101)","v":{"$error":"#DIV/0!"}},"garçons"]
[null,null,null,null,null,null,null,"",null,"",null,null,"",0,0,0,{"$f":"IF(AND(K6<>0,G6<>0),IF(OR(J6=1,J6=3,J6=4),IF(OR(N6=0,ABS(N6)<='Barèmes & Options'!H$2),1,0)),\"\")","v":""},{"$f":"IF(AND(K6<>\"\",G6<>\"\"),IF(OR(J6=5,J6=7),IF(OR(N6>0,N6+'Barèmes & Options'!H$2>0),1,0)),\"\")","v":""},{"$f":"IF(AND(K6<>\"\",G6<>\"\"),IF(OR(J6=2,J6=6,J6=8),IF(OR(N6<0,N6-'Barèmes & Options'!H$2<0),1,0)),\"\")","v":""},{"$f":"IF(AND(K6<>0,L6<>0),IF(OR(J6=1,J6=5,J6=6),IF(OR(O6=0,ABS(O6)<='Barèmes & Options'!H$2),1,0)),\"\")","v":""},{"$f":"IF(AND(K6<>\"\",L6<>\"\"),IF(OR(J6=4,J6=8),IF(OR(O6>0,O6+'Barèmes & Options'!H$2>0),1,0)),\"\")","v":""},{"$f":"IF(AND(K6<>\"\",L6<>\"\"),IF(OR(J6=2,J6=3,J6=7),IF(OR(O6<0,O6-'Barèmes & Options'!H$2<0),1,0)),\"\")","v":""},{"$f":"IF(SUM(Q6:V6)=2,IF(J6=2,IF(J6=2,IF(P6-'Barèmes & Options'!H$2<-1,0,1)),\"\"),0)","v":0},0,"","","",null,"",null,"Moyenne :",{"$f":"IF(ISERROR(AJ6),\"\",AJ6)","v":""},null,null,"m",{"$f":"AVERAGE(AC4:AC101)","v":{"$error":"#DIV/0!"}},"géné"]
[null,null,null,null,null,null,null,"",null,"",null,null,"",0,0,0,{"$f":"IF(AND(K7<>0,G7<>0),IF(OR(J7=1,J7=3,J7=4),IF(OR(N7=0,ABS(N7)<='Barèmes & Options'!H$2),1,0)),\"\")","v":""},{"$f":"IF(AND(K7<>\"\",G7<>\"\"),IF(OR(J7=5,J7=7),IF(OR(N7>0,N7+'Barèmes & Options'!H$2>0),1,0)),\"\")","v":""},{"$f":"IF(AND(K7<>\"\",G7<>\"\"),IF(OR(J7=2,J7=6,J7=8),IF(OR(N7<0,N7-'Barèmes & Options'!H$2<0),1,0)),\"\")","v":""},{"$f":"IF(AND(K7<>0,L7<>0),IF(OR(J7=1,J7=5,J7=6),IF(OR(O7=0,ABS(O7)<='Barèmes & Options'!H$2),1,0)),\"\")","v":""},{"$f":"IF(AND(K7<>\"\",L7<>\"\"),IF(OR(J7=4,J7=8),IF(OR(O7>0,O7+'Barèmes & Options'!H$2>0),1,0)),\"\")","v":""},{"$f":"IF(AND(K7<>\"\",L7<>\"\"),IF(OR(J7=2,J7=3,J7=7),IF(OR(O7<0,O7-'Barèmes & Options'!H$2<0),1,0)),\"\")","v":""},{"$f":"IF(SUM(Q7:V7)=2,IF(J7=2,IF(J7=2,IF(P7-'Barèmes & Options'!H$2<-1,0,1)),\"\"),0)","v":0},0,"","","",null,"",null,"Note max :",{"$f":"IF(COUNT(AC4:AC101)>0,MAX(AC4:AC101),\"\")","v":""},null,null,"m"]
[null,null,null,null,null,null,null,"",null,"",null,null,"",0,0,0,{"$f":"IF(AND(K8<>0,G8<>0),IF(OR(J8=1,J8=3,J8=4),IF(OR(N8=0,ABS(N8)<='Barèmes & Options'!H$2),1,0)),\"\")","v":""},{"$f":"IF(AND(K8<>\"\",G8<>\"\"),IF(OR(J8=5,J8=7),IF(OR(N8>0,N8+'Barèmes & Options'!H$2>0),1,0)),\"\")","v":""},{"$f":"IF(AND(K8<>\"\",G8<>\"\"),IF(OR(J8=2,J8=6,J8=8),IF(OR(N8<0,N8-'Barèmes & Options'!H$2<0),1,0)),\"\")","v":""},{"$f":"IF(AND(K8<>0,L8<>0),IF(OR(J8=1,J8=5,J8=6),IF(OR(O8=0,ABS(O8)<='Barèmes & Options'!H$2),1,0)),\"\")","v":""},{"$f":"IF(AND(K8<>\"\",L8<>\"\"),IF(OR(J8=4,J8=8),IF(OR(O8>0,O8+'Barèmes & Options'!H$2>0),1,0)),\"\")","v":""},{"$f":"IF(AND(K8<>\"\",L8<>\"\"),IF(OR(J8=2,J8=3,J8=7),IF(OR(O8<0,O8-'Barèmes & Options'!H$2<0),1,0)),\"\")","v":""},{"$f":"IF(SUM(Q8:V8)=2,IF(J8=2,IF(J8=2,IF(P8-'Barèmes & Options'!H$2<-1,0,1)),\"\"),0)","v":0},0,"","","",null,"",null,"Note min :",{"$f":"IF(COUNT(AC4:AC101)>0,MIN(AC4:AC101),\"\")","v":""},null,null,"m"]
[null,null,null,null,null,null,null,null,null,null,null,null,"",0,0,0,{"$f":"IF(AND(K9<>0,G9<>0),IF(OR(J9=1,J9=3,J9=4),IF(OR(N9=0,ABS(N9)<='Barèmes & Options'!H$2),1,0)),\"\")","v":""},{"$f":"IF(AND(K9<>\"\",G9<>\"\"),IF(OR(J9=5,J9=7),IF(OR(N9>0,N9+'Barèmes & Options'!H$2>0),1,0)),\"\")","v":""},{"$f":"IF(AND(K9<>\"\",G9<>\"\"),IF(OR(J9=2,J9=6,J9=8),IF(OR(N9<0,N9-'Barèmes & Options'!H$2<0),1,0)),\"\")","v":""},{"$f":"IF(AND(K9<>0,L9<>0),IF(OR(J9=1,J9=5,J9=6),IF(OR(O9=0,ABS(O9)<='Barèmes & Options'!H$2),1,0)),\"\")","v":""},{"$f":"IF(AND(K9<>\"\",L9<>\"\"),IF(OR(J9=4,J9=8),IF(OR(O9>0,O9+'Barèmes & Options'!H$2>0),1,0)),\"\")","v":""},{"$f":"IF(AND(K9<>\"\",L9<>\"\"),IF(OR(J9=2,J9=3,J9=7),IF(OR(O9<0,O9-'Barèmes & Options'!H$2<0),1,0)),\"\")","v":""},{"$f":"IF(SUM(Q9:V9)=2,IF(J9=2,IF(J9=2,IF(P9-'Barèmes & Options'!H$2<-1,0,1)),\"\"),0)","v":0},0,"","","",null,"",null,null,null,null,null,"m"]
[null,null,null,null,null,null,null,null,null,null,null,null,"",0,0,0,{"$f":"IF(AND(K10<>0,G10<>0),IF(OR(J10=1,J10=3,J10=4),IF(OR(N10=0,ABS(N10)<='Barèmes & Options'!H$2),1,0)),\"\")","v":""},{"$f":"IF(AND(K10<>\"\",G10<>\"\"),IF(OR(J10=5,J10=7),IF(OR(N10>0,N10+'Barèmes & Options'!H$2>0),1,0)),\"\")","v":""},{"$f":"IF(AND(K10<>\"\",G10<>\"\"),IF(OR(J10=2,J10=6,J10=8),IF(OR(N10<0,N10-'Barèmes & Options'!H$2<0),1,0)),\"\")","v":""},{"$f":"IF(AND(K10<>0,L10<>0),IF(OR(J10=1,J10=5,J10=6),IF(OR(O10=0,ABS(O10)<='Barèmes & Options'!H$2),1,0)),\"\")","v":""},{"$f":"IF(AND(K10<>\"\",L10<>\"\"),IF(OR(J10=4,J10=8),IF(OR(O10>0,O10+'Barèmes & Options'!H$2>0),1,0)),\"\")","v":""},{"$f":"IF(AND(K10<>\"\",L10<>\"\"),IF(OR(J10=2,J10=3,J10=7),IF(OR(O10<0,O10-'Barèmes & Options'!H$2<0),1,0)),\"\")","v":""},{"$f":"IF(SUM(Q10:V10)=2,IF(J10=2,IF(J10=2,IF(P10-'Barèmes & Options'!H$2<-1,0,1)),\"\"),0)","v":0},0,"","","",null,"",null,"Date :",null,null,null,"m"]
[null,null,null,null,null,null,null,null,null,null,null,null,"",0,0,0,{"$f":"IF(AND(K11<>0,G11<>0),IF(OR(J11=1,J11=3,J11=4),IF(OR(N11=0,ABS(N11)<='Barèmes & Options'!H$2),1,0)),\"\")","v":""},{"$f":"IF(AND(K11<>\"\",G11<>\"\"),IF(OR(J11=5,J11=7),IF(OR(N11>0,N11+'Barèmes & Options'!H$2>0),1,0)),\"\")","v":""},{"$f":"IF(AND(K11<>\"\",G11<>\"\"),IF(OR(J11=2,J11=6,J11=8),IF(OR(N11<0,N11-'Barèmes & Options'!H$2<0),1,0)),\"\")","v":""},{"$f":"IF(AND(K11<>0,L11<>0),IF(OR(J11=1,J11=5,J11=6),IF(OR(O11=0,ABS(O11)<='Barèmes & Options'!H$2),1,0)),\"\")","v":""},{"$f":"IF(AND(K11<>\"\",L11<>\"\"),IF(OR(J11=4,J11=8),IF(OR(O11>0,O11+'Barèmes & Options'!H$2>0),1,0)),\"\")","v":""},{"$f":"IF(AND(K11<>\"\",L11<>\"\"),IF(OR(J11=2,J11=3,J11=7),IF(OR(O11<0,O11-'Barèmes & Options'!H$2<0),1,0)),\"\")","v":""},{"$f":"IF(SUM(Q11:V11)=2,IF(J11=2,IF(J11=2,IF(P11-'Barèmes & Options'!H$2<-1,0,1)),\"\"),0)","v":0},0,"","","",null,"",null,null,null,null,null,"m"]
[null,null,null,null,null,null,null,null,null,null,null,null,"",0,0,0,{"$f":"IF(AND(K12<>0,G12<>0),IF(OR(J12=1,J12=3,J12=4),IF(OR(N12=0,ABS(N12)<='Barèmes & Options'!H$2),1,0)),\"\")","v":""},{"$f":"IF(AND(K12<>\"\",G12<>\"\"),IF(OR(J12=5,J12=7),IF(OR(N12>0,N12+'Barèmes & Options'!H$2>0),1,0)),\"\")","v":""},{"$f":"IF(AND(K12<>\"\",G12<>\"\"),IF(OR(J12=2,J12=6,J12=8),IF(OR(N12<0,N12-'Barèmes & Options'!H$2<0),1,0)),\"\")","v":""},{"$f":"IF(AND(K12<>0,L12<>0),IF(OR(J12=1,J12=5,J12=6),IF(OR(O12=0,ABS(O12)<='Barèmes & Options'!H$2),1,0)),\"\")","v":""},{"$f":"IF(AND(K12<>\"\",L12<>\"\"),IF(OR(J12=4,J12=8),IF(OR(O12>0,O12+'Barèmes & Options'!H$2>0),1,0)),\"\")","v":""},{"$f":"IF(AND(K12<>\"\",L12<>\"\"),IF(OR(J12=2,J12=3,J12=7),IF(OR(O12<0,O12-'Barèmes & Options'!H$2<0),1,0)),\"\")","v":""},{"$f":"IF(SUM(Q12:V12)=2,IF(J12=2,IF(J12=2,IF(P12-'Barèmes & Options'!H$2<-1,0,1)),\"\"),0)","v":0},0,"","","",null,"",null,null,null,null,null,"m"]
[null,null,null,null,null,null,null,null,null,null,null,null,"",0,0,0,{"$f":"IF(AND(K13<>0,G13<>0),IF(OR(J13=1,J13=3,J13=4),IF(OR(N13=0,ABS(N13)<='Barèmes & Options'!H$2),1,0)),\"\")","v":""},{"$f":"IF(AND(K13<>\"\",G13<>\"\"),IF(OR(J13=5,J13=7),IF(OR(N13>0,N13+'Barèmes & Options'!H$2>0),1,0)),\"\")","v":""},{"$f":"IF(AND(K13<>\"\",G13<>\"\"),IF(OR(J13=2,J13=6,J13=8),IF(OR(N13<0,N13-'Barèmes & Options'!H$2<0),1,0)),\"\")","v":""},{"$f":"IF(AND(K13<>0,L13<>0),IF(OR(J13=1,J13=5,J13=6),IF(OR(O13=0,ABS(O13)<='Barèmes & Options'!H$2),1,0)),\"\")","v":""},{"$f":"IF(AND(K13<>\"\",L13<>\"\"),IF(OR(J13=4,J13=8),IF(OR(O13>0,O13+'Barèmes & Options'!H$2>0),1,0)),\"\")","v":""},{"$f":"IF(AND(K13<>\"\",L13<>\"\"),IF(OR(J13=2,J13=3,J13=7),IF(OR(O13<0,O13-'Barèmes & Options'!H$2<0),1,0)),\"\")","v":""},{"$f":"IF(SUM(Q13:V13)=2,IF(J13=2,IF(J13=2,IF(P13-'Barèmes & Options'!H$2<-1,0,1)),\"\"),0)","v":0},0,"","","",null,"",null,null,null,null,null,"m"]
[null,null,null,null,null,null,null,null,null,null,null,null,"",0,0,0,{"$f":"IF(AND(K14<>0,G14<>0),IF(OR(J14=1,J14=3,J14=4),IF(OR(N14=0,ABS(N14)<='Barèmes & Options'!H$2),1,0)),\"\")","v":""},{"$f":"IF(AND(K14<>\"\",G14<>\"\"),IF(OR(J14=5,J14=7),IF(OR(N14>0,N14+'Barèmes & Options'!H$2>0),1,0)),\"\")","v":""},{"$f":"IF(AND(K14<>\"\",G14<>\"\"),IF(OR(J14=2,J14=6,J14=8),IF(OR(N14<0,N14-'Barèmes & Options'!H$2<0),1,0)),\"\")","v":""},{"$f":"IF(AND(K14<>0,L14<>0),IF(OR(J14=1,J14=5,J14=6),IF(OR(O14=0,ABS(O14)<='Barèmes & Options'!H$2),1,0)),\"\")","v":""},{"$f":"IF(AND(K14<>\"\",L14<>\"\"),IF(OR(J14=4,J14=8),IF(OR(O14>0,O14+'Barèmes & Options'!H$2>0),1,0)),\"\")","v":""},{"$f":"IF(AND(K14<>\"\",L14<>\"\"),IF(OR(J14=2,J14=3,J14=7),IF(OR(O14<0,O14-'Barèmes & Options'!H$2<0),1,0)),\"\")","v":""},{"$f":"IF(SUM(Q14:V14)=2,IF(J14=2,IF(J14=2,IF(P14-'Barèmes & Options'!H$2<-1,0,1)),\"\"),0)","v":0},0,"","","",null,"",null,null,null,null,null,"m"]
[null,null,null,null,null,null,null,null,null,null,null,null,"",0,0,0,{"$f":"IF(AND(K15<>0,G15<>0),IF(OR(J15=1,J15=3,J15=4),IF(OR(N15=0,ABS(N15)<='Barèmes & Options'!H$2),1,0)),\"\")","v":""},{"$f":"IF(AND(K15<>\"\",G15<>\"\"),IF(OR(J15=5,J15=7),IF(OR(N15>0,N15+'Barèmes & Options'!H$2>0),1,0)),\"\")","v":""},{"$f":"IF(AND(K15<>\"\",G15<>\"\"),IF(OR(J15=2,J15=6,J15=8),IF(OR(N15<0,N15-'Barèmes & Options'!H$2<0),1,0)),\"\")","v":""},{"$f":"IF(AND(K15<>0,L15<>0),IF(OR(J15=1,J15=5,J15=6),IF(OR(O15=0,ABS(O15)<='Barèmes & Options'!H$2),1,0)),\"\")","v":""},{"$f":"IF(AND(K15<>\"\",L15<>\"\"),IF(OR(J15=4,J15=8),IF(OR(O15>0,O15+'Barèmes & Options'!H$2>0),1,0)),\"\")","v":""},{"$f":"IF(AND(K15<>\"\",L15<>\"\"),IF(OR(J15=2,J15=3,J15=7),IF(OR(O15<0,O15-'Barèmes & Options'!H$2<0),1,0)),\"\")","v":""},{"$f":"IF(SUM(Q15:V15)=2,IF(J15=2,IF(J15=2,IF(P15-'Barèmes & Options'!H$2<-1,0,1)),\"\"),0)","v":0},0,"","","",null,"",null,null,null,null,null,"m"]
[null,null,null,null,null,null,null,null,null,null,null,null,"",0,0,0,{"$f":"IF(AND(K16<>0,G16<>0),IF(OR(J16=1,J16=3,J16=4),IF(OR(N16=0,ABS(N16)<='Barèmes & Options'!H$2),1,0)),\"\")","v":""},{"$f":"IF(AND(K16<>\"\",G16<>\"\"),IF(OR(J16=5,J16=7),IF(OR(N16>0,N16+'Barèmes & Options'!H$2>0),1,0)),\"\")","v":""},{"$f":"IF(AND(K16<>\"\",G16<>\"\"),IF(OR(J16=2,J16=6,J16=8),IF(OR(N16<0,N16-'Barèmes & Options'!H$2<0),1,0)),\"\")","v":""},{"$f":"IF(AND(K16<>0,L16<>0),IF(OR(J16=1,J16=5,J16=6),IF(OR(O16=0,ABS(O16)<='Barèmes & Options'!H$2),1,0)),\"\")","v":""},{"$f":"IF(AND(K16<>\"\",L16<>\"\"),IF(OR(J16=4,J16=8),IF(OR(O16>0,O16+'Barèmes & Options'!H$2>0),1,0)),\"\")","v":""},{"$f":"IF(AND(K16<>\"\",L16<>\"\"),IF(OR(J16=2,J16=3,J16=7),IF(OR(O16<0,O16-'Barèmes & Options'!H$2<0),1,0)),\"\")","v":""},{"$f":"IF(SUM(Q16:V16)=2,IF(J16=2,IF(J16=2,IF(P16-'Barèmes & Options'!H$2<-1,0,1)),\"\"),0)","v":0},0,"","","",null,"",null,null,null,null,null,"m"]
[null,null,null,null,null,null,null,null,null,null,null,null,"",0,0,0,{"$f":"IF(AND(K17<>0,G17<>0),IF(OR(J17=1,J17=3,J17=4),IF(OR(N17=0,ABS(N17)<='Barèmes & Options'!H$2),1,0)),\"\")","v":""},{"$f":"IF(AND(K17<>\"\",G17<>\"\"),IF(OR(J17=5,J17=7),IF(OR(N17>0,N17+'Barèmes & Options'!H$2>0),1,0)),\"\")","v":""},{"$f":"IF(AND(K17<>\"\",G17<>\"\"),IF(OR(J17=2,J17=6,J17=8),IF(OR(N17<0,N17-'Barèmes & Options'!H$2<0),1,0)),\"\")","v":""},{"$f":"IF(AND(K17<>0,L17<>0),IF(OR(J17=1,J17=5,J17=6),IF(OR(O17=0,ABS(O17)<='Barèmes & Options'!H$2),1,0)),\"\")","v":""},{"$f":"IF(AND(K17<>\"\",L17<>\"\"),IF(OR(J17=4,J17=8),IF(OR(O17>0,O17+'Barèmes & Options'!H$2>0),1,0)),\"\")","v":""},{"$f":"IF(AND(K17<>\"\",L17<>\"\"),IF(OR(J17=2,J17=3,J17=7),IF(OR(O17<0,O17-'Barèmes & Options'!H$2<0),1,0)),\"\")","v":""},{"$f":"IF(SUM(Q17:V17)=2,IF(J17=2,IF(J17=2,IF(P17-'Barèmes & Options'!H$2<-1,0,1)),\"\"),0)","v":0},0,"","","",null,"",null,null,null,null,null,"m"]
[null,null,null,null,null,null,null,null,null,null,null,null,"",0,0,0,{"$f":"IF(AND(K18<>0,G18<>0),IF(OR(J18=1,J18=3,J18=4),IF(OR(N18=0,ABS(N18)<='Barèmes & Options'!H$2),1,0)),\"\")","v":""},{"$f":"IF(AND(K18<>\"\",G18<>\"\"),IF(OR(J18=5,J18=7),IF(OR(N18>0,N18+'Barèmes & Options'!H$2>0),1,0)),\"\")","v":""},{"$f":"IF(AND(K18<>\"\",G18<>\"\"),IF(OR(J18=2,J18=6,J18=8),IF(OR(N18<0,N18-'Barèmes & Options'!H$2<0),1,0)),\"\")","v":""},{"$f":"IF(AND(K18<>0,L18<>0),IF(OR(J18=1,J18=5,J18=6),IF(OR(O18=0,ABS(O18)<='Barèmes & Options'!H$2),1,0)),\"\")","v":""},{"$f":"IF(AND(K18<>\"\",L18<>\"\"),IF(OR(J18=4,J18=8),IF(OR(O18>0,O18+'Barèmes & Options'!H$2>0),1,0)),\"\")","v":""},{"$f":"IF(AND(K18<>\"\",L18<>\"\"),IF(OR(J18=2,J18=3,J18=7),IF(OR(O18<0,O18-'Barèmes & Options'!H$2<0),1,0)),\"\")","v":""},{"$f":"IF(SUM(Q18:V18)=2,IF(J18=2,IF(J18=2,IF(P18-'Barèmes & Options'!H$2<-1,0,1)),\"\"),0)","v":0},0,"","","",null,"",null,null,null,null,null,"m"]
[null,null,null,null,null,null,null,null,null,null,null,null,"",0,0,0,{"$f":"IF(AND(K19<>0,G19<>0),IF(OR(J19=1,J19=3,J19=4),IF(OR(N19=0,ABS(N19)<='Barèmes & Options'!H$2),1,0)),\"\")","v":""},{"$f":"IF(AND(K19<>\"\",G19<>\"\"),IF(OR(J19=5,J19=7),IF(OR(N19>0,N19+'Barèmes & Options'!H$2>0),1,0)),\"\")","v":""},{"$f":"IF(AND(K19<>\"\",G19<>\"\"),IF(OR(J19=2,J19=6,J19=8),IF(OR(N19<0,N19-'Barèmes & Options'!H$2<0),1,0)),\"\")","v":""},{"$f":"IF(AND(K19<>0,L19<>0),IF(OR(J19=1,J19=5,J19=6),IF(OR(O19=0,ABS(O19)<='Barèmes & Options'!H$2),1,0)),\"\")","v":""},{"$f":"IF(AND(K19<>\"\",L19<>\"\"),IF(OR(J19=4,J19=8),IF(OR(O19>0,O19+'Barèmes & Options'!H$2>0),1,0)),\"\")","v":""},{"$f":"IF(AND(K19<>\"\",L19<>\"\"),IF(OR(J19=2,J19=3,J19=7),IF(OR(O19<0,O19-'Barèmes & Options'!H$2<0),1,0)),\"\")","v":""},{"$f":"IF(SUM(Q19:V19)=2,IF(J19=2,IF(J19=2,IF(P19-'Barèmes & Options'!H$2<-1,0,1)),\"\"),0)","v":0},0,"","","",null,"",null,null,null,null,null,"m"]
[null,null,null,null,null,null,null,null,null,null,null,null,"",0,0,0,{"$f":"IF(AND(K20<>0,G20<>0),IF(OR(J20=1,J20=3,J20=4),IF(OR(N20=0,ABS(N20)<='Barèmes & Options'!H$2),1,0)),\"\")","v":""},{"$f":"IF(AND(K20<>\"\",G20<>\"\"),IF(OR(J20=5,J20=7),IF(OR(N20>0,N20+'Barèmes & Options'!H$2>0),1,0)),\"\")","v":""},{"$f":"IF(AND(K20<>\"\",G20<>\"\"),IF(OR(J20=2,J20=6,J20=8),IF(OR(N20<0,N20-'Barèmes & Options'!H$2<0),1,0)),\"\")","v":""},{"$f":"IF(AND(K20<>0,L20<>0),IF(OR(J20=1,J20=5,J20=6),IF(OR(O20=0,ABS(O20)<='Barèmes & Options'!H$2),1,0)),\"\")","v":""},{"$f":"IF(AND(K20<>\"\",L20<>\"\"),IF(OR(J20=4,J20=8),IF(OR(O20>0,O20+'Barèmes & Options'!H$2>0),1,0)),\"\")","v":""},{"$f":"IF(AND(K20<>\"\",L20<>\"\"),IF(OR(J20=2,J20=3,J20=7),IF(OR(O20<0,O20-'Barèmes & Options'!H$2<0),1,0)),\"\")","v":""},{"$f":"IF(SUM(Q20:V20)=2,IF(J20=2,IF(J20=2,IF(P20-'Barèmes & Options'!H$2<-1,0,1)),\"\"),0)","v":0},0,"","","",null,"",null,null,null,null,null,"m"]
{"$rows_left_out":82}
{"sheet":"Barèmes & Options","index":2,"n_rows":218,"n_cols":8,"rows_kept":218,"cut":false,"hidden":false,"merged":[[0,0,0,2]]}
["Barème 1500"]
["temps","G","F",null,null,null,"Tolérance En sec. :",1]
[3,14,14]
[4.0999999999999996,14,14]
[4.1100000000000003,13.9,14]
[4.12,13.8,14]
[4.13,13.6,14]
[4.1399999999999997,13.5,14]
[4.1500000000000004,13.3,14]
[4.16,13.1,14]
[4.17,12.9,14]
[4.18,12.7,14]
[4.1900000000000004,12.6,14]
[4.2,12.5,14]
[4.21,12.4,14]
[4.22,12.2,14]
[4.2300000000000004,12.1,14]
[4.24,11.9,14]
[4.25,11.8,14]
[4.26,11.7,14]
{"$rows_left_out":199}
{"sheet":"Présentation des profils","index":3,"n_rows":0,"n_cols":0,"rows_kept":0,"cut":false,"hidden":false,"merged":[]}