{"text_format":"1","workbook":"xlsx","n_sheets":7,"sheets":["Accueil","Explications","Paramétrages","Données élèves","Résultats","Données élèves 3 courses","Résultats 3 courses"],"not_rendered":{"charts":0,"images":6,"macros":1,"external_links":0,"defined_names":0,"comments":1,"pivot_tables":0},"unopened":[],"bounds":{"document_bytes":16777216,"sheet_cells":100000,"rows_first":2000,"rows_last":500,"rows_between":2000,"halvings":0,"cell_chars":16384,"cell_head_chars":4096},"cells_cut":0,"cells_raw":0,"read":"whole","date_system":"1900"}

{"sheet":"Accueil","index":0,"n_rows":1,"n_cols":11,"rows_kept":1,"cut":false,"hidden":false,"merged":[[0,10,6,14]]}
[null,null,null,null,null,null,null,null,null,null,"Demi-fond"]

{"sheet":"Explications","index":1,"n_rows":11,"n_cols":3,"rows_kept":11,"cut":false,"hidden":false,"merged":[[10,2,12,10],[10,11,12,12]]}
[]
[]
[]
[]
[]
[]
[]
[]
[]
[]
[null,null,"Ne remplir que les cellules "]

{"sheet":"Paramétrages","index":2,"n_rows":13,"n_cols":9,"rows_kept":13,"cut":false,"hidden":false,"merged":[[0,0,0,8],[20,2,20,6],[20,7,20,11],[20,12,20,16],[20,17,20,21],[9,0,9,1]]}
["Paramétrages et barèmes"]
[null,null,null,null,"% VMA","PTS",null,"ECART","PTS"]
["Ecart ente les plots (en mètre)",50,null,null,"98-100",8,null,0,8]
["Taille de la piste (en mètre)",200,null,null,"96-97",7,null,1,7]
[null,null,null,null,"93-95",6,null,2,6]
[null,null,null,null,"90-92",5,null,3,5]
[null,null,null,null,"86-89",4,null,4,4]
[null,null,null,null,"83-85",3,null,5,3]
["Ne remplir que les cellules en ",null,null,null,"80-82",1,null,6,2]
["(projets réalisés et les différents rôles)",null,null,null,"<80",0,null,7,1]
[null,null,null,null,null,null,null,8,0]
[null,null,null,null,null,null,null,9,0]
[null,null,null,null,null,null,null,10,0]

{"sheet":"Données élèves","index":3,"n_rows":40,"n_cols":19,"rows_kept":40,"cut":false,"hidden":false,"merged":[[1,0,2,0],[1,1,2,1],[1,14,1,17],[4,18,4,19],[1,2,1,4],[1,5,1,7],[1,8,1,10],[1,11,1,13]]}
[]
["Nom et prénom","VMA de l'élève","Course 1",null,null,"Course 2",null,null,"Course 3",null,null,"Course 4",null,null,"Total"]
[null,null,"Durée","% VMA","Projet ","Durée","% VMA","Projet ","Durée","% VMA","Projet ","Durée","% VMA","Projet ","Durée ","Projet","Distance totale en Mètres","VMA moyenne envisagée"]
[null,null,null,{"$f":"IF(OR(E4=\"\",C4=\"\",B4=\"\"),\"\",(((E4*Paramétrages!$B$3)*100)/((('Données élèves'!B4*1000)*C4)/60)))","v":""},null,null,{"$f":"IF(OR(H4=\"\",F4=\"\",B4=\"\"),\"\",(((H4*Paramétrages!$B$3)*100)/((('Données élèves'!B4*1000)*F4)/60)))","v":""},null,null,{"$f":"IF(OR(K4=\"\",I4=\"\",B4=\"\"),\"\",(((K4*Paramétrages!$B$3)*100)/(((B4*1000)*I4)/60)))","v":""},null,null,{"$f":"IF(OR(N4=\"\",L4=\"\",B4=\"\"),\"\",(((N4*Paramétrages!$B$3)*100)/((('Données élèves'!B4*1000)*L4)/60)))","v":""},null,{"$f":"IF((SUM(L4,I4,F4,C4))>15,\"Erreur\",IF((SUM(L4,I4,F4,C4))<12,\"Erreur\",(SUM(L4,I4,F4,C4))))","v":"Erreur"},{"$f":"IF(OR(N4=\"\",K4=\"\",H4=\"\",E4=\"\"),\"\",SUM(N4,K4,H4,E4))","v":""},{"$f":"IF(OR(P4=\"\"),\"\",P4*Paramétrages!$B$3)","v":""},{"$f":"IF(OR(Q4=\"\",O4=\"\",B4=\"\"),\"\",((Q4*100)/(((B4*1000)*O4)/60)))","v":""},"Ne remplir que les cellules en "]
[null,null,null,{"$f":"IF(OR(E5=\"\",C5=\"\",B5=\"\"),\"\",(((E5*Paramétrages!$B$3)*100)/((('Données élèves'!B5*1000)*C5)/60)))","v":""},null,null,{"$f":"IF(OR(H5=\"\",F5=\"\",B5=\"\"),\"\",(((H5*Paramétrages!$B$3)*100)/((('Données élèves'!B5*1000)*F5)/60)))","v":""},null,null,{"$f":"IF(OR(K5=\"\",I5=\"\",B5=\"\"),\"\",(((K5*Paramétrages!$B$3)*100)/(((B5*1000)*I5)/60)))","v":""},null,null,{"$f":"IF(OR(N5=\"\",L5=\"\",B5=\"\"),\"\",(((N5*Paramétrages!$B$3)*100)/((('Données élèves'!B5*1000)*L5)/60)))","v":""},null,"Erreur",{"$f":"IF(OR(N5=\"\",K5=\"\",H5=\"\",E5=\"\"),\"\",SUM(N5,K5,H5,E5))","v":""},{"$f":"IF(OR(P5=\"\"),\"\",P5*Paramétrages!$B$3)","v":""},{"$f":"IF(OR(Q5=\"\",O5=\"\",B5=\"\"),\"\",((Q5*100)/(((B5*1000)*O5)/60)))","v":""},"(projets réalisés et les différents rôles)"]
[null,null,null,{"$f":"IF(OR(E6=\"\",C6=\"\",B6=\"\"),\"\",(((E6*Paramétrages!$B$3)*100)/((('Données élèves'!B6*1000)*C6)/60)))","v":""},null,null,{"$f":"IF(OR(H6=\"\",F6=\"\",B6=\"\"),\"\",(((H6*Paramétrages!$B$3)*100)/((('Données élèves'!B6*1000)*F6)/60)))","v":""},null,null,{"$f":"IF(OR(K6=\"\",I6=\"\",B6=\"\"),\"\",(((K6*Paramétrages!$B$3)*100)/(((B6*1000)*I6)/60)))","v":""},null,null,{"$f":"IF(OR(N6=\"\",L6=\"\",B6=\"\"),\"\",(((N6*Paramétrages!$B$3)*100)/((('Données élèves'!B6*1000)*L6)/60)))","v":""},null,"Erreur","",{"$f":"IF(OR(P6=\"\"),\"\",P6*Paramétrages!$B$3)","v":""},""]
[null,null,null,{"$f":"IF(OR(E7=\"\",C7=\"\",B7=\"\"),\"\",(((E7*Paramétrages!$B$3)*100)/((('Données élèves'!B7*1000)*C7)/60)))","v":""},null,null,{"$f":"IF(OR(H7=\"\",F7=\"\",B7=\"\"),\"\",(((H7*Paramétrages!$B$3)*100)/((('Données élèves'!B7*1000)*F7)/60)))","v":""},null,null,{"$f":"IF(OR(K7=\"\",I7=\"\",B7=\"\"),\"\",(((K7*Paramétrages!$B$3)*100)/(((B7*1000)*I7)/60)))","v":""},null,null,{"$f":"IF(OR(N7=\"\",L7=\"\",B7=\"\"),\"\",(((N7*Paramétrages!$B$3)*100)/((('Données élèves'!B7*1000)*L7)/60)))","v":""},null,"Erreur","",{"$f":"IF(OR(P7=\"\"),\"\",P7*Paramétrages!$B$3)","v":""},""]
[null,null,null,{"$f":"IF(OR(E8=\"\",C8=\"\",B8=\"\"),\"\",(((E8*Paramétrages!$B$3)*100)/((('Données élèves'!B8*1000)*C8)/60)))","v":""},null,null,{"$f":"IF(OR(H8=\"\",F8=\"\",B8=\"\"),\"\",(((H8*Paramétrages!$B$3)*100)/((('Données élèves'!B8*1000)*F8)/60)))","v":""},null,null,{"$f":"IF(OR(K8=\"\",I8=\"\",B8=\"\"),\"\",(((K8*Paramétrages!$B$3)*100)/(((B8*1000)*I8)/60)))","v":""},null,null,{"$f":"IF(OR(N8=\"\",L8=\"\",B8=\"\"),\"\",(((N8*Paramétrages!$B$3)*100)/((('Données élèves'!B8*1000)*L8)/60)))","v":""},null,"Erreur","",{"$f":"IF(OR(P8=\"\"),\"\",P8*Paramétrages!$B$3)","v":""},""]
[null,null,null,{"$f":"IF(OR(E9=\"\",C9=\"\",B9=\"\"),\"\",(((E9*Paramétrages!$B$3)*100)/((('Données élèves'!B9*1000)*C9)/60)))","v":""},null,null,{"$f":"IF(OR(H9=\"\",F9=\"\",B9=\"\"),\"\",(((H9*Paramétrages!$B$3)*100)/((('Données élèves'!B9*1000)*F9)/60)))","v":""},null,null,{"$f":"IF(OR(K9=\"\",I9=\"\",B9=\"\"),\"\",(((K9*Paramétrages!$B$3)*100)/(((B9*1000)*I9)/60)))","v":""},null,null,{"$f":"IF(OR(N9=\"\",L9=\"\",B9=\"\"),\"\",(((N9*Paramétrages!$B$3)*100)/((('Données élèves'!B9*1000)*L9)/60)))","v":""},null,"Erreur","",{"$f":"IF(OR(P9=\"\"),\"\",P9*Paramétrages!$B$3)","v":""},""]
[null,null,null,{"$f":"IF(OR(E10=\"\",C10=\"\",B10=\"\"),\"\",(((E10*Paramétrages!$B$3)*100)/((('Données élèves'!B10*1000)*C10)/60)))","v":""},null,null,{"$f":"IF(OR(H10=\"\",F10=\"\",B10=\"\"),\"\",(((H10*Paramétrages!$B$3)*100)/((('Données élèves'!B10*1000)*F10)/60)))","v":""},null,null,{"$f":"IF(OR(K10=\"\",I10=\"\",B10=\"\"),\"\",(((K10*Paramétrages!$B$3)*100)/(((B10*1000)*I10)/60)))","v":""},null,null,{"$f":"IF(OR(N10=\"\",L10=\"\",B10=\"\"),\"\",(((N10*Paramétrages!$B$3)*100)/((('Données élèves'!B10*1000)*L10)/60)))","v":""},null,"Erreur","",{"$f":"IF(OR(P10=\"\"),\"\",P10*Paramétrages!$B$3)","v":""},""]
[null,null,null,{"$f":"IF(OR(E11=\"\",C11=\"\",B11=\"\"),\"\",(((E11*Paramétrages!$B$3)*100)/((('Données élèves'!B11*1000)*C11)/60)))","v":""},null,null,{"$f":"IF(OR(H11=\"\",F11=\"\",B11=\"\"),\"\",(((H11*Paramétrages!$B$3)*100)/((('Données élèves'!B11*1000)*F11)/60)))","v":""},null,null,{"$f":"IF(OR(K11=\"\",I11=\"\",B11=\"\"),\"\",(((K11*Paramétrages!$B$3)*100)/(((B11*1000)*I11)/60)))","v":""},null,null,{"$f":"IF(OR(N11=\"\",L11=\"\",B11=\"\"),\"\",(((N11*Paramétrages!$B$3)*100)/((('Données élèves'!B11*1000)*L11)/60)))","v":""},null,"Erreur","",{"$f":"IF(OR(P11=\"\"),\"\",P11*Paramétrages!$B$3)","v":""},""]
[null,null,null,{"$f":"IF(OR(E12=\"\",C12=\"\",B12=\"\"),\"\",(((E12*Paramétrages!$B$3)*100)/((('Données élèves'!B12*1000)*C12)/60)))","v":""},null,null,{"$f":"IF(OR(H12=\"\",F12=\"\",B12=\"\"),\"\",(((H12*Paramétrages!$B$3)*100)/((('Données élèves'!B12*1000)*F12)/60)))","v":""},null,null,{"$f":"IF(OR(K12=\"\",I12=\"\",B12=\"\"),\"\",(((K12*Paramétrages!$B$3)*100)/(((B12*1000)*I12)/60)))","v":""},null,null,{"$f":"IF(OR(N12=\"\",L12=\"\",B12=\"\"),\"\",(((N12*Paramétrages!$B$3)*100)/((('Données élèves'!B12*1000)*L12)/60)))","v":""},null,"Erreur","",{"$f":"IF(OR(P12=\"\"),\"\",P12*Paramétrages!$B$3)","v":""},""]
[null,null,null,{"$f":"IF(OR(E13=\"\",C13=\"\",B13=\"\"),\"\",(((E13*Paramétrages!$B$3)*100)/((('Données élèves'!B13*1000)*C13)/60)))","v":""},null,null,{"$f":"IF(OR(H13=\"\",F13=\"\",B13=\"\"),\"\",(((H13*Paramétrages!$B$3)*100)/((('Données élèves'!B13*1000)*F13)/60)))","v":""},null,null,{"$f":"IF(OR(K13=\"\",I13=\"\",B13=\"\"),\"\",(((K13*Paramétrages!$B$3)*100)/(((B13*1000)*I13)/60)))","v":""},null,null,{"$f":"IF(OR(N13=\"\",L13=\"\",B13=\"\"),\"\",(((N13*Paramétrages!$B$3)*100)/((('Données élèves'!B13*1000)*L13)/60)))","v":""},null,"Erreur","",{"$f":"IF(OR(P13=\"\"),\"\",P13*Paramétrages!$B$3)","v":""},""]
[null,null,null,{"$f":"IF(OR(E14=\"\",C14=\"\",B14=\"\"),\"\",(((E14*Paramétrages!$B$3)*100)/((('Données élèves'!B14*1000)*C14)/60)))","v":""},null,null,{"$f":"IF(OR(H14=\"\",F14=\"\",B14=\"\"),\"\",(((H14*Paramétrages!$B$3)*100)/((('Données élèves'!B14*1000)*F14)/60)))","v":""},null,null,{"$f":"IF(OR(K14=\"\",I14=\"\",B14=\"\"),\"\",(((K14*Paramétrages!$B$3)*100)/(((B14*1000)*I14)/60)))","v":""},null,null,{"$f":"IF(OR(N14=\"\",L14=\"\",B14=\"\"),\"\",(((N14*Paramétrages!$B$3)*100)/((('Données élèves'!B14*1000)*L14)/60)))","v":""},null,"Erreur","",{"$f":"IF(OR(P14=\"\"),\"\",P14*Paramétrages!$B$3)","v":""},""]
[null,null,null,{"$f":"IF(OR(E15=\"\",C15=\"\",B15=\"\"),\"\",(((E15*Paramétrages!$B$3)*100)/((('Données élèves'!B15*1000)*C15)/60)))","v":""},null,null,{"$f":"IF(OR(H15=\"\",F15=\"\",B15=\"\"),\"\",(((H15*Paramétrages!$B$3)*100)/((('Données élèves'!B15*1000)*F15)/60)))","v":""},null,null,{"$f":"IF(OR(K15=\"\",I15=\"\",B15=\"\"),\"\",(((K15*Paramétrages!$B$3)*100)/(((B15*1000)*I15)/60)))","v":""},null,null,{"$f":"IF(OR(N15=\"\",L15=\"\",B15=\"\"),\"\",(((N15*Paramétrages!$B$3)*100)/((('Données élèves'!B15*1000)*L15)/60)))","v":""},null,"Erreur","",{"$f":"IF(OR(P15=\"\"),\"\",P15*Paramétrages!$B$3)","v":""},""]
[null,null,null,{"$f":"IF(OR(E16=\"\",C16=\"\",B16=\"\"),\"\",(((E16*Paramétrages!$B$3)*100)/((('Données élèves'!B16*1000)*C16)/60)))","v":""},null,null,{"$f":"IF(OR(H16=\"\",F16=\"\",B16=\"\"),\"\",(((H16*Paramétrages!$B$3)*100)/((('Données élèves'!B16*1000)*F16)/60)))","v":""},null,null,{"$f":"IF(OR(K16=\"\",I16=\"\",B16=\"\"),\"\",(((K16*Paramétrages!$B$3)*100)/(((B16*1000)*I16)/60)))","v":""},null,null,{"$f":"IF(OR(N16=\"\",L16=\"\",B16=\"\"),\"\",(((N16*Paramétrages!$B$3)*100)/((('Données élèves'!B16*1000)*L16)/60)))","v":""},null,"Erreur","",{"$f":"IF(OR(P16=\"\"),\"\",P16*Paramétrages!$B$3)","v":""},""]
[null,null,null,{"$f":"IF(OR(E17=\"\",C17=\"\",B17=\"\"),\"\",(((E17*Paramétrages!$B$3)*100)/((('Données élèves'!B17*1000)*C17)/60)))","v":""},null,null,{"$f":"IF(OR(H17=\"\",F17=\"\",B17=\"\"),\"\",(((H17*Paramétrages!$B$3)*100)/((('Données élèves'!B17*1000)*F17)/60)))","v":""},null,null,{"$f":"IF(OR(K17=\"\",I17=\"\",B17=\"\"),\"\",(((K17*Paramétrages!$B$3)*100)/(((B17*1000)*I17)/60)))","v":""},null,null,{"$f":"IF(OR(N17=\"\",L17=\"\",B17=\"\"),\"\",(((N17*Paramétrages!$B$3)*100)/((('Données élèves'!B17*1000)*L17)/60)))","v":""},null,"Erreur","",{"$f":"IF(OR(P17=\"\"),\"\",P17*Paramétrages!$B$3)","v":""},""]
[null,null,null,{"$f":"IF(OR(E18=\"\",C18=\"\",B18=\"\"),\"\",(((E18*Paramétrages!$B$3)*100)/((('Données élèves'!B18*1000)*C18)/60)))","v":""},null,null,{"$f":"IF(OR(H18=\"\",F18=\"\",B18=\"\"),\"\",(((H18*Paramétrages!$B$3)*100)/((('Données élèves'!B18*1000)*F18)/60)))","v":""},null,null,{"$f":"IF(OR(K18=\"\",I18=\"\",B18=\"\"),\"\",(((K18*Paramétrages!$B$3)*100)/(((B18*1000)*I18)/60)))","v":""},null,null,{"$f":"IF(OR(N18=\"\",L18=\"\",B18=\"\"),\"\",(((N18*Paramétrages!$B$3)*100)/((('Données élèves'!B18*1000)*L18)/60)))","v":""},null,"Erreur",{"$f":"IF(OR(N18=\"\",K18=\"\",H18=\"\",E18=\"\"),\"\",SUM(N18,K18,H18,E18))","v":""},{"$f":"IF(OR(P18=\"\"),\"\",P18*Paramétrages!$B$3)","v":""},""]
[null,null,null,{"$f":"IF(OR(E19=\"\",C19=\"\",B19=\"\"),\"\",(((E19*Paramétrages!$B$3)*100)/((('Données élèves'!B19*1000)*C19)/60)))","v":""},null,null,{"$f":"IF(OR(H19=\"\",F19=\"\",B19=\"\"),\"\",(((H19*Paramétrages!$B$3)*100)/((('Données élèves'!B19*1000)*F19)/60)))","v":""},null,null,{"$f":"IF(OR(K19=\"\",I19=\"\",B19=\"\"),\"\",(((K19*Paramétrages!$B$3)*100)/(((B19*1000)*I19)/60)))","v":""},null,null,{"$f":"IF(OR(N19=\"\",L19=\"\",B19=\"\"),\"\",(((N19*Paramétrages!$B$3)*100)/((('Données élèves'!B19*1000)*L19)/60)))","v":""},null,"Erreur","",{"$f":"IF(OR(P19=\"\"),\"\",P19*Paramétrages!$B$3)","v":""},""]
[null,null,null,{"$f":"IF(OR(E20=\"\",C20=\"\",B20=\"\"),\"\",(((E20*Paramétrages!$B$3)*100)/((('Données élèves'!B20*1000)*C20)/60)))","v":""},null,null,{"$f":"IF(OR(H20=\"\",F20=\"\",B20=\"\"),\"\",(((H20*Paramétrages!$B$3)*100)/((('Données élèves'!B20*1000)*F20)/60)))","v":""},null,null,{"$f":"IF(OR(K20=\"\",I20=\"\",B20=\"\"),\"\",(((K20*Paramétrages!$B$3)*100)/(((B20*1000)*I20)/60)))","v":""},null,null,{"$f":"IF(OR(N20=\"\",L20=\"\",B20=\"\"),\"\",(((N20*Paramétrages!$B$3)*100)/((('Données élèves'!B20*1000)*L20)/60)))","v":""},null,"Erreur","",{"$f":"IF(OR(P20=\"\"),\"\",P20*Paramétrages!$B$3)","v":""},""]
[null,null,null,{"$f":"IF(OR(E21=\"\",C21=\"\",B21=\"\"),\"\",(((E21*Paramétrages!$B$3)*100)/((('Données élèves'!B21*1000)*C21)/60)))","v":""},null,null,{"$f":"IF(OR(H21=\"\",F21=\"\",B21=\"\"),\"\",(((H21*Paramétrages!$B$3)*100)/((('Données élèves'!B21*1000)*F21)/60)))","v":""},null,null,{"$f":"IF(OR(K21=\"\",I21=\"\",B21=\"\"),\"\",(((K21*Paramétrages!$B$3)*100)/(((B21*1000)*I21)/60)))","v":""},null,null,{"$f":"IF(OR(N21=\"\",L21=\"\",B21=\"\"),\"\",(((N21*Paramétrages!$B$3)*100)/((('Données élèves'!B21*1000)*L21)/60)))","v":""},null,"Erreur","",{"$f":"IF(OR(P21=\"\"),\"\",P21*Paramétrages!$B$3)","v":""},""]
[null,null,null,{"$f":"IF(OR(E22=\"\",C22=\"\",B22=\"\"),\"\",(((E22*Paramétrages!$B$3)*100)/((('Données élèves'!B22*1000)*C22)/60)))","v":""},null,null,{"$f":"IF(OR(H22=\"\",F22=\"\",B22=\"\"),\"\",(((H22*Paramétrages!$B$3)*100)/((('Données élèves'!B22*1000)*F22)/60)))","v":""},null,null,{"$f":"IF(OR(K22=\"\",I22=\"\",B22=\"\"),\"\",(((K22*Paramétrages!$B$3)*100)/(((B22*1000)*I22)/60)))","v":""},null,null,{"$f":"IF(OR(N22=\"\",L22=\"\",B22=\"\"),\"\",(((N22*Paramétrages!$B$3)*100)/((('Données élèves'!B22*1000)*L22)/60)))","v":""},null,"Erreur","",{"$f":"IF(OR(P22=\"\"),\"\",P22*Paramétrages!$B$3)","v":""},""]
[null,null,null,{"$f":"IF(OR(E23=\"\",C23=\"\",B23=\"\"),\"\",(((E23*Paramétrages!$B$3)*100)/((('Données élèves'!B23*1000)*C23)/60)))","v":""},null,null,{"$f":"IF(OR(H23=\"\",F23=\"\",B23=\"\"),\"\",(((H23*Paramétrages!$B$3)*100)/((('Données élèves'!B23*1000)*F23)/60)))","v":""},null,null,{"$f":"IF(OR(K23=\"\",I23=\"\",B23=\"\"),\"\",(((K23*Paramétrages!$B$3)*100)/(((B23*1000)*I23)/60)))","v":""},null,null,{"$f":"IF(OR(N23=\"\",L23=\"\",B23=\"\"),\"\",(((N23*Paramétrages!$B$3)*100)/((('Données élèves'!B23*1000)*L23)/60)))","v":""},null,"Erreur","",{"$f":"IF(OR(P23=\"\"),\"\",P23*Paramétrages!$B$3)","v":""},""]
[null,null,null,{"$f":"IF(OR(E24=\"\",C24=\"\",B24=\"\"),\"\",(((E24*Paramétrages!$B$3)*100)/((('Données élèves'!B24*1000)*C24)/60)))","v":""},null,null,{"$f":"IF(OR(H24=\"\",F24=\"\",B24=\"\"),\"\",(((H24*Paramétrages!$B$3)*100)/((('Données élèves'!B24*1000)*F24)/60)))","v":""},null,null,{"$f":"IF(OR(K24=\"\",I24=\"\",B24=\"\"),\"\",(((K24*Paramétrages!$B$3)*100)/(((B24*1000)*I24)/60)))","v":""},null,null,{"$f":"IF(OR(N24=\"\",L24=\"\",B24=\"\"),\"\",(((N24*Paramétrages!$B$3)*100)/((('Données élèves'!B24*1000)*L24)/60)))","v":""},null,"Erreur","",{"$f":"IF(OR(P24=\"\"),\"\",P24*Paramétrages!$B$3)","v":""},""]
[null,null,null,{"$f":"IF(OR(E25=\"\",C25=\"\",B25=\"\"),\"\",(((E25*Paramétrages!$B$3)*100)/((('Données élèves'!B25*1000)*C25)/60)))","v":""},null,null,{"$f":"IF(OR(H25=\"\",F25=\"\",B25=\"\"),\"\",(((H25*Paramétrages!$B$3)*100)/((('Données élèves'!B25*1000)*F25)/60)))","v":""},null,null,{"$f":"IF(OR(K25=\"\",I25=\"\",B25=\"\"),\"\",(((K25*Paramétrages!$B$3)*100)/(((B25*1000)*I25)/60)))","v":""},null,null,{"$f":"IF(OR(N25=\"\",L25=\"\",B25=\"\"),\"\",(((N25*Paramétrages!$B$3)*100)/((('Données élèves'!B25*1000)*L25)/60)))","v":""},null,"Erreur","",{"$f":"IF(OR(P25=\"\"),\"\",P25*Paramétrages!$B$3)","v":""},""]
[null,null,null,{"$f":"IF(OR(E26=\"\",C26=\"\",B26=\"\"),\"\",(((E26*Paramétrages!$B$3)*100)/((('Données élèves'!B26*1000)*C26)/60)))","v":""},null,null,{"$f":"IF(OR(H26=\"\",F26=\"\",B26=\"\"),\"\",(((H26*Paramétrages!$B$3)*100)/((('Données élèves'!B26*1000)*F26)/60)))","v":""},null,null,{"$f":"IF(OR(K26=\"\",I26=\"\",B26=\"\"),\"\",(((K26*Paramétrages!$B$3)*100)/(((B26*1000)*I26)/60)))","v":""},null,null,{"$f":"IF(OR(N26=\"\",L26=\"\",B26=\"\"),\"\",(((N26*Paramétrages!$B$3)*100)/((('Données élèves'!B26*1000)*L26)/60)))","v":""},null,"Erreur","",{"$f":"IF(OR(P26=\"\"),\"\",P26*Paramétrages!$B$3)","v":""},""]
[null,null,null,{"$f":"IF(OR(E27=\"\",C27=\"\",B27=\"\"),\"\",(((E27*Paramétrages!$B$3)*100)/((('Données élèves'!B27*1000)*C27)/60)))","v":""},null,null,{"$f":"IF(OR(H27=\"\",F27=\"\",B27=\"\"),\"\",(((H27*Paramétrages!$B$3)*100)/((('Données élèves'!B27*1000)*F27)/60)))","v":""},null,null,{"$f":"IF(OR(K27=\"\",I27=\"\",B27=\"\"),\"\",(((K27*Paramétrages!$B$3)*100)/(((B27*1000)*I27)/60)))","v":""},null,null,{"$f":"IF(OR(N27=\"\",L27=\"\",B27=\"\"),\"\",(((N27*Paramétrages!$B$3)*100)/((('Données élèves'!B27*1000)*L27)/60)))","v":""},null,"Erreur","",{"$f":"IF(OR(P27=\"\"),\"\",P27*Paramétrages!$B$3)","v":""},""]
[null,null,null,{"$f":"IF(OR(E28=\"\",C28=\"\",B28=\"\"),\"\",(((E28*Paramétrages!$B$3)*100)/((('Données élèves'!B28*1000)*C28)/60)))","v":""},null,null,{"$f":"IF(OR(H28=\"\",F28=\"\",B28=\"\"),\"\",(((H28*Paramétrages!$B$3)*100)/((('Données élèves'!B28*1000)*F28)/60)))","v":""},null,null,{"$f":"IF(OR(K28=\"\",I28=\"\",B28=\"\"),\"\",(((K28*Paramétrages!$B$3)*100)/(((B28*1000)*I28)/60)))","v":""},null,null,{"$f":"IF(OR(N28=\"\",L28=\"\",B28=\"\"),\"\",(((N28*Paramétrages!$B$3)*100)/((('Données élèves'!B28*1000)*L28)/60)))","v":""},null,"Erreur","",{"$f":"IF(OR(P28=\"\"),\"\",P28*Paramétrages!$B$3)","v":""},{"$f":"IF(OR(Q28=\"\",O28=\"\",B28=\"\"),\"\",((Q28*100)/(((B28*1000)*O28)/60)))","v":""}]
[null,null,null,{"$f":"IF(OR(E29=\"\",C29=\"\",B29=\"\"),\"\",(((E29*Paramétrages!$B$3)*100)/((('Données élèves'!B29*1000)*C29)/60)))","v":""},null,null,{"$f":"IF(OR(H29=\"\",F29=\"\",B29=\"\"),\"\",(((H29*Paramétrages!$B$3)*100)/((('Données élèves'!B29*1000)*F29)/60)))","v":""},null,null,{"$f":"IF(OR(K29=\"\",I29=\"\",B29=\"\"),\"\",(((K29*Paramétrages!$B$3)*100)/(((B29*1000)*I29)/60)))","v":""},null,null,{"$f":"IF(OR(N29=\"\",L29=\"\",B29=\"\"),\"\",(((N29*Paramétrages!$B$3)*100)/((('Données élèves'!B29*1000)*L29)/60)))","v":""},null,"Erreur",{"$f":"IF(OR(N29=\"\",K29=\"\",H29=\"\",E29=\"\"),\"\",SUM(N29,K29,H29,E29))","v":""},{"$f":"IF(OR(P29=\"\"),\"\",P29*Paramétrages!$B$3)","v":""},""]
[null,null,null,{"$f":"IF(OR(E30=\"\",C30=\"\",B30=\"\"),\"\",(((E30*Paramétrages!$B$3)*100)/((('Données élèves'!B30*1000)*C30)/60)))","v":""},null,null,{"$f":"IF(OR(H30=\"\",F30=\"\",B30=\"\"),\"\",(((H30*Paramétrages!$B$3)*100)/((('Données élèves'!B30*1000)*F30)/60)))","v":""},null,null,{"$f":"IF(OR(K30=\"\",I30=\"\",B30=\"\"),\"\",(((K30*Paramétrages!$B$3)*100)/(((B30*1000)*I30)/60)))","v":""},null,null,{"$f":"IF(OR(N30=\"\",L30=\"\",B30=\"\"),\"\",(((N30*Paramétrages!$B$3)*100)/((('Données élèves'!B30*1000)*L30)/60)))","v":""},null,"Erreur","",{"$f":"IF(OR(P30=\"\"),\"\",P30*Paramétrages!$B$3)","v":""},""]
[null,null,null,{"$f":"IF(OR(E31=\"\",C31=\"\",B31=\"\"),\"\",(((E31*Paramétrages!$B$3)*100)/((('Données élèves'!B31*1000)*C31)/60)))","v":""},null,null,{"$f":"IF(OR(H31=\"\",F31=\"\",B31=\"\"),\"\",(((H31*Paramétrages!$B$3)*100)/((('Données élèves'!B31*1000)*F31)/60)))","v":""},null,null,{"$f":"IF(OR(K31=\"\",I31=\"\",B31=\"\"),\"\",(((K31*Paramétrages!$B$3)*100)/(((B31*1000)*I31)/60)))","v":""},null,null,{"$f":"IF(OR(N31=\"\",L31=\"\",B31=\"\"),\"\",(((N31*Paramétrages!$B$3)*100)/((('Données élèves'!B31*1000)*L31)/60)))","v":""},null,"Erreur","",{"$f":"IF(OR(P31=\"\"),\"\",P31*Paramétrages!$B$3)","v":""},""]
[null,null,null,{"$f":"IF(OR(E32=\"\",C32=\"\",B32=\"\"),\"\",(((E32*Paramétrages!$B$3)*100)/((('Données élèves'!B32*1000)*C32)/60)))","v":""},null,null,{"$f":"IF(OR(H32=\"\",F32=\"\",B32=\"\"),\"\",(((H32*Paramétrages!$B$3)*100)/((('Données élèves'!B32*1000)*F32)/60)))","v":""},null,null,{"$f":"IF(OR(K32=\"\",I32=\"\",B32=\"\"),\"\",(((K32*Paramétrages!$B$3)*100)/(((B32*1000)*I32)/60)))","v":""},null,null,{"$f":"IF(OR(N32=\"\",L32=\"\",B32=\"\"),\"\",(((N32*Paramétrages!$B$3)*100)/((('Données élèves'!B32*1000)*L32)/60)))","v":""},null,"Erreur","",{"$f":"IF(OR(P32=\"\"),\"\",P32*Paramétrages!$B$3)","v":""},""]
[null,null,null,{"$f":"IF(OR(E33=\"\",C33=\"\",B33=\"\"),\"\",(((E33*Paramétrages!$B$3)*100)/((('Données élèves'!B33*1000)*C33)/60)))","v":""},null,null,{"$f":"IF(OR(H33=\"\",F33=\"\",B33=\"\"),\"\",(((H33*Paramétrages!$B$3)*100)/((('Données élèves'!B33*1000)*F33)/60)))","v":""},null,null,{"$f":"IF(OR(K33=\"\",I33=\"\",B33=\"\"),\"\",(((K33*Paramétrages!$B$3)*100)/(((B33*1000)*I33)/60)))","v":""},null,null,{"$f":"IF(OR(N33=\"\",L33=\"\",B33=\"\"),\"\",(((N33*Paramétrages!$B$3)*100)/((('Données élèves'!B33*1000)*L33)/60)))","v":""},null,"Erreur","",{"$f":"IF(OR(P33=\"\"),\"\",P33*Paramétrages!$B$3)","v":""},""]
[null,null,null,{"$f":"IF(OR(E34=\"\",C34=\"\",B34=\"\"),\"\",(((E34*Paramétrages!$B$3)*100)/((('Données élèves'!B34*1000)*C34)/60)))","v":""},null,null,{"$f":"IF(OR(H34=\"\",F34=\"\",B34=\"\"),\"\",(((H34*Paramétrages!$B$3)*100)/((('Données élèves'!B34*1000)*F34)/60)))","v":""},null,null,{"$f":"IF(OR(K34=\"\",I34=\"\",B34=\"\"),\"\",(((K34*Paramétrages!$B$3)*100)/(((B34*1000)*I34)/60)))","v":""},null,null,{"$f":"IF(OR(N34=\"\",L34=\"\",B34=\"\"),\"\",(((N34*Paramétrages!$B$3)*100)/((('Données élèves'!B34*1000)*L34)/60)))","v":""},null,"Erreur","",{"$f":"IF(OR(P34=\"\"),\"\",P34*Paramétrages!$B$3)","v":""},""]
[null,null,null,{"$f":"IF(OR(E35=\"\",C35=\"\",B35=\"\"),\"\",(((E35*Paramétrages!$B$3)*100)/((('Données élèves'!B35*1000)*C35)/60)))","v":""},null,null,{"$f":"IF(OR(H35=\"\",F35=\"\",B35=\"\"),\"\",(((H35*Paramétrages!$B$3)*100)/((('Données élèves'!B35*1000)*F35)/60)))","v":""},null,null,{"$f":"IF(OR(K35=\"\",I35=\"\",B35=\"\"),\"\",(((K35*Paramétrages!$B$3)*100)/(((B35*1000)*I35)/60)))","v":""},null,null,{"$f":"IF(OR(N35=\"\",L35=\"\",B35=\"\"),\"\",(((N35*Paramétrages!$B$3)*100)/((('Données élèves'!B35*1000)*L35)/60)))","v":""},null,"Erreur","",{"$f":"IF(OR(P35=\"\"),\"\",P35*Paramétrages!$B$3)","v":""},""]
[null,null,null,{"$f":"IF(OR(E36=\"\",C36=\"\",B36=\"\"),\"\",(((E36*Paramétrages!$B$3)*100)/((('Données élèves'!B36*1000)*C36)/60)))","v":""},null,null,{"$f":"IF(OR(H36=\"\",F36=\"\",B36=\"\"),\"\",(((H36*Paramétrages!$B$3)*100)/((('Données élèves'!B36*1000)*F36)/60)))","v":""},null,null,{"$f":"IF(OR(K36=\"\",I36=\"\",B36=\"\"),\"\",(((K36*Paramétrages!$B$3)*100)/(((B36*1000)*I36)/60)))","v":""},null,null,{"$f":"IF(OR(N36=\"\",L36=\"\",B36=\"\"),\"\",(((N36*Paramétrages!$B$3)*100)/((('Données élèves'!B36*1000)*L36)/60)))","v":""},null,"Erreur","",{"$f":"IF(OR(P36=\"\"),\"\",P36*Paramétrages!$B$3)","v":""},""]
[null,null,null,{"$f":"IF(OR(E37=\"\",C37=\"\",B37=\"\"),\"\",(((E37*Paramétrages!$B$3)*100)/((('Données élèves'!B37*1000)*C37)/60)))","v":""},null,null,{"$f":"IF(OR(H37=\"\",F37=\"\",B37=\"\"),\"\",(((H37*Paramétrages!$B$3)*100)/((('Données élèves'!B37*1000)*F37)/60)))","v":""},null,null,{"$f":"IF(OR(K37=\"\",I37=\"\",B37=\"\"),\"\",(((K37*Paramétrages!$B$3)*100)/(((B37*1000)*I37)/60)))","v":""},null,null,{"$f":"IF(OR(N37=\"\",L37=\"\",B37=\"\"),\"\",(((N37*Paramétrages!$B$3)*100)/((('Données élèves'!B37*1000)*L37)/60)))","v":""},null,"Erreur","",{"$f":"IF(OR(P37=\"\"),\"\",P37*Paramétrages!$B$3)","v":""},""]
[null,null,null,{"$f":"IF(OR(E38=\"\",C38=\"\",B38=\"\"),\"\",(((E38*Paramétrages!$B$3)*100)/((('Données élèves'!B38*1000)*C38)/60)))","v":""},null,null,{"$f":"IF(OR(H38=\"\",F38=\"\",B38=\"\"),\"\",(((H38*Paramétrages!$B$3)*100)/((('Données élèves'!B38*1000)*F38)/60)))","v":""},null,null,{"$f":"IF(OR(K38=\"\",I38=\"\",B38=\"\"),\"\",(((K38*Paramétrages!$B$3)*100)/(((B38*1000)*I38)/60)))","v":""},null,null,{"$f":"IF(OR(N38=\"\",L38=\"\",B38=\"\"),\"\",(((N38*Paramétrages!$B$3)*100)/((('Données élèves'!B38*1000)*L38)/60)))","v":""},null,"Erreur","",{"$f":"IF(OR(P38=\"\"),\"\",P38*Paramétrages!$B$3)","v":""},""]
[null,null,null,{"$f":"IF(OR(E39=\"\",C39=\"\",B39=\"\"),\"\",(((E39*Paramétrages!$B$3)*100)/((('Données élèves'!B39*1000)*C39)/60)))","v":""},null,null,{"$f":"IF(OR(H39=\"\",F39=\"\",B39=\"\"),\"\",(((H39*Paramétrages!$B$3)*100)/((('Données élèves'!B39*1000)*F39)/60)))","v":""},null,null,{"$f":"IF(OR(K39=\"\",I39=\"\",B39=\"\"),\"\",(((K39*Paramétrages!$B$3)*100)/(((B39*1000)*I39)/60)))","v":""},null,null,{"$f":"IF(OR(N39=\"\",L39=\"\",B39=\"\"),\"\",(((N39*Paramétrages!$B$3)*100)/((('Données élèves'!B39*1000)*L39)/60)))","v":""},null,"Erreur","",{"$f":"IF(OR(P39=\"\"),\"\",P39*Paramétrages!$B$3)","v":""},""]
[null,null,null,{"$f":"IF(OR(E40=\"\",C40=\"\",B40=\"\"),\"\",(((E40*Paramétrages!$B$3)*100)/((('Données élèves'!B40*1000)*C40)/60)))","v":""},null,null,{"$f":"IF(OR(H40=\"\",F40=\"\",B40=\"\"),\"\",(((H40*Paramétrages!$B$3)*100)/((('Données élèves'!B40*1000)*F40)/60)))","v":""},null,null,{"$f":"IF(OR(K40=\"\",I40=\"\",B40=\"\"),\"\",(((K40*Paramétrages!$B$3)*100)/(((B40*1000)*I40)/60)))","v":""},null,null,{"$f":"IF(OR(N40=\"\",L40=\"\",B40=\"\"),\"\",(((N40*Paramétrages!$B$3)*100)/((('Données élèves'!B40*1000)*L40)/60)))","v":""},null,"Erreur","",{"$f":"IF(OR(P40=\"\"),\"\",P40*Paramétrages!$B$3)","v":""},""]

{"sheet":"Résultats","index":4,"n_rows":43,"n_cols":31,"rows_kept":43,"cut":false,"hidden":false,"merged":[[4,26,5,26],[2,0,2,1],[4,25,5,25],[4,24,5,24],[4,23,5,23],[4,22,5,22],[4,0,5,0],[4,1,5,1],[4,2,4,6],[4,7,4,11],[4,12,4,16],[4,17,4,21]]}
[]
["Ne remplir que les cellules en "]
["(projets réalisés et les différents rôles)"]
[]
["Nom","VMA","Course 1",null,null,null,null,"Course 2",null,null,null,null,"Course 3",null,null,null,null,"Course 4",null,null,null,null,"Diff rôles /4 pts","Tps total de course","Ecart total","VMA moy envisagée","VMA moy réalisée",8,8,4]
[null,null,"Tps de course","Projet","Réalisé","%VMA","Ecart projet","Tps de course","Projet","Réalisé","%VMA","Ecart projet","Tps de course","Projet","Réalisé","%VMA","Ecart projet","Tps de course","Projet","Réalisé","%VMA","Ecart projet",null,null,null,null,null,"Perf","Projet","Obs","Note"]
[{"$f":"'Données élèves'!A4","v":0},{"$f":"'Données élèves'!B4","v":0},{"$f":"'Données élèves'!C4","v":0},{"$f":"'Données élèves'!E4","v":0},null,{"$f":"IF(((E7*Paramétrages!$B$3)*100)/(((B7*1000)*C7)/60)>100,100,((E7*Paramétrages!$B$3)*100)/(((B7*1000)*C7)/60))","v":{"$error":"#DIV/0!"}},{"$f":"ABS(D7-E7)","v":0},{"$f":"'Données élèves'!F4","v":0},{"$f":"'Données élèves'!H4","v":0},null,{"$f":"IF(((J7*Paramétrages!$B$3)*100)/(((B7*1000)*H7)/60)>100,100,((J7*Paramétrages!$B$3)*100)/(((B7*1000)*H7)/60))","v":{"$error":"#DIV/0!"}},{"$f":"ABS(I7-J7)","v":0},{"$f":"'Données élèves'!I4","v":0},{"$f":"'Données élèves'!K4","v":0},null,{"$f":"IF(((O7*Paramétrages!$B$3)*100)/(((B7*1000)*M7)/60)>100,100,((O7*Paramétrages!$B$3)*100)/(((B7*1000)*M7)/60))","v":{"$error":"#DIV/0!"}},{"$f":"ABS(N7-O7)","v":0},{"$f":"'Données élèves'!L4","v":0},{"$f":"'Données élèves'!N4","v":0},null,{"$f":"IF(((T7*Paramétrages!$B$3)*100)/(((B7*1000)*R7)/60)>100,100,((T7*Paramétrages!$B$3)*100)/(((B7*1000)*R7)/60))","v":{"$error":"#DIV/0!"}},{"$f":"ABS(S7-T7)","v":0},null,{"$f":"IF((SUM(C7,H7,M7,R7))>15,\"Erreur\",IF((SUM(C7,H7,M7,R7))<12,\"Erreur\",(SUM(C7,H7,M7,R7))))","v":"Erreur"},{"$f":"(SUM(V7,Q7,L7,G7))","v":0},{"$f":"'Données élèves'!R4","v":""},{"$f":"AVERAGE(F7,K7,P7,U7)","v":{"$error":"#DIV/0!"}},{"$f":"IF((AVERAGE(U7,P7,K7,F7))>97,Paramétrages!$F$3,IF((AVERAGE(U7,P7,K7,F7))>95,Paramétrages!$F$4,IF((AVERAGE(U7,P7,K7,F7))>92,Paramétrages!$F$5,IF((AVERAGE(U7,P7,K7,F7))>89,Paramétrages!$F$6,IF((AVERAGE(U7,P7,K7,F7))>85,Paramétrages!$F$7,IF((AVERAGE(U7,P7,K7,F7))>82,Paramétrages!$F$8,IF((AVERAGE(U7,P7,K7,F7))>79,Paramétrages!$F$9,IF((AVERAGE(U7,P7,K7,F7))<80,Paramétrages!$F$10,\"0\"))))))))","v":{"$error":"#DIV/0!"}},{"$f":"IF((SUM(V7,Q7,L7,G7))=Paramétrages!$H$3,Paramétrages!$I$3,IF((SUM(V7,Q7,L7,G7))=Paramétrages!$H$4,Paramétrages!$I$4,IF((SUM(V7,Q7,L7,G7))=Paramétrages!$H$5,Paramétrages!$I$5,IF((SUM(V7,Q7,L7,G7))=Paramétrages!$H$6,Paramétrages!$I$6,IF((SUM(V7,Q7,L7,G7))=Paramétrages!$H$7,Paramétrages!$I$7,IF((SUM(V7,Q7,L7,G7))=Paramétrages!$H$8,Paramétrages!$I$8,IF((SUM(V7,Q7,L7,G7))=Paramétrages!$H$9,Paramétrages!$I$9,IF((SUM(V7,Q7,L7,G7))=Paramétrages!$H$10,Paramétrages!$I$10,IF((SUM(V7,Q7,L7,G7))=Paramétrages!$H$11,Paramétrages!$I$11,IF((SUM(V7,Q7,L7,G7))=Paramétrages!$H$12,Paramétrages!$I$12,IF((SUM(V7,Q7,L7,G7))>Paramétrages!$H$13,Paramétrages!$I$13,\"0\")))))))))))","v":8},{"$f":"W7","v":0},{"$f":"SUM(AB7:AD7)","v":{"$error":"#DIV/0!"}}]
[{"$f":"'Données élèves'!A5","v":0},{"$f":"'Données élèves'!B5","v":0},{"$f":"'Données élèves'!C5","v":0},{"$f":"'Données élèves'!E5","v":0},null,{"$f":"IF(((E8*Paramétrages!$B$3)*100)/(((B8*1000)*C8)/60)>100,100,((E8*Paramétrages!$B$3)*100)/(((B8*1000)*C8)/60))","v":{"$error":"#DIV/0!"}},{"$f":"ABS(D8-E8)","v":0},{"$f":"'Données élèves'!F5","v":0},{"$f":"'Données élèves'!H5","v":0},null,{"$f":"IF(((J8*Paramétrages!$B$3)*100)/(((B8*1000)*H8)/60)>100,100,((J8*Paramétrages!$B$3)*100)/(((B8*1000)*H8)/60))","v":{"$error":"#DIV/0!"}},{"$f":"ABS(I8-J8)","v":0},{"$f":"'Données élèves'!I5","v":0},{"$f":"'Données élèves'!K5","v":0},null,{"$f":"IF(((O8*Paramétrages!$B$3)*100)/(((B8*1000)*M8)/60)>100,100,((O8*Paramétrages!$B$3)*100)/(((B8*1000)*M8)/60))","v":{"$error":"#DIV/0!"}},{"$f":"ABS(N8-O8)","v":0},{"$f":"'Données élèves'!L5","v":0},{"$f":"'Données élèves'!N5","v":0},null,{"$f":"IF(((T8*Paramétrages!$B$3)*100)/(((B8*1000)*R8)/60)>100,100,((T8*Paramétrages!$B$3)*100)/(((B8*1000)*R8)/60))","v":{"$error":"#DIV/0!"}},{"$f":"ABS(S8-T8)","v":0},null,{"$f":"IF((SUM(C8,H8,M8,R8))>15,\"Erreur\",IF((SUM(C8,H8,M8,R8))<12,\"Erreur\",(SUM(C8,H8,M8,R8))))","v":"Erreur"},0,{"$f":"'Données élèves'!R5","v":""},{"$error":"#DIV/0!"},{"$f":"IF((AVERAGE(U8,P8,K8,F8))>97,Paramétrages!$F$3,IF((AVERAGE(U8,P8,K8,F8))>95,Paramétrages!$F$4,IF((AVERAGE(U8,P8,K8,F8))>92,Paramétrages!$F$5,IF((AVERAGE(U8,P8,K8,F8))>89,Paramétrages!$F$6,IF((AVERAGE(U8,P8,K8,F8))>85,Paramétrages!$F$7,IF((AVERAGE(U8,P8,K8,F8))>82,Paramétrages!$F$8,IF((AVERAGE(U8,P8,K8,F8))>79,Paramétrages!$F$9,IF((AVERAGE(U8,P8,K8,F8))<80,Paramétrages!$F$10,\"0\"))))))))","v":{"$error":"#DIV/0!"}},{"$f":"IF((SUM(V8,Q8,L8,G8))=Paramétrages!$H$3,Paramétrages!$I$3,IF((SUM(V8,Q8,L8,G8))=Paramétrages!$H$4,Paramétrages!$I$4,IF((SUM(V8,Q8,L8,G8))=Paramétrages!$H$5,Paramétrages!$I$5,IF((SUM(V8,Q8,L8,G8))=Paramétrages!$H$6,Paramétrages!$I$6,IF((SUM(V8,Q8,L8,G8))=Paramétrages!$H$7,Paramétrages!$I$7,IF((SUM(V8,Q8,L8,G8))=Paramétrages!$H$8,Paramétrages!$I$8,IF((SUM(V8,Q8,L8,G8))=Paramétrages!$H$9,Paramétrages!$I$9,IF((SUM(V8,Q8,L8,G8))=Paramétrages!$H$10,Paramétrages!$I$10,IF((SUM(V8,Q8,L8,G8))=Paramétrages!$H$11,Paramétrages!$I$11,IF((SUM(V8,Q8,L8,G8))=Paramétrages!$H$12,Paramétrages!$I$12,IF((SUM(V8,Q8,L8,G8))>Paramétrages!$H$13,Paramétrages!$I$13,\"0\")))))))))))","v":8},0,{"$f":"SUM(AB8:AD8)","v":{"$error":"#DIV/0!"}}]
[{"$f":"'Données élèves'!A6","v":0},{"$f":"'Données élèves'!B6","v":0},{"$f":"'Données élèves'!C6","v":0},{"$f":"'Données élèves'!E6","v":0},null,{"$f":"IF(((E9*Paramétrages!$B$3)*100)/(((B9*1000)*C9)/60)>100,100,((E9*Paramétrages!$B$3)*100)/(((B9*1000)*C9)/60))","v":{"$error":"#DIV/0!"}},0,{"$f":"'Données élèves'!F6","v":0},{"$f":"'Données élèves'!H6","v":0},null,{"$f":"IF(((J9*Paramétrages!$B$3)*100)/(((B9*1000)*H9)/60)>100,100,((J9*Paramétrages!$B$3)*100)/(((B9*1000)*H9)/60))","v":{"$error":"#DIV/0!"}},0,{"$f":"'Données élèves'!I6","v":0},{"$f":"'Données élèves'!K6","v":0},null,{"$f":"IF(((O9*Paramétrages!$B$3)*100)/(((B9*1000)*M9)/60)>100,100,((O9*Paramétrages!$B$3)*100)/(((B9*1000)*M9)/60))","v":{"$error":"#DIV/0!"}},0,{"$f":"'Données élèves'!L6","v":0},{"$f":"'Données élèves'!N6","v":0},null,{"$f":"IF(((T9*Paramétrages!$B$3)*100)/(((B9*1000)*R9)/60)>100,100,((T9*Paramétrages!$B$3)*100)/(((B9*1000)*R9)/60))","v":{"$error":"#DIV/0!"}},0,null,"Erreur",0,{"$f":"'Données élèves'!R6","v":""},{"$error":"#DIV/0!"},{"$f":"IF((AVERAGE(U9,P9,K9,F9))>97,Paramétrages!$F$3,IF((AVERAGE(U9,P9,K9,F9))>95,Paramétrages!$F$4,IF((AVERAGE(U9,P9,K9,F9))>92,Paramétrages!$F$5,IF((AVERAGE(U9,P9,K9,F9))>89,Paramétrages!$F$6,IF((AVERAGE(U9,P9,K9,F9))>85,Paramétrages!$F$7,IF((AVERAGE(U9,P9,K9,F9))>82,Paramétrages!$F$8,IF((AVERAGE(U9,P9,K9,F9))>79,Paramétrages!$F$9,IF((AVERAGE(U9,P9,K9,F9))<80,Paramétrages!$F$10,\"0\"))))))))","v":{"$error":"#DIV/0!"}},{"$f":"IF((SUM(V9,Q9,L9,G9))=Paramétrages!$H$3,Paramétrages!$I$3,IF((SUM(V9,Q9,L9,G9))=Paramétrages!$H$4,Paramétrages!$I$4,IF((SUM(V9,Q9,L9,G9))=Paramétrages!$H$5,Paramétrages!$I$5,IF((SUM(V9,Q9,L9,G9))=Paramétrages!$H$6,Paramétrages!$I$6,IF((SUM(V9,Q9,L9,G9))=Paramétrages!$H$7,Paramétrages!$I$7,IF((SUM(V9,Q9,L9,G9))=Paramétrages!$H$8,Paramétrages!$I$8,IF((SUM(V9,Q9,L9,G9))=Paramétrages!$H$9,Paramétrages!$I$9,IF((SUM(V9,Q9,L9,G9))=Paramétrages!$H$10,Paramétrages!$I$10,IF((SUM(V9,Q9,L9,G9))=Paramétrages!$H$11,Paramétrages!$I$11,IF((SUM(V9,Q9,L9,G9))=Paramétrages!$H$12,Paramétrages!$I$12,IF((SUM(V9,Q9,L9,G9))>Paramétrages!$H$13,Paramétrages!$I$13,\"0\")))))))))))","v":8},0,{"$error":"#DIV/0!"}]
[{"$f":"'Données élèves'!A7","v":0},{"$f":"'Données élèves'!B7","v":0},{"$f":"'Données élèves'!C7","v":0},{"$f":"'Données élèves'!E7","v":0},null,{"$f":"IF(((E10*Paramétrages!$B$3)*100)/(((B10*1000)*C10)/60)>100,100,((E10*Paramétrages!$B$3)*100)/(((B10*1000)*C10)/60))","v":{"$error":"#DIV/0!"}},0,{"$f":"'Données élèves'!F7","v":0},{"$f":"'Données élèves'!H7","v":0},null,{"$f":"IF(((J10*Paramétrages!$B$3)*100)/(((B10*1000)*H10)/60)>100,100,((J10*Paramétrages!$B$3)*100)/(((B10*1000)*H10)/60))","v":{"$error":"#DIV/0!"}},0,{"$f":"'Données élèves'!I7","v":0},{"$f":"'Données élèves'!K7","v":0},null,{"$f":"IF(((O10*Paramétrages!$B$3)*100)/(((B10*1000)*M10)/60)>100,100,((O10*Paramétrages!$B$3)*100)/(((B10*1000)*M10)/60))","v":{"$error":"#DIV/0!"}},0,{"$f":"'Données élèves'!L7","v":0},{"$f":"'Données élèves'!N7","v":0},null,{"$f":"IF(((T10*Paramétrages!$B$3)*100)/(((B10*1000)*R10)/60)>100,100,((T10*Paramétrages!$B$3)*100)/(((B10*1000)*R10)/60))","v":{"$error":"#DIV/0!"}},0,null,"Erreur",0,{"$f":"'Données élèves'!R7","v":""},{"$error":"#DIV/0!"},{"$f":"IF((AVERAGE(U10,P10,K10,F10))>97,Paramétrages!$F$3,IF((AVERAGE(U10,P10,K10,F10))>95,Paramétrages!$F$4,IF((AVERAGE(U10,P10,K10,F10))>92,Paramétrages!$F$5,IF((AVERAGE(U10,P10,K10,F10))>89,Paramétrages!$F$6,IF((AVERAGE(U10,P10,K10,F10))>85,Paramétrages!$F$7,IF((AVERAGE(U10,P10,K10,F10))>82,Paramétrages!$F$8,IF((AVERAGE(U10,P10,K10,F10))>79,Paramétrages!$F$9,IF((AVERAGE(U10,P10,K10,F10))<80,Paramétrages!$F$10,\"0\"))))))))","v":{"$error":"#DIV/0!"}},{"$f":"IF((SUM(V10,Q10,L10,G10))=Paramétrages!$H$3,Paramétrages!$I$3,IF((SUM(V10,Q10,L10,G10))=Paramétrages!$H$4,Paramétrages!$I$4,IF((SUM(V10,Q10,L10,G10))=Paramétrages!$H$5,Paramétrages!$I$5,IF((SUM(V10,Q10,L10,G10))=Paramétrages!$H$6,Paramétrages!$I$6,IF((SUM(V10,Q10,L10,G10))=Paramétrages!$H$7,Paramétrages!$I$7,IF((SUM(V10,Q10,L10,G10))=Paramétrages!$H$8,Paramétrages!$I$8,IF((SUM(V10,Q10,L10,G10))=Paramétrages!$H$9,Paramétrages!$I$9,IF((SUM(V10,Q10,L10,G10))=Paramétrages!$H$10,Paramétrages!$I$10,IF((SUM(V10,Q10,L10,G10))=Paramétrages!$H$11,Paramétrages!$I$11,IF((SUM(V10,Q10,L10,G10))=Paramétrages!$H$12,Paramétrages!$I$12,IF((SUM(V10,Q10,L10,G10))>Paramétrages!$H$13,Paramétrages!$I$13,\"0\")))))))))))","v":8},0,{"$error":"#DIV/0!"}]
[{"$f":"'Données élèves'!A8","v":0},{"$f":"'Données élèves'!B8","v":0},{"$f":"'Données élèves'!C8","v":0},{"$f":"'Données élèves'!E8","v":0},null,{"$f":"IF(((E11*Paramétrages!$B$3)*100)/(((B11*1000)*C11)/60)>100,100,((E11*Paramétrages!$B$3)*100)/(((B11*1000)*C11)/60))","v":{"$error":"#DIV/0!"}},0,{"$f":"'Données élèves'!F8","v":0},{"$f":"'Données élèves'!H8","v":0},null,{"$f":"IF(((J11*Paramétrages!$B$3)*100)/(((B11*1000)*H11)/60)>100,100,((J11*Paramétrages!$B$3)*100)/(((B11*1000)*H11)/60))","v":{"$error":"#DIV/0!"}},0,{"$f":"'Données élèves'!I8","v":0},{"$f":"'Données élèves'!K8","v":0},null,{"$f":"IF(((O11*Paramétrages!$B$3)*100)/(((B11*1000)*M11)/60)>100,100,((O11*Paramétrages!$B$3)*100)/(((B11*1000)*M11)/60))","v":{"$error":"#DIV/0!"}},0,{"$f":"'Données élèves'!L8","v":0},{"$f":"'Données élèves'!N8","v":0},null,{"$f":"IF(((T11*Paramétrages!$B$3)*100)/(((B11*1000)*R11)/60)>100,100,((T11*Paramétrages!$B$3)*100)/(((B11*1000)*R11)/60))","v":{"$error":"#DIV/0!"}},0,null,"Erreur",0,{"$f":"'Données élèves'!R8","v":""},{"$error":"#DIV/0!"},{"$f":"IF((AVERAGE(U11,P11,K11,F11))>97,Paramétrages!$F$3,IF((AVERAGE(U11,P11,K11,F11))>95,Paramétrages!$F$4,IF((AVERAGE(U11,P11,K11,F11))>92,Paramétrages!$F$5,IF((AVERAGE(U11,P11,K11,F11))>89,Paramétrages!$F$6,IF((AVERAGE(U11,P11,K11,F11))>85,Paramétrages!$F$7,IF((AVERAGE(U11,P11,K11,F11))>82,Paramétrages!$F$8,IF((AVERAGE(U11,P11,K11,F11))>79,Paramétrages!$F$9,IF((AVERAGE(U11,P11,K11,F11))<80,Paramétrages!$F$10,\"0\"))))))))","v":{"$error":"#DIV/0!"}},{"$f":"IF((SUM(V11,Q11,L11,G11))=Paramétrages!$H$3,Paramétrages!$I$3,IF((SUM(V11,Q11,L11,G11))=Paramétrages!$H$4,Paramétrages!$I$4,IF((SUM(V11,Q11,L11,G11))=Paramétrages!$H$5,Paramétrages!$I$5,IF((SUM(V11,Q11,L11,G11))=Paramétrages!$H$6,Paramétrages!$I$6,IF((SUM(V11,Q11,L11,G11))=Paramétrages!$H$7,Paramétrages!$I$7,IF((SUM(V11,Q11,L11,G11))=Paramétrages!$H$8,Paramétrages!$I$8,IF((SUM(V11,Q11,L11,G11))=Paramétrages!$H$9,Paramétrages!$I$9,IF((SUM(V11,Q11,L11,G11))=Paramétrages!$H$10,Paramétrages!$I$10,IF((SUM(V11,Q11,L11,G11))=Paramétrages!$H$11,Paramétrages!$I$11,IF((SUM(V11,Q11,L11,G11))=Paramétrages!$H$12,Paramétrages!$I$12,IF((SUM(V11,Q11,L11,G11))>Paramétrages!$H$13,Paramétrages!$I$13,\"0\")))))))))))","v":8},0,{"$error":"#DIV/0!"}]
[{"$f":"'Données élèves'!A9","v":0},{"$f":"'Données élèves'!B9","v":0},{"$f":"'Données élèves'!C9","v":0},{"$f":"'Données élèves'!E9","v":0},null,{"$f":"IF(((E12*Paramétrages!$B$3)*100)/(((B12*1000)*C12)/60)>100,100,((E12*Paramétrages!$B$3)*100)/(((B12*1000)*C12)/60))","v":{"$error":"#DIV/0!"}},0,{"$f":"'Données élèves'!F9","v":0},{"$f":"'Données élèves'!H9","v":0},null,{"$f":"IF(((J12*Paramétrages!$B$3)*100)/(((B12*1000)*H12)/60)>100,100,((J12*Paramétrages!$B$3)*100)/(((B12*1000)*H12)/60))","v":{"$error":"#DIV/0!"}},0,{"$f":"'Données élèves'!I9","v":0},{"$f":"'Données élèves'!K9","v":0},null,{"$f":"IF(((O12*Paramétrages!$B$3)*100)/(((B12*1000)*M12)/60)>100,100,((O12*Paramétrages!$B$3)*100)/(((B12*1000)*M12)/60))","v":{"$error":"#DIV/0!"}},0,{"$f":"'Données élèves'!L9","v":0},{"$f":"'Données élèves'!N9","v":0},null,{"$f":"IF(((T12*Paramétrages!$B$3)*100)/(((B12*1000)*R12)/60)>100,100,((T12*Paramétrages!$B$3)*100)/(((B12*1000)*R12)/60))","v":{"$error":"#DIV/0!"}},0,null,"Erreur",0,{"$f":"'Données élèves'!R9","v":""},{"$error":"#DIV/0!"},{"$f":"IF((AVERAGE(U12,P12,K12,F12))>97,Paramétrages!$F$3,IF((AVERAGE(U12,P12,K12,F12))>95,Paramétrages!$F$4,IF((AVERAGE(U12,P12,K12,F12))>92,Paramétrages!$F$5,IF((AVERAGE(U12,P12,K12,F12))>89,Paramétrages!$F$6,IF((AVERAGE(U12,P12,K12,F12))>85,Paramétrages!$F$7,IF((AVERAGE(U12,P12,K12,F12))>82,Paramétrages!$F$8,IF((AVERAGE(U12,P12,K12,F12))>79,Paramétrages!$F$9,IF((AVERAGE(U12,P12,K12,F12))<80,Paramétrages!$F$10,\"0\"))))))))","v":{"$error":"#DIV/0!"}},{"$f":"IF((SUM(V12,Q12,L12,G12))=Paramétrages!$H$3,Paramétrages!$I$3,IF((SUM(V12,Q12,L12,G12))=Paramétrages!$H$4,Paramétrages!$I$4,IF((SUM(V12,Q12,L12,G12))=Paramétrages!$H$5,Paramétrages!$I$5,IF((SUM(V12,Q12,L12,G12))=Paramétrages!$H$6,Paramétrages!$I$6,IF((SUM(V12,Q12,L12,G12))=Paramétrages!$H$7,Paramétrages!$I$7,IF((SUM(V12,Q12,L12,G12))=Paramétrages!$H$8,Paramétrages!$I$8,IF((SUM(V12,Q12,L12,G12))=Paramétrages!$H$9,Paramétrages!$I$9,IF((SUM(V12,Q12,L12,G12))=Paramétrages!$H$10,Paramétrages!$I$10,IF((SUM(V12,Q12,L12,G12))=Paramétrages!$H$11,Paramétrages!$I$11,IF((SUM(V12,Q12,L12,G12))=Paramétrages!$H$12,Paramétrages!$I$12,IF((SUM(V12,Q12,L12,G12))>Paramétrages!$H$13,Paramétrages!$I$13,\"0\")))))))))))","v":8},0,{"$error":"#DIV/0!"}]
[{"$f":"'Données élèves'!A10","v":0},{"$f":"'Données élèves'!B10","v":0},{"$f":"'Données élèves'!C10","v":0},{"$f":"'Données élèves'!E10","v":0},null,{"$f":"IF(((E13*Paramétrages!$B$3)*100)/(((B13*1000)*C13)/60)>100,100,((E13*Paramétrages!$B$3)*100)/(((B13*1000)*C13)/60))","v":{"$error":"#DIV/0!"}},0,{"$f":"'Données élèves'!F10","v":0},{"$f":"'Données élèves'!H10","v":0},null,{"$f":"IF(((J13*Paramétrages!$B$3)*100)/(((B13*1000)*H13)/60)>100,100,((J13*Paramétrages!$B$3)*100)/(((B13*1000)*H13)/60))","v":{"$error":"#DIV/0!"}},0,{"$f":"'Données élèves'!I10","v":0},{"$f":"'Données élèves'!K10","v":0},null,{"$f":"IF(((O13*Paramétrages!$B$3)*100)/(((B13*1000)*M13)/60)>100,100,((O13*Paramétrages!$B$3)*100)/(((B13*1000)*M13)/60))","v":{"$error":"#DIV/0!"}},0,{"$f":"'Données élèves'!L10","v":0},{"$f":"'Données élèves'!N10","v":0},null,{"$f":"IF(((T13*Paramétrages!$B$3)*100)/(((B13*1000)*R13)/60)>100,100,((T13*Paramétrages!$B$3)*100)/(((B13*1000)*R13)/60))","v":{"$error":"#DIV/0!"}},0,null,"Erreur",0,{"$f":"'Données élèves'!R10","v":""},{"$error":"#DIV/0!"},{"$f":"IF((AVERAGE(U13,P13,K13,F13))>97,Paramétrages!$F$3,IF((AVERAGE(U13,P13,K13,F13))>95,Paramétrages!$F$4,IF((AVERAGE(U13,P13,K13,F13))>92,Paramétrages!$F$5,IF((AVERAGE(U13,P13,K13,F13))>89,Paramétrages!$F$6,IF((AVERAGE(U13,P13,K13,F13))>85,Paramétrages!$F$7,IF((AVERAGE(U13,P13,K13,F13))>82,Paramétrages!$F$8,IF((AVERAGE(U13,P13,K13,F13))>79,Paramétrages!$F$9,IF((AVERAGE(U13,P13,K13,F13))<80,Paramétrages!$F$10,\"0\"))))))))","v":{"$error":"#DIV/0!"}},{"$f":"IF((SUM(V13,Q13,L13,G13))=Paramétrages!$H$3,Paramétrages!$I$3,IF((SUM(V13,Q13,L13,G13))=Paramétrages!$H$4,Paramétrages!$I$4,IF((SUM(V13,Q13,L13,G13))=Paramétrages!$H$5,Paramétrages!$I$5,IF((SUM(V13,Q13,L13,G13))=Paramétrages!$H$6,Paramétrages!$I$6,IF((SUM(V13,Q13,L13,G13))=Paramétrages!$H$7,Paramétrages!$I$7,IF((SUM(V13,Q13,L13,G13))=Paramétrages!$H$8,Paramétrages!$I$8,IF((SUM(V13,Q13,L13,G13))=Paramétrages!$H$9,Paramétrages!$I$9,IF((SUM(V13,Q13,L13,G13))=Paramétrages!$H$10,Paramétrages!$I$10,IF((SUM(V13,Q13,L13,G13))=Paramétrages!$H$11,Paramétrages!$I$11,IF((SUM(V13,Q13,L13,G13))=Paramétrages!$H$12,Paramétrages!$I$12,IF((SUM(V13,Q13,L13,G13))>Paramétrages!$H$13,Paramétrages!$I$13,\"0\")))))))))))","v":8},0,{"$error":"#DIV/0!"}]
[{"$f":"'Données élèves'!A11","v":0},{"$f":"'Données élèves'!B11","v":0},{"$f":"'Données élèves'!C11","v":0},{"$f":"'Données élèves'!E11","v":0},null,{"$f":"IF(((E14*Paramétrages!$B$3)*100)/(((B14*1000)*C14)/60)>100,100,((E14*Paramétrages!$B$3)*100)/(((B14*1000)*C14)/60))","v":{"$error":"#DIV/0!"}},0,{"$f":"'Données élèves'!F11","v":0},{"$f":"'Données élèves'!H11","v":0},null,{"$f":"IF(((J14*Paramétrages!$B$3)*100)/(((B14*1000)*H14)/60)>100,100,((J14*Paramétrages!$B$3)*100)/(((B14*1000)*H14)/60))","v":{"$error":"#DIV/0!"}},0,{"$f":"'Données élèves'!I11","v":0},{"$f":"'Données élèves'!K11","v":0},null,{"$f":"IF(((O14*Paramétrages!$B$3)*100)/(((B14*1000)*M14)/60)>100,100,((O14*Paramétrages!$B$3)*100)/(((B14*1000)*M14)/60))","v":{"$error":"#DIV/0!"}},0,{"$f":"'Données élèves'!L11","v":0},{"$f":"'Données élèves'!N11","v":0},null,{"$f":"IF(((T14*Paramétrages!$B$3)*100)/(((B14*1000)*R14)/60)>100,100,((T14*Paramétrages!$B$3)*100)/(((B14*1000)*R14)/60))","v":{"$error":"#DIV/0!"}},0,null,"Erreur",0,{"$f":"'Données élèves'!R11","v":""},{"$error":"#DIV/0!"},{"$f":"IF((AVERAGE(U14,P14,K14,F14))>97,Paramétrages!$F$3,IF((AVERAGE(U14,P14,K14,F14))>95,Paramétrages!$F$4,IF((AVERAGE(U14,P14,K14,F14))>92,Paramétrages!$F$5,IF((AVERAGE(U14,P14,K14,F14))>89,Paramétrages!$F$6,IF((AVERAGE(U14,P14,K14,F14))>85,Paramétrages!$F$7,IF((AVERAGE(U14,P14,K14,F14))>82,Paramétrages!$F$8,IF((AVERAGE(U14,P14,K14,F14))>79,Paramétrages!$F$9,IF((AVERAGE(U14,P14,K14,F14))<80,Paramétrages!$F$10,\"0\"))))))))","v":{"$error":"#DIV/0!"}},{"$f":"IF((SUM(V14,Q14,L14,G14))=Paramétrages!$H$3,Paramétrages!$I$3,IF((SUM(V14,Q14,L14,G14))=Paramétrages!$H$4,Paramétrages!$I$4,IF((SUM(V14,Q14,L14,G14))=Paramétrages!$H$5,Paramétrages!$I$5,IF((SUM(V14,Q14,L14,G14))=Paramétrages!$H$6,Paramétrages!$I$6,IF((SUM(V14,Q14,L14,G14))=Paramétrages!$H$7,Paramétrages!$I$7,IF((SUM(V14,Q14,L14,G14))=Paramétrages!$H$8,Paramétrages!$I$8,IF((SUM(V14,Q14,L14,G14))=Paramétrages!$H$9,Paramétrages!$I$9,IF((SUM(V14,Q14,L14,G14))=Paramétrages!$H$10,Paramétrages!$I$10,IF((SUM(V14,Q14,L14,G14))=Paramétrages!$H$11,Paramétrages!$I$11,IF((SUM(V14,Q14,L14,G14))=Paramétrages!$H$12,Paramétrages!$I$12,IF((SUM(V14,Q14,L14,G14))>Paramétrages!$H$13,Paramétrages!$I$13,\"0\")))))))))))","v":8},0,{"$error":"#DIV/0!"}]
[{"$f":"'Données élèves'!A12","v":0},{"$f":"'Données élèves'!B12","v":0},{"$f":"'Données élèves'!C12","v":0},{"$f":"'Données élèves'!E12","v":0},null,{"$f":"IF(((E15*Paramétrages!$B$3)*100)/(((B15*1000)*C15)/60)>100,100,((E15*Paramétrages!$B$3)*100)/(((B15*1000)*C15)/60))","v":{"$error":"#DIV/0!"}},0,{"$f":"'Données élèves'!F12","v":0},{"$f":"'Données élèves'!H12","v":0},null,{"$f":"IF(((J15*Paramétrages!$B$3)*100)/(((B15*1000)*H15)/60)>100,100,((J15*Paramétrages!$B$3)*100)/(((B15*1000)*H15)/60))","v":{"$error":"#DIV/0!"}},0,{"$f":"'Données élèves'!I12","v":0},{"$f":"'Données élèves'!K12","v":0},null,{"$f":"IF(((O15*Paramétrages!$B$3)*100)/(((B15*1000)*M15)/60)>100,100,((O15*Paramétrages!$B$3)*100)/(((B15*1000)*M15)/60))","v":{"$error":"#DIV/0!"}},0,{"$f":"'Données élèves'!L12","v":0},{"$f":"'Données élèves'!N12","v":0},null,{"$f":"IF(((T15*Paramétrages!$B$3)*100)/(((B15*1000)*R15)/60)>100,100,((T15*Paramétrages!$B$3)*100)/(((B15*1000)*R15)/60))","v":{"$error":"#DIV/0!"}},0,null,"Erreur",0,{"$f":"'Données élèves'!R12","v":""},{"$error":"#DIV/0!"},{"$f":"IF((AVERAGE(U15,P15,K15,F15))>97,Paramétrages!$F$3,IF((AVERAGE(U15,P15,K15,F15))>95,Paramétrages!$F$4,IF((AVERAGE(U15,P15,K15,F15))>92,Paramétrages!$F$5,IF((AVERAGE(U15,P15,K15,F15))>89,Paramétrages!$F$6,IF((AVERAGE(U15,P15,K15,F15))>85,Paramétrages!$F$7,IF((AVERAGE(U15,P15,K15,F15))>82,Paramétrages!$F$8,IF((AVERAGE(U15,P15,K15,F15))>79,Paramétrages!$F$9,IF((AVERAGE(U15,P15,K15,F15))<80,Paramétrages!$F$10,\"0\"))))))))","v":{"$error":"#DIV/0!"}},{"$f":"IF((SUM(V15,Q15,L15,G15))=Paramétrages!$H$3,Paramétrages!$I$3,IF((SUM(V15,Q15,L15,G15))=Paramétrages!$H$4,Paramétrages!$I$4,IF((SUM(V15,Q15,L15,G15))=Paramétrages!$H$5,Paramétrages!$I$5,IF((SUM(V15,Q15,L15,G15))=Paramétrages!$H$6,Paramétrages!$I$6,IF((SUM(V15,Q15,L15,G15))=Paramétrages!$H$7,Paramétrages!$I$7,IF((SUM(V15,Q15,L15,G15))=Paramétrages!$H$8,Paramétrages!$I$8,IF((SUM(V15,Q15,L15,G15))=Paramétrages!$H$9,Paramétrages!$I$9,IF((SUM(V15,Q15,L15,G15))=Paramétrages!$H$10,Paramétrages!$I$10,IF((SUM(V15,Q15,L15,G15))=Paramétrages!$H$11,Paramétrages!$I$11,IF((SUM(V15,Q15,L15,G15))=Paramétrages!$H$12,Paramétrages!$I$12,IF((SUM(V15,Q15,L15,G15))>Paramétrages!$H$13,Paramétrages!$I$13,\"0\")))))))))))","v":8},0,{"$error":"#DIV/0!"}]
[{"$f":"'Données élèves'!A13","v":0},{"$f":"'Données élèves'!B13","v":0},{"$f":"'Données élèves'!C13","v":0},{"$f":"'Données élèves'!E13","v":0},null,{"$f":"IF(((E16*Paramétrages!$B$3)*100)/(((B16*1000)*C16)/60)>100,100,((E16*Paramétrages!$B$3)*100)/(((B16*1000)*C16)/60))","v":{"$error":"#DIV/0!"}},0,{"$f":"'Données élèves'!F13","v":0},{"$f":"'Données élèves'!H13","v":0},null,{"$f":"IF(((J16*Paramétrages!$B$3)*100)/(((B16*1000)*H16)/60)>100,100,((J16*Paramétrages!$B$3)*100)/(((B16*1000)*H16)/60))","v":{"$error":"#DIV/0!"}},0,{"$f":"'Données élèves'!I13","v":0},{"$f":"'Données élèves'!K13","v":0},null,{"$f":"IF(((O16*Paramétrages!$B$3)*100)/(((B16*1000)*M16)/60)>100,100,((O16*Paramétrages!$B$3)*100)/(((B16*1000)*M16)/60))","v":{"$error":"#DIV/0!"}},0,{"$f":"'Données élèves'!L13","v":0},{"$f":"'Données élèves'!N13","v":0},null,{"$f":"IF(((T16*Paramétrages!$B$3)*100)/(((B16*1000)*R16)/60)>100,100,((T16*Paramétrages!$B$3)*100)/(((B16*1000)*R16)/60))","v":{"$error":"#DIV/0!"}},0,null,"Erreur",0,{"$f":"'Données élèves'!R13","v":""},{"$error":"#DIV/0!"},{"$f":"IF((AVERAGE(U16,P16,K16,F16))>97,Paramétrages!$F$3,IF((AVERAGE(U16,P16,K16,F16))>95,Paramétrages!$F$4,IF((AVERAGE(U16,P16,K16,F16))>92,Paramétrages!$F$5,IF((AVERAGE(U16,P16,K16,F16))>89,Paramétrages!$F$6,IF((AVERAGE(U16,P16,K16,F16))>85,Paramétrages!$F$7,IF((AVERAGE(U16,P16,K16,F16))>82,Paramétrages!$F$8,IF((AVERAGE(U16,P16,K16,F16))>79,Paramétrages!$F$9,IF((AVERAGE(U16,P16,K16,F16))<80,Paramétrages!$F$10,\"0\"))))))))","v":{"$error":"#DIV/0!"}},{"$f":"IF((SUM(V16,Q16,L16,G16))=Paramétrages!$H$3,Paramétrages!$I$3,IF((SUM(V16,Q16,L16,G16))=Paramétrages!$H$4,Paramétrages!$I$4,IF((SUM(V16,Q16,L16,G16))=Paramétrages!$H$5,Paramétrages!$I$5,IF((SUM(V16,Q16,L16,G16))=Paramétrages!$H$6,Paramétrages!$I$6,IF((SUM(V16,Q16,L16,G16))=Paramétrages!$H$7,Paramétrages!$I$7,IF((SUM(V16,Q16,L16,G16))=Paramétrages!$H$8,Paramétrages!$I$8,IF((SUM(V16,Q16,L16,G16))=Paramétrages!$H$9,Paramétrages!$I$9,IF((SUM(V16,Q16,L16,G16))=Paramétrages!$H$10,Paramétrages!$I$10,IF((SUM(V16,Q16,L16,G16))=Paramétrages!$H$11,Paramétrages!$I$11,IF((SUM(V16,Q16,L16,G16))=Paramétrages!$H$12,Paramétrages!$I$12,IF((SUM(V16,Q16,L16,G16))>Paramétrages!$H$13,Paramétrages!$I$13,\"0\")))))))))))","v":8},0,{"$error":"#DIV/0!"}]
[{"$f":"'Données élèves'!A14","v":0},{"$f":"'Données élèves'!B14","v":0},{"$f":"'Données élèves'!C14","v":0},{"$f":"'Données élèves'!E14","v":0},null,{"$f":"IF(((E17*Paramétrages!$B$3)*100)/(((B17*1000)*C17)/60)>100,100,((E17*Paramétrages!$B$3)*100)/(((B17*1000)*C17)/60))","v":{"$error":"#DIV/0!"}},0,{"$f":"'Données élèves'!F14","v":0},{"$f":"'Données élèves'!H14","v":0},null,{"$f":"IF(((J17*Paramétrages!$B$3)*100)/(((B17*1000)*H17)/60)>100,100,((J17*Paramétrages!$B$3)*100)/(((B17*1000)*H17)/60))","v":{"$error":"#DIV/0!"}},0,{"$f":"'Données élèves'!I14","v":0},{"$f":"'Données élèves'!K14","v":0},null,{"$f":"IF(((O17*Paramétrages!$B$3)*100)/(((B17*1000)*M17)/60)>100,100,((O17*Paramétrages!$B$3)*100)/(((B17*1000)*M17)/60))","v":{"$error":"#DIV/0!"}},0,{"$f":"'Données élèves'!L14","v":0},{"$f":"'Données élèves'!N14","v":0},null,{"$f":"IF(((T17*Paramétrages!$B$3)*100)/(((B17*1000)*R17)/60)>100,100,((T17*Paramétrages!$B$3)*100)/(((B17*1000)*R17)/60))","v":{"$error":"#DIV/0!"}},0,null,"Erreur",0,{"$f":"'Données élèves'!R14","v":""},{"$error":"#DIV/0!"},{"$f":"IF((AVERAGE(U17,P17,K17,F17))>97,Paramétrages!$F$3,IF((AVERAGE(U17,P17,K17,F17))>95,Paramétrages!$F$4,IF((AVERAGE(U17,P17,K17,F17))>92,Paramétrages!$F$5,IF((AVERAGE(U17,P17,K17,F17))>89,Paramétrages!$F$6,IF((AVERAGE(U17,P17,K17,F17))>85,Paramétrages!$F$7,IF((AVERAGE(U17,P17,K17,F17))>82,Paramétrages!$F$8,IF((AVERAGE(U17,P17,K17,F17))>79,Paramétrages!$F$9,IF((AVERAGE(U17,P17,K17,F17))<80,Paramétrages!$F$10,\"0\"))))))))","v":{"$error":"#DIV/0!"}},{"$f":"IF((SUM(V17,Q17,L17,G17))=Paramétrages!$H$3,Paramétrages!$I$3,IF((SUM(V17,Q17,L17,G17))=Paramétrages!$H$4,Paramétrages!$I$4,IF((SUM(V17,Q17,L17,G17))=Paramétrages!$H$5,Paramétrages!$I$5,IF((SUM(V17,Q17,L17,G17))=Paramétrages!$H$6,Paramétrages!$I$6,IF((SUM(V17,Q17,L17,G17))=Paramétrages!$H$7,Paramétrages!$I$7,IF((SUM(V17,Q17,L17,G17))=Paramétrages!$H$8,Paramétrages!$I$8,IF((SUM(V17,Q17,L17,G17))=Paramétrages!$H$9,Paramétrages!$I$9,IF((SUM(V17,Q17,L17,G17))=Paramétrages!$H$10,Paramétrages!$I$10,IF((SUM(V17,Q17,L17,G17))=Paramétrages!$H$11,Paramétrages!$I$11,IF((SUM(V17,Q17,L17,G17))=Paramétrages!$H$12,Paramétrages!$I$12,IF((SUM(V17,Q17,L17,G17))>Paramétrages!$H$13,Paramétrages!$I$13,\"0\")))))))))))","v":8},0,{"$error":"#DIV/0!"}]
[{"$f":"'Données élèves'!A15","v":0},{"$f":"'Données élèves'!B15","v":0},{"$f":"'Données élèves'!C15","v":0},{"$f":"'Données élèves'!E15","v":0},null,{"$f":"IF(((E18*Paramétrages!$B$3)*100)/(((B18*1000)*C18)/60)>100,100,((E18*Paramétrages!$B$3)*100)/(((B18*1000)*C18)/60))","v":{"$error":"#DIV/0!"}},0,{"$f":"'Données élèves'!F15","v":0},{"$f":"'Données élèves'!H15","v":0},null,{"$f":"IF(((J18*Paramétrages!$B$3)*100)/(((B18*1000)*H18)/60)>100,100,((J18*Paramétrages!$B$3)*100)/(((B18*1000)*H18)/60))","v":{"$error":"#DIV/0!"}},0,{"$f":"'Données élèves'!I15","v":0},{"$f":"'Données élèves'!K15","v":0},null,{"$f":"IF(((O18*Paramétrages!$B$3)*100)/(((B18*1000)*M18)/60)>100,100,((O18*Paramétrages!$B$3)*100)/(((B18*1000)*M18)/60))","v":{"$error":"#DIV/0!"}},0,{"$f":"'Données élèves'!L15","v":0},{"$f":"'Données élèves'!N15","v":0},null,{"$f":"IF(((T18*Paramétrages!$B$3)*100)/(((B18*1000)*R18)/60)>100,100,((T18*Paramétrages!$B$3)*100)/(((B18*1000)*R18)/60))","v":{"$error":"#DIV/0!"}},0,null,"Erreur",0,{"$f":"'Données élèves'!R15","v":""},{"$error":"#DIV/0!"},{"$f":"IF((AVERAGE(U18,P18,K18,F18))>97,Paramétrages!$F$3,IF((AVERAGE(U18,P18,K18,F18))>95,Paramétrages!$F$4,IF((AVERAGE(U18,P18,K18,F18))>92,Paramétrages!$F$5,IF((AVERAGE(U18,P18,K18,F18))>89,Paramétrages!$F$6,IF((AVERAGE(U18,P18,K18,F18))>85,Paramétrages!$F$7,IF((AVERAGE(U18,P18,K18,F18))>82,Paramétrages!$F$8,IF((AVERAGE(U18,P18,K18,F18))>79,Paramétrages!$F$9,IF((AVERAGE(U18,P18,K18,F18))<80,Paramétrages!$F$10,\"0\"))))))))","v":{"$error":"#DIV/0!"}},{"$f":"IF((SUM(V18,Q18,L18,G18))=Paramétrages!$H$3,Paramétrages!$I$3,IF((SUM(V18,Q18,L18,G18))=Paramétrages!$H$4,Paramétrages!$I$4,IF((SUM(V18,Q18,L18,G18))=Paramétrages!$H$5,Paramétrages!$I$5,IF((SUM(V18,Q18,L18,G18))=Paramétrages!$H$6,Paramétrages!$I$6,IF((SUM(V18,Q18,L18,G18))=Paramétrages!$H$7,Paramétrages!$I$7,IF((SUM(V18,Q18,L18,G18))=Paramétrages!$H$8,Paramétrages!$I$8,IF((SUM(V18,Q18,L18,G18))=Paramétrages!$H$9,Paramétrages!$I$9,IF((SUM(V18,Q18,L18,G18))=Paramétrages!$H$10,Paramétrages!$I$10,IF((SUM(V18,Q18,L18,G18))=Paramétrages!$H$11,Paramétrages!$I$11,IF((SUM(V18,Q18,L18,G18))=Paramétrages!$H$12,Paramétrages!$I$12,IF((SUM(V18,Q18,L18,G18))>Paramétrages!$H$13,Paramétrages!$I$13,\"0\")))))))))))","v":8},0,{"$error":"#DIV/0!"}]
[{"$f":"'Données élèves'!A16","v":0},{"$f":"'Données élèves'!B16","v":0},{"$f":"'Données élèves'!C16","v":0},{"$f":"'Données élèves'!E16","v":0},null,{"$f":"IF(((E19*Paramétrages!$B$3)*100)/(((B19*1000)*C19)/60)>100,100,((E19*Paramétrages!$B$3)*100)/(((B19*1000)*C19)/60))","v":{"$error":"#DIV/0!"}},0,{"$f":"'Données élèves'!F16","v":0},{"$f":"'Données élèves'!H16","v":0},null,{"$f":"IF(((J19*Paramétrages!$B$3)*100)/(((B19*1000)*H19)/60)>100,100,((J19*Paramétrages!$B$3)*100)/(((B19*1000)*H19)/60))","v":{"$error":"#DIV/0!"}},0,{"$f":"'Données élèves'!I16","v":0},{"$f":"'Données élèves'!K16","v":0},null,{"$f":"IF(((O19*Paramétrages!$B$3)*100)/(((B19*1000)*M19)/60)>100,100,((O19*Paramétrages!$B$3)*100)/(((B19*1000)*M19)/60))","v":{"$error":"#DIV/0!"}},0,{"$f":"'Données élèves'!L16","v":0},{"$f":"'Données élèves'!N16","v":0},null,{"$f":"IF(((T19*Paramétrages!$B$3)*100)/(((B19*1000)*R19)/60)>100,100,((T19*Paramétrages!$B$3)*100)/(((B19*1000)*R19)/60))","v":{"$error":"#DIV/0!"}},0,null,"Erreur",0,{"$f":"'Données élèves'!R16","v":""},{"$error":"#DIV/0!"},{"$f":"IF((AVERAGE(U19,P19,K19,F19))>97,Paramétrages!$F$3,IF((AVERAGE(U19,P19,K19,F19))>95,Paramétrages!$F$4,IF((AVERAGE(U19,P19,K19,F19))>92,Paramétrages!$F$5,IF((AVERAGE(U19,P19,K19,F19))>89,Paramétrages!$F$6,IF((AVERAGE(U19,P19,K19,F19))>85,Paramétrages!$F$7,IF((AVERAGE(U19,P19,K19,F19))>82,Paramétrages!$F$8,IF((AVERAGE(U19,P19,K19,F19))>79,Paramétrages!$F$9,IF((AVERAGE(U19,P19,K19,F19))<80,Paramétrages!$F$10,\"0\"))))))))","v":{"$error":"#DIV/0!"}},{"$f":"IF((SUM(V19,Q19,L19,G19))=Paramétrages!$H$3,Paramétrages!$I$3,IF((SUM(V19,Q19,L19,G19))=Paramétrages!$H$4,Paramétrages!$I$4,IF((SUM(V19,Q19,L19,G19))=Paramétrages!$H$5,Paramétrages!$I$5,IF((SUM(V19,Q19,L19,G19))=Paramétrages!$H$6,Paramétrages!$I$6,IF((SUM(V19,Q19,L19,G19))=Paramétrages!$H$7,Paramétrages!$I$7,IF((SUM(V19,Q19,L19,G19))=Paramétrages!$H$8,Paramétrages!$I$8,IF((SUM(V19,Q19,L19,G19))=Paramétrages!$H$9,Paramétrages!$I$9,IF((SUM(V19,Q19,L19,G19))=Paramétrages!$H$10,Paramétrages!$I$10,IF((SUM(V19,Q19,L19,G19))=Paramétrages!$H$11,Paramétrages!$I$11,IF((SUM(V19,Q19,L19,G19))=Paramétrages!$H$12,Paramétrages!$I$12,IF((SUM(V19,Q19,L19,G19))>Paramétrages!$H$13,Paramétrages!$I$13,\"0\")))))))))))","v":8},0,{"$error":"#DIV/0!"}]
[{"$f":"'Données élèves'!A17","v":0},{"$f":"'Données élèves'!B17","v":0},{"$f":"'Données élèves'!C17","v":0},{"$f":"'Données élèves'!E17","v":0},null,{"$f":"IF(((E20*Paramétrages!$B$3)*100)/(((B20*1000)*C20)/60)>100,100,((E20*Paramétrages!$B$3)*100)/(((B20*1000)*C20)/60))","v":{"$error":"#DIV/0!"}},0,{"$f":"'Données élèves'!F17","v":0},{"$f":"'Données élèves'!H17","v":0},null,{"$f":"IF(((J20*Paramétrages!$B$3)*100)/(((B20*1000)*H20)/60)>100,100,((J20*Paramétrages!$B$3)*100)/(((B20*1000)*H20)/60))","v":{"$error":"#DIV/0!"}},0,{"$f":"'Données élèves'!I17","v":0},{"$f":"'Données élèves'!K17","v":0},null,{"$f":"IF(((O20*Paramétrages!$B$3)*100)/(((B20*1000)*M20)/60)>100,100,((O20*Paramétrages!$B$3)*100)/(((B20*1000)*M20)/60))","v":{"$error":"#DIV/0!"}},0,{"$f":"'Données élèves'!L17","v":0},{"$f":"'Données élèves'!N17","v":0},null,{"$f":"IF(((T20*Paramétrages!$B$3)*100)/(((B20*1000)*R20)/60)>100,100,((T20*Paramétrages!$B$3)*100)/(((B20*1000)*R20)/60))","v":{"$error":"#DIV/0!"}},0,null,{"$f":"IF((SUM(C20,H20,M20,R20))>15,\"Erreur\",IF((SUM(C20,H20,M20,R20))<12,\"Erreur\",(SUM(C20,H20,M20,R20))))","v":"Erreur"},0,{"$f":"'Données élèves'!R17","v":""},{"$error":"#DIV/0!"},{"$f":"IF((AVERAGE(U20,P20,K20,F20))>97,Paramétrages!$F$3,IF((AVERAGE(U20,P20,K20,F20))>95,Paramétrages!$F$4,IF((AVERAGE(U20,P20,K20,F20))>92,Paramétrages!$F$5,IF((AVERAGE(U20,P20,K20,F20))>89,Paramétrages!$F$6,IF((AVERAGE(U20,P20,K20,F20))>85,Paramétrages!$F$7,IF((AVERAGE(U20,P20,K20,F20))>82,Paramétrages!$F$8,IF((AVERAGE(U20,P20,K20,F20))>79,Paramétrages!$F$9,IF((AVERAGE(U20,P20,K20,F20))<80,Paramétrages!$F$10,\"0\"))))))))","v":{"$error":"#DIV/0!"}},{"$f":"IF((SUM(V20,Q20,L20,G20))=Paramétrages!$H$3,Paramétrages!$I$3,IF((SUM(V20,Q20,L20,G20))=Paramétrages!$H$4,Paramétrages!$I$4,IF((SUM(V20,Q20,L20,G20))=Paramétrages!$H$5,Paramétrages!$I$5,IF((SUM(V20,Q20,L20,G20))=Paramétrages!$H$6,Paramétrages!$I$6,IF((SUM(V20,Q20,L20,G20))=Paramétrages!$H$7,Paramétrages!$I$7,IF((SUM(V20,Q20,L20,G20))=Paramétrages!$H$8,Paramétrages!$I$8,IF((SUM(V20,Q20,L20,G20))=Paramétrages!$H$9,Paramétrages!$I$9,IF((SUM(V20,Q20,L20,G20))=Paramétrages!$H$10,Paramétrages!$I$10,IF((SUM(V20,Q20,L20,G20))=Paramétrages!$H$11,Paramétrages!$I$11,IF((SUM(V20,Q20,L20,G20))=Paramétrages!$H$12,Paramétrages!$I$12,IF((SUM(V20,Q20,L20,G20))>Paramétrages!$H$13,Paramétrages!$I$13,\"0\")))))))))))","v":8},0,{"$f":"SUM(AB20:AD20)","v":{"$error":"#DIV/0!"}}]
[{"$f":"'Données élèves'!A18","v":0},{"$f":"'Données élèves'!B18","v":0},{"$f":"'Données élèves'!C18","v":0},{"$f":"'Données élèves'!E18","v":0},null,{"$f":"IF(((E21*Paramétrages!$B$3)*100)/(((B21*1000)*C21)/60)>100,100,((E21*Paramétrages!$B$3)*100)/(((B21*1000)*C21)/60))","v":{"$error":"#DIV/0!"}},0,{"$f":"'Données élèves'!F18","v":0},{"$f":"'Données élèves'!H18","v":0},null,{"$f":"IF(((J21*Paramétrages!$B$3)*100)/(((B21*1000)*H21)/60)>100,100,((J21*Paramétrages!$B$3)*100)/(((B21*1000)*H21)/60))","v":{"$error":"#DIV/0!"}},0,{"$f":"'Données élèves'!I18","v":0},{"$f":"'Données élèves'!K18","v":0},null,{"$f":"IF(((O21*Paramétrages!$B$3)*100)/(((B21*1000)*M21)/60)>100,100,((O21*Paramétrages!$B$3)*100)/(((B21*1000)*M21)/60))","v":{"$error":"#DIV/0!"}},0,{"$f":"'Données élèves'!L18","v":0},{"$f":"'Données élèves'!N18","v":0},null,{"$f":"IF(((T21*Paramétrages!$B$3)*100)/(((B21*1000)*R21)/60)>100,100,((T21*Paramétrages!$B$3)*100)/(((B21*1000)*R21)/60))","v":{"$error":"#DIV/0!"}},0,null,"Erreur",0,{"$f":"'Données élèves'!R18","v":""},{"$error":"#DIV/0!"},{"$f":"IF((AVERAGE(U21,P21,K21,F21))>97,Paramétrages!$F$3,IF((AVERAGE(U21,P21,K21,F21))>95,Paramétrages!$F$4,IF((AVERAGE(U21,P21,K21,F21))>92,Paramétrages!$F$5,IF((AVERAGE(U21,P21,K21,F21))>89,Paramétrages!$F$6,IF((AVERAGE(U21,P21,K21,F21))>85,Paramétrages!$F$7,IF((AVERAGE(U21,P21,K21,F21))>82,Paramétrages!$F$8,IF((AVERAGE(U21,P21,K21,F21))>79,Paramétrages!$F$9,IF((AVERAGE(U21,P21,K21,F21))<80,Paramétrages!$F$10,\"0\"))))))))","v":{"$error":"#DIV/0!"}},{"$f":"IF((SUM(V21,Q21,L21,G21))=Paramétrages!$H$3,Paramétrages!$I$3,IF((SUM(V21,Q21,L21,G21))=Paramétrages!$H$4,Paramétrages!$I$4,IF((SUM(V21,Q21,L21,G21))=Paramétrages!$H$5,Paramétrages!$I$5,IF((SUM(V21,Q21,L21,G21))=Paramétrages!$H$6,Paramétrages!$I$6,IF((SUM(V21,Q21,L21,G21))=Paramétrages!$H$7,Paramétrages!$I$7,IF((SUM(V21,Q21,L21,G21))=Paramétrages!$H$8,Paramétrages!$I$8,IF((SUM(V21,Q21,L21,G21))=Paramétrages!$H$9,Paramétrages!$I$9,IF((SUM(V21,Q21,L21,G21))=Paramétrages!$H$10,Paramétrages!$I$10,IF((SUM(V21,Q21,L21,G21))=Paramétrages!$H$11,Paramétrages!$I$11,IF((SUM(V21,Q21,L21,G21))=Paramétrages!$H$12,Paramétrages!$I$12,IF((SUM(V21,Q21,L21,G21))>Paramétrages!$H$13,Paramétrages!$I$13,\"0\")))))))))))","v":8},0,{"$error":"#DIV/0!"}]
[{"$f":"'Données élèves'!A19","v":0},{"$f":"'Données élèves'!B19","v":0},{"$f":"'Données élèves'!C19","v":0},{"$f":"'Données élèves'!E19","v":0},null,{"$f":"IF(((E22*Paramétrages!$B$3)*100)/(((B22*1000)*C22)/60)>100,100,((E22*Paramétrages!$B$3)*100)/(((B22*1000)*C22)/60))","v":{"$error":"#DIV/0!"}},0,{"$f":"'Données élèves'!F19","v":0},{"$f":"'Données élèves'!H19","v":0},null,{"$f":"IF(((J22*Paramétrages!$B$3)*100)/(((B22*1000)*H22)/60)>100,100,((J22*Paramétrages!$B$3)*100)/(((B22*1000)*H22)/60))","v":{"$error":"#DIV/0!"}},0,{"$f":"'Données élèves'!I19","v":0},{"$f":"'Données élèves'!K19","v":0},null,{"$f":"IF(((O22*Paramétrages!$B$3)*100)/(((B22*1000)*M22)/60)>100,100,((O22*Paramétrages!$B$3)*100)/(((B22*1000)*M22)/60))","v":{"$error":"#DIV/0!"}},0,{"$f":"'Données élèves'!L19","v":0},{"$f":"'Données élèves'!N19","v":0},null,{"$f":"IF(((T22*Paramétrages!$B$3)*100)/(((B22*1000)*R22)/60)>100,100,((T22*Paramétrages!$B$3)*100)/(((B22*1000)*R22)/60))","v":{"$error":"#DIV/0!"}},0,null,"Erreur",0,{"$f":"'Données élèves'!R19","v":""},{"$error":"#DIV/0!"},{"$f":"IF((AVERAGE(U22,P22,K22,F22))>97,Paramétrages!$F$3,IF((AVERAGE(U22,P22,K22,F22))>95,Paramétrages!$F$4,IF((AVERAGE(U22,P22,K22,F22))>92,Paramétrages!$F$5,IF((AVERAGE(U22,P22,K22,F22))>89,Paramétrages!$F$6,IF((AVERAGE(U22,P22,K22,F22))>85,Paramétrages!$F$7,IF((AVERAGE(U22,P22,K22,F22))>82,Paramétrages!$F$8,IF((AVERAGE(U22,P22,K22,F22))>79,Paramétrages!$F$9,IF((AVERAGE(U22,P22,K22,F22))<80,Paramétrages!$F$10,\"0\"))))))))","v":{"$error":"#DIV/0!"}},{"$f":"IF((SUM(V22,Q22,L22,G22))=Paramétrages!$H$3,Paramétrages!$I$3,IF((SUM(V22,Q22,L22,G22))=Paramétrages!$H$4,Paramétrages!$I$4,IF((SUM(V22,Q22,L22,G22))=Paramétrages!$H$5,Paramétrages!$I$5,IF((SUM(V22,Q22,L22,G22))=Paramétrages!$H$6,Paramétrages!$I$6,IF((SUM(V22,Q22,L22,G22))=Paramétrages!$H$7,Paramétrages!$I$7,IF((SUM(V22,Q22,L22,G22))=Paramétrages!$H$8,Paramétrages!$I$8,IF((SUM(V22,Q22,L22,G22))=Paramétrages!$H$9,Paramétrages!$I$9,IF((SUM(V22,Q22,L22,G22))=Paramétrages!$H$10,Paramétrages!$I$10,IF((SUM(V22,Q22,L22,G22))=Paramétrages!$H$11,Paramétrages!$I$11,IF((SUM(V22,Q22,L22,G22))=Paramétrages!$H$12,Paramétrages!$I$12,IF((SUM(V22,Q22,L22,G22))>Paramétrages!$H$13,Paramétrages!$I$13,\"0\")))))))))))","v":8},0,{"$error":"#DIV/0!"}]
[{"$f":"'Données élèves'!A20","v":0},{"$f":"'Données élèves'!B20","v":0},{"$f":"'Données élèves'!C20","v":0},{"$f":"'Données élèves'!E20","v":0},null,{"$f":"IF(((E23*Paramétrages!$B$3)*100)/(((B23*1000)*C23)/60)>100,100,((E23*Paramétrages!$B$3)*100)/(((B23*1000)*C23)/60))","v":{"$error":"#DIV/0!"}},0,{"$f":"'Données élèves'!F20","v":0},{"$f":"'Données élèves'!H20","v":0},null,{"$f":"IF(((J23*Paramétrages!$B$3)*100)/(((B23*1000)*H23)/60)>100,100,((J23*Paramétrages!$B$3)*100)/(((B23*1000)*H23)/60))","v":{"$error":"#DIV/0!"}},0,{"$f":"'Données élèves'!I20","v":0},{"$f":"'Données élèves'!K20","v":0},null,{"$f":"IF(((O23*Paramétrages!$B$3)*100)/(((B23*1000)*M23)/60)>100,100,((O23*Paramétrages!$B$3)*100)/(((B23*1000)*M23)/60))","v":{"$error":"#DIV/0!"}},0,{"$f":"'Données élèves'!L20","v":0},{"$f":"'Données élèves'!N20","v":0},null,{"$f":"IF(((T23*Paramétrages!$B$3)*100)/(((B23*1000)*R23)/60)>100,100,((T23*Paramétrages!$B$3)*100)/(((B23*1000)*R23)/60))","v":{"$error":"#DIV/0!"}},0,null,"Erreur",0,{"$f":"'Données élèves'!R20","v":""},{"$error":"#DIV/0!"},{"$f":"IF((AVERAGE(U23,P23,K23,F23))>97,Paramétrages!$F$3,IF((AVERAGE(U23,P23,K23,F23))>95,Paramétrages!$F$4,IF((AVERAGE(U23,P23,K23,F23))>92,Paramétrages!$F$5,IF((AVERAGE(U23,P23,K23,F23))>89,Paramétrages!$F$6,IF((AVERAGE(U23,P23,K23,F23))>85,Paramétrages!$F$7,IF((AVERAGE(U23,P23,K23,F23))>82,Paramétrages!$F$8,IF((AVERAGE(U23,P23,K23,F23))>79,Paramétrages!$F$9,IF((AVERAGE(U23,P23,K23,F23))<80,Paramétrages!$F$10,\"0\"))))))))","v":{"$error":"#DIV/0!"}},{"$f":"IF((SUM(V23,Q23,L23,G23))=Paramétrages!$H$3,Paramétrages!$I$3,IF((SUM(V23,Q23,L23,G23))=Paramétrages!$H$4,Paramétrages!$I$4,IF((SUM(V23,Q23,L23,G23))=Paramétrages!$H$5,Paramétrages!$I$5,IF((SUM(V23,Q23,L23,G23))=Paramétrages!$H$6,Paramétrages!$I$6,IF((SUM(V23,Q23,L23,G23))=Paramétrages!$H$7,Paramétrages!$I$7,IF((SUM(V23,Q23,L23,G23))=Paramétrages!$H$8,Paramétrages!$I$8,IF((SUM(V23,Q23,L23,G23))=Paramétrages!$H$9,Paramétrages!$I$9,IF((SUM(V23,Q23,L23,G23))=Paramétrages!$H$10,Paramétrages!$I$10,IF((SUM(V23,Q23,L23,G23))=Paramétrages!$H$11,Paramétrages!$I$11,IF((SUM(V23,Q23,L23,G23))=Paramétrages!$H$12,Paramétrages!$I$12,IF((SUM(V23,Q23,L23,G23))>Paramétrages!$H$13,Paramétrages!$I$13,\"0\")))))))))))","v":8},0,{"$error":"#DIV/0!"}]
[{"$f":"'Données élèves'!A21","v":0},{"$f":"'Données élèves'!B21","v":0},{"$f":"'Données élèves'!C21","v":0},{"$f":"'Données élèves'!E21","v":0},null,{"$f":"IF(((E24*Paramétrages!$B$3)*100)/(((B24*1000)*C24)/60)>100,100,((E24*Paramétrages!$B$3)*100)/(((B24*1000)*C24)/60))","v":{"$error":"#DIV/0!"}},0,{"$f":"'Données élèves'!F21","v":0},{"$f":"'Données élèves'!H21","v":0},null,{"$f":"IF(((J24*Paramétrages!$B$3)*100)/(((B24*1000)*H24)/60)>100,100,((J24*Paramétrages!$B$3)*100)/(((B24*1000)*H24)/60))","v":{"$error":"#DIV/0!"}},0,{"$f":"'Données élèves'!I21","v":0},{"$f":"'Données élèves'!K21","v":0},null,{"$f":"IF(((O24*Paramétrages!$B$3)*100)/(((B24*1000)*M24)/60)>100,100,((O24*Paramétrages!$B$3)*100)/(((B24*1000)*M24)/60))","v":{"$error":"#DIV/0!"}},0,{"$f":"'Données élèves'!L21","v":0},{"$f":"'Données élèves'!N21","v":0},null,{"$f":"IF(((T24*Paramétrages!$B$3)*100)/(((B24*1000)*R24)/60)>100,100,((T24*Paramétrages!$B$3)*100)/(((B24*1000)*R24)/60))","v":{"$error":"#DIV/0!"}},0,null,"Erreur",0,{"$f":"'Données élèves'!R21","v":""},{"$error":"#DIV/0!"},{"$f":"IF((AVERAGE(U24,P24,K24,F24))>97,Paramétrages!$F$3,IF((AVERAGE(U24,P24,K24,F24))>95,Paramétrages!$F$4,IF((AVERAGE(U24,P24,K24,F24))>92,Paramétrages!$F$5,IF((AVERAGE(U24,P24,K24,F24))>89,Paramétrages!$F$6,IF((AVERAGE(U24,P24,K24,F24))>85,Paramétrages!$F$7,IF((AVERAGE(U24,P24,K24,F24))>82,Paramétrages!$F$8,IF((AVERAGE(U24,P24,K24,F24))>79,Paramétrages!$F$9,IF((AVERAGE(U24,P24,K24,F24))<80,Paramétrages!$F$10,\"0\"))))))))","v":{"$error":"#DIV/0!"}},{"$f":"IF((SUM(V24,Q24,L24,G24))=Paramétrages!$H$3,Paramétrages!$I$3,IF((SUM(V24,Q24,L24,G24))=Paramétrages!$H$4,Paramétrages!$I$4,IF((SUM(V24,Q24,L24,G24))=Paramétrages!$H$5,Paramétrages!$I$5,IF((SUM(V24,Q24,L24,G24))=Paramétrages!$H$6,Paramétrages!$I$6,IF((SUM(V24,Q24,L24,G24))=Paramétrages!$H$7,Paramétrages!$I$7,IF((SUM(V24,Q24,L24,G24))=Paramétrages!$H$8,Paramétrages!$I$8,IF((SUM(V24,Q24,L24,G24))=Paramétrages!$H$9,Paramétrages!$I$9,IF((SUM(V24,Q24,L24,G24))=Paramétrages!$H$10,Paramétrages!$I$10,IF((SUM(V24,Q24,L24,G24))=Paramétrages!$H$11,Paramétrages!$I$11,IF((SUM(V24,Q24,L24,G24))=Paramétrages!$H$12,Paramétrages!$I$12,IF((SUM(V24,Q24,L24,G24))>Paramétrages!$H$13,Paramétrages!$I$13,\"0\")))))))))))","v":8},0,{"$error":"#DIV/0!"}]
[{"$f":"'Données élèves'!A22","v":0},{"$f":"'Données élèves'!B22","v":0},{"$f":"'Données élèves'!C22","v":0},{"$f":"'Données élèves'!E22","v":0},null,{"$f":"IF(((E25*Paramétrages!$B$3)*100)/(((B25*1000)*C25)/60)>100,100,((E25*Paramétrages!$B$3)*100)/(((B25*1000)*C25)/60))","v":{"$error":"#DIV/0!"}},0,{"$f":"'Données élèves'!F22","v":0},{"$f":"'Données élèves'!H22","v":0},null,{"$f":"IF(((J25*Paramétrages!$B$3)*100)/(((B25*1000)*H25)/60)>100,100,((J25*Paramétrages!$B$3)*100)/(((B25*1000)*H25)/60))","v":{"$error":"#DIV/0!"}},0,{"$f":"'Données élèves'!I22","v":0},{"$f":"'Données élèves'!K22","v":0},null,{"$f":"IF(((O25*Paramétrages!$B$3)*100)/(((B25*1000)*M25)/60)>100,100,((O25*Paramétrages!$B$3)*100)/(((B25*1000)*M25)/60))","v":{"$error":"#DIV/0!"}},0,{"$f":"'Données élèves'!L22","v":0},{"$f":"'Données élèves'!N22","v":0},null,{"$f":"IF(((T25*Paramétrages!$B$3)*100)/(((B25*1000)*R25)/60)>100,100,((T25*Paramétrages!$B$3)*100)/(((B25*1000)*R25)/60))","v":{"$error":"#DIV/0!"}},0,null,"Erreur",0,{"$f":"'Données élèves'!R22","v":""},{"$error":"#DIV/0!"},{"$f":"IF((AVERAGE(U25,P25,K25,F25))>97,Paramétrages!$F$3,IF((AVERAGE(U25,P25,K25,F25))>95,Paramétrages!$F$4,IF((AVERAGE(U25,P25,K25,F25))>92,Paramétrages!$F$5,IF((AVERAGE(U25,P25,K25,F25))>89,Paramétrages!$F$6,IF((AVERAGE(U25,P25,K25,F25))>85,Paramétrages!$F$7,IF((AVERAGE(U25,P25,K25,F25))>82,Paramétrages!$F$8,IF((AVERAGE(U25,P25,K25,F25))>79,Paramétrages!$F$9,IF((AVERAGE(U25,P25,K25,F25))<80,Paramétrages!$F$10,\"0\"))))))))","v":{"$error":"#DIV/0!"}},{"$f":"IF((SUM(V25,Q25,L25,G25))=Paramétrages!$H$3,Paramétrages!$I$3,IF((SUM(V25,Q25,L25,G25))=Paramétrages!$H$4,Paramétrages!$I$4,IF((SUM(V25,Q25,L25,G25))=Paramétrages!$H$5,Paramétrages!$I$5,IF((SUM(V25,Q25,L25,G25))=Paramétrages!$H$6,Paramétrages!$I$6,IF((SUM(V25,Q25,L25,G25))=Paramétrages!$H$7,Paramétrages!$I$7,IF((SUM(V25,Q25,L25,G25))=Paramétrages!$H$8,Paramétrages!$I$8,IF((SUM(V25,Q25,L25,G25))=Paramétrages!$H$9,Paramétrages!$I$9,IF((SUM(V25,Q25,L25,G25))=Paramétrages!$H$10,Paramétrages!$I$10,IF((SUM(V25,Q25,L25,G25))=Paramétrages!$H$11,Paramétrages!$I$11,IF((SUM(V25,Q25,L25,G25))=Paramétrages!$H$12,Paramétrages!$I$12,IF((SUM(V25,Q25,L25,G25))>Paramétrages!$H$13,Paramétrages!$I$13,\"0\")))))))))))","v":8},0,{"$error":"#DIV/0!"}]
[{"$f":"'Données élèves'!A23","v":0},{"$f":"'Données élèves'!B23","v":0},{"$f":"'Données élèves'!C23","v":0},{"$f":"'Données élèves'!E23","v":0},null,{"$f":"IF(((E26*Paramétrages!$B$3)*100)/(((B26*1000)*C26)/60)>100,100,((E26*Paramétrages!$B$3)*100)/(((B26*1000)*C26)/60))","v":{"$error":"#DIV/0!"}},0,{"$f":"'Données élèves'!F23","v":0},{"$f":"'Données élèves'!H23","v":0},null,{"$f":"IF(((J26*Paramétrages!$B$3)*100)/(((B26*1000)*H26)/60)>100,100,((J26*Paramétrages!$B$3)*100)/(((B26*1000)*H26)/60))","v":{"$error":"#DIV/0!"}},0,{"$f":"'Données élèves'!I23","v":0},{"$f":"'Données élèves'!K23","v":0},null,{"$f":"IF(((O26*Paramétrages!$B$3)*100)/(((B26*1000)*M26)/60)>100,100,((O26*Paramétrages!$B$3)*100)/(((B26*1000)*M26)/60))","v":{"$error":"#DIV/0!"}},0,{"$f":"'Données élèves'!L23","v":0},{"$f":"'Données élèves'!N23","v":0},null,{"$f":"IF(((T26*Paramétrages!$B$3)*100)/(((B26*1000)*R26)/60)>100,100,((T26*Paramétrages!$B$3)*100)/(((B26*1000)*R26)/60))","v":{"$error":"#DIV/0!"}},0,null,"Erreur",0,{"$f":"'Données élèves'!R23","v":""},{"$error":"#DIV/0!"},{"$f":"IF((AVERAGE(U26,P26,K26,F26))>97,Paramétrages!$F$3,IF((AVERAGE(U26,P26,K26,F26))>95,Paramétrages!$F$4,IF((AVERAGE(U26,P26,K26,F26))>92,Paramétrages!$F$5,IF((AVERAGE(U26,P26,K26,F26))>89,Paramétrages!$F$6,IF((AVERAGE(U26,P26,K26,F26))>85,Paramétrages!$F$7,IF((AVERAGE(U26,P26,K26,F26))>82,Paramétrages!$F$8,IF((AVERAGE(U26,P26,K26,F26))>79,Paramétrages!$F$9,IF((AVERAGE(U26,P26,K26,F26))<80,Paramétrages!$F$10,\"0\"))))))))","v":{"$error":"#DIV/0!"}},{"$f":"IF((SUM(V26,Q26,L26,G26))=Paramétrages!$H$3,Paramétrages!$I$3,IF((SUM(V26,Q26,L26,G26))=Paramétrages!$H$4,Paramétrages!$I$4,IF((SUM(V26,Q26,L26,G26))=Paramétrages!$H$5,Paramétrages!$I$5,IF((SUM(V26,Q26,L26,G26))=Paramétrages!$H$6,Paramétrages!$I$6,IF((SUM(V26,Q26,L26,G26))=Paramétrages!$H$7,Paramétrages!$I$7,IF((SUM(V26,Q26,L26,G26))=Paramétrages!$H$8,Paramétrages!$I$8,IF((SUM(V26,Q26,L26,G26))=Paramétrages!$H$9,Paramétrages!$I$9,IF((SUM(V26,Q26,L26,G26))=Paramétrages!$H$10,Paramétrages!$I$10,IF((SUM(V26,Q26,L26,G26))=Paramétrages!$H$11,Paramétrages!$I$11,IF((SUM(V26,Q26,L26,G26))=Paramétrages!$H$12,Paramétrages!$I$12,IF((SUM(V26,Q26,L26,G26))>Paramétrages!$H$13,Paramétrages!$I$13,\"0\")))))))))))","v":8},0,{"$error":"#DIV/0!"}]
[{"$f":"'Données élèves'!A24","v":0},{"$f":"'Données élèves'!B24","v":0},{"$f":"'Données élèves'!C24","v":0},{"$f":"'Données élèves'!E24","v":0},null,{"$f":"IF(((E27*Paramétrages!$B$3)*100)/(((B27*1000)*C27)/60)>100,100,((E27*Paramétrages!$B$3)*100)/(((B27*1000)*C27)/60))","v":{"$error":"#DIV/0!"}},0,{"$f":"'Données élèves'!F24","v":0},{"$f":"'Données élèves'!H24","v":0},null,{"$f":"IF(((J27*Paramétrages!$B$3)*100)/(((B27*1000)*H27)/60)>100,100,((J27*Paramétrages!$B$3)*100)/(((B27*1000)*H27)/60))","v":{"$error":"#DIV/0!"}},0,{"$f":"'Données élèves'!I24","v":0},{"$f":"'Données élèves'!K24","v":0},null,{"$f":"IF(((O27*Paramétrages!$B$3)*100)/(((B27*1000)*M27)/60)>100,100,((O27*Paramétrages!$B$3)*100)/(((B27*1000)*M27)/60))","v":{"$error":"#DIV/0!"}},0,{"$f":"'Données élèves'!L24","v":0},{"$f":"'Données élèves'!N24","v":0},null,{"$f":"IF(((T27*Paramétrages!$B$3)*100)/(((B27*1000)*R27)/60)>100,100,((T27*Paramétrages!$B$3)*100)/(((B27*1000)*R27)/60))","v":{"$error":"#DIV/0!"}},0,null,"Erreur",0,{"$f":"'Données élèves'!R24","v":""},{"$error":"#DIV/0!"},{"$f":"IF((AVERAGE(U27,P27,K27,F27))>97,Paramétrages!$F$3,IF((AVERAGE(U27,P27,K27,F27))>95,Paramétrages!$F$4,IF((AVERAGE(U27,P27,K27,F27))>92,Paramétrages!$F$5,IF((AVERAGE(U27,P27,K27,F27))>89,Paramétrages!$F$6,IF((AVERAGE(U27,P27,K27,F27))>85,Paramétrages!$F$7,IF((AVERAGE(U27,P27,K27,F27))>82,Paramétrages!$F$8,IF((AVERAGE(U27,P27,K27,F27))>79,Paramétrages!$F$9,IF((AVERAGE(U27,P27,K27,F27))<80,Paramétrages!$F$10,\"0\"))))))))","v":{"$error":"#DIV/0!"}},{"$f":"IF((SUM(V27,Q27,L27,G27))=Paramétrages!$H$3,Paramétrages!$I$3,IF((SUM(V27,Q27,L27,G27))=Paramétrages!$H$4,Paramétrages!$I$4,IF((SUM(V27,Q27,L27,G27))=Paramétrages!$H$5,Paramétrages!$I$5,IF((SUM(V27,Q27,L27,G27))=Paramétrages!$H$6,Paramétrages!$I$6,IF((SUM(V27,Q27,L27,G27))=Paramétrages!$H$7,Paramétrages!$I$7,IF((SUM(V27,Q27,L27,G27))=Paramétrages!$H$8,Paramétrages!$I$8,IF((SUM(V27,Q27,L27,G27))=Paramétrages!$H$9,Paramétrages!$I$9,IF((SUM(V27,Q27,L27,G27))=Paramétrages!$H$10,Paramétrages!$I$10,IF((SUM(V27,Q27,L27,G27))=Paramétrages!$H$11,Paramétrages!$I$11,IF((SUM(V27,Q27,L27,G27))=Paramétrages!$H$12,Paramétrages!$I$12,IF((SUM(V27,Q27,L27,G27))>Paramétrages!$H$13,Paramétrages!$I$13,\"0\")))))))))))","v":8},0,{"$error":"#DIV/0!"}]
[{"$f":"'Données élèves'!A25","v":0},{"$f":"'Données élèves'!B25","v":0},{"$f":"'Données élèves'!C25","v":0},{"$f":"'Données élèves'!E25","v":0},null,{"$f":"IF(((E28*Paramétrages!$B$3)*100)/(((B28*1000)*C28)/60)>100,100,((E28*Paramétrages!$B$3)*100)/(((B28*1000)*C28)/60))","v":{"$error":"#DIV/0!"}},0,{"$f":"'Données élèves'!F25","v":0},{"$f":"'Données élèves'!H25","v":0},null,{"$f":"IF(((J28*Paramétrages!$B$3)*100)/(((B28*1000)*H28)/60)>100,100,((J28*Paramétrages!$B$3)*100)/(((B28*1000)*H28)/60))","v":{"$error":"#DIV/0!"}},0,{"$f":"'Données élèves'!I25","v":0},{"$f":"'Données élèves'!K25","v":0},null,{"$f":"IF(((O28*Paramétrages!$B$3)*100)/(((B28*1000)*M28)/60)>100,100,((O28*Paramétrages!$B$3)*100)/(((B28*1000)*M28)/60))","v":{"$error":"#DIV/0!"}},0,{"$f":"'Données élèves'!L25","v":0},{"$f":"'Données élèves'!N25","v":0},null,{"$f":"IF(((T28*Paramétrages!$B$3)*100)/(((B28*1000)*R28)/60)>100,100,((T28*Paramétrages!$B$3)*100)/(((B28*1000)*R28)/60))","v":{"$error":"#DIV/0!"}},0,null,"Erreur",0,{"$f":"'Données élèves'!R25","v":""},{"$error":"#DIV/0!"},{"$f":"IF((AVERAGE(U28,P28,K28,F28))>97,Paramétrages!$F$3,IF((AVERAGE(U28,P28,K28,F28))>95,Paramétrages!$F$4,IF((AVERAGE(U28,P28,K28,F28))>92,Paramétrages!$F$5,IF((AVERAGE(U28,P28,K28,F28))>89,Paramétrages!$F$6,IF((AVERAGE(U28,P28,K28,F28))>85,Paramétrages!$F$7,IF((AVERAGE(U28,P28,K28,F28))>82,Paramétrages!$F$8,IF((AVERAGE(U28,P28,K28,F28))>79,Paramétrages!$F$9,IF((AVERAGE(U28,P28,K28,F28))<80,Paramétrages!$F$10,\"0\"))))))))","v":{"$error":"#DIV/0!"}},{"$f":"IF((SUM(V28,Q28,L28,G28))=Paramétrages!$H$3,Paramétrages!$I$3,IF((SUM(V28,Q28,L28,G28))=Paramétrages!$H$4,Paramétrages!$I$4,IF((SUM(V28,Q28,L28,G28))=Paramétrages!$H$5,Paramétrages!$I$5,IF((SUM(V28,Q28,L28,G28))=Paramétrages!$H$6,Paramétrages!$I$6,IF((SUM(V28,Q28,L28,G28))=Paramétrages!$H$7,Paramétrages!$I$7,IF((SUM(V28,Q28,L28,G28))=Paramétrages!$H$8,Paramétrages!$I$8,IF((SUM(V28,Q28,L28,G28))=Paramétrages!$H$9,Paramétrages!$I$9,IF((SUM(V28,Q28,L28,G28))=Paramétrages!$H$10,Paramétrages!$I$10,IF((SUM(V28,Q28,L28,G28))=Paramétrages!$H$11,Paramétrages!$I$11,IF((SUM(V28,Q28,L28,G28))=Paramétrages!$H$12,Paramétrages!$I$12,IF((SUM(V28,Q28,L28,G28))>Paramétrages!$H$13,Paramétrages!$I$13,\"0\")))))))))))","v":8},0,{"$error":"#DIV/0!"}]
[{"$f":"'Données élèves'!A26","v":0},{"$f":"'Données élèves'!B26","v":0},{"$f":"'Données élèves'!C26","v":0},{"$f":"'Données élèves'!E26","v":0},null,{"$f":"IF(((E29*Paramétrages!$B$3)*100)/(((B29*1000)*C29)/60)>100,100,((E29*Paramétrages!$B$3)*100)/(((B29*1000)*C29)/60))","v":{"$error":"#DIV/0!"}},0,{"$f":"'Données élèves'!F26","v":0},{"$f":"'Données élèves'!H26","v":0},null,{"$f":"IF(((J29*Paramétrages!$B$3)*100)/(((B29*1000)*H29)/60)>100,100,((J29*Paramétrages!$B$3)*100)/(((B29*1000)*H29)/60))","v":{"$error":"#DIV/0!"}},0,{"$f":"'Données élèves'!I26","v":0},{"$f":"'Données élèves'!K26","v":0},null,{"$f":"IF(((O29*Paramétrages!$B$3)*100)/(((B29*1000)*M29)/60)>100,100,((O29*Paramétrages!$B$3)*100)/(((B29*1000)*M29)/60))","v":{"$error":"#DIV/0!"}},0,{"$f":"'Données élèves'!L26","v":0},{"$f":"'Données élèves'!N26","v":0},null,{"$f":"IF(((T29*Paramétrages!$B$3)*100)/(((B29*1000)*R29)/60)>100,100,((T29*Paramétrages!$B$3)*100)/(((B29*1000)*R29)/60))","v":{"$error":"#DIV/0!"}},0,null,"Erreur",0,{"$f":"'Données élèves'!R26","v":""},{"$error":"#DIV/0!"},{"$f":"IF((AVERAGE(U29,P29,K29,F29))>97,Paramétrages!$F$3,IF((AVERAGE(U29,P29,K29,F29))>95,Paramétrages!$F$4,IF((AVERAGE(U29,P29,K29,F29))>92,Paramétrages!$F$5,IF((AVERAGE(U29,P29,K29,F29))>89,Paramétrages!$F$6,IF((AVERAGE(U29,P29,K29,F29))>85,Paramétrages!$F$7,IF((AVERAGE(U29,P29,K29,F29))>82,Paramétrages!$F$8,IF((AVERAGE(U29,P29,K29,F29))>79,Paramétrages!$F$9,IF((AVERAGE(U29,P29,K29,F29))<80,Paramétrages!$F$10,\"0\"))))))))","v":{"$error":"#DIV/0!"}},{"$f":"IF((SUM(V29,Q29,L29,G29))=Paramétrages!$H$3,Paramétrages!$I$3,IF((SUM(V29,Q29,L29,G29))=Paramétrages!$H$4,Paramétrages!$I$4,IF((SUM(V29,Q29,L29,G29))=Paramétrages!$H$5,Paramétrages!$I$5,IF((SUM(V29,Q29,L29,G29))=Paramétrages!$H$6,Paramétrages!$I$6,IF((SUM(V29,Q29,L29,G29))=Paramétrages!$H$7,Paramétrages!$I$7,IF((SUM(V29,Q29,L29,G29))=Paramétrages!$H$8,Paramétrages!$I$8,IF((SUM(V29,Q29,L29,G29))=Paramétrages!$H$9,Paramétrages!$I$9,IF((SUM(V29,Q29,L29,G29))=Paramétrages!$H$10,Paramétrages!$I$10,IF((SUM(V29,Q29,L29,G29))=Paramétrages!$H$11,Paramétrages!$I$11,IF((SUM(V29,Q29,L29,G29))=Paramétrages!$H$12,Paramétrages!$I$12,IF((SUM(V29,Q29,L29,G29))>Paramétrages!$H$13,Paramétrages!$I$13,\"0\")))))))))))","v":8},0,{"$error":"#DIV/0!"}]
[{"$f":"'Données élèves'!A27","v":0},{"$f":"'Données élèves'!B27","v":0},{"$f":"'Données élèves'!C27","v":0},{"$f":"'Données élèves'!E27","v":0},null,{"$f":"IF(((E30*Paramétrages!$B$3)*100)/(((B30*1000)*C30)/60)>100,100,((E30*Paramétrages!$B$3)*100)/(((B30*1000)*C30)/60))","v":{"$error":"#DIV/0!"}},0,{"$f":"'Données élèves'!F27","v":0},{"$f":"'Données élèves'!H27","v":0},null,{"$f":"IF(((J30*Paramétrages!$B$3)*100)/(((B30*1000)*H30)/60)>100,100,((J30*Paramétrages!$B$3)*100)/(((B30*1000)*H30)/60))","v":{"$error":"#DIV/0!"}},0,{"$f":"'Données élèves'!I27","v":0},{"$f":"'Données élèves'!K27","v":0},null,{"$f":"IF(((O30*Paramétrages!$B$3)*100)/(((B30*1000)*M30)/60)>100,100,((O30*Paramétrages!$B$3)*100)/(((B30*1000)*M30)/60))","v":{"$error":"#DIV/0!"}},0,{"$f":"'Données élèves'!L27","v":0},{"$f":"'Données élèves'!N27","v":0},null,{"$f":"IF(((T30*Paramétrages!$B$3)*100)/(((B30*1000)*R30)/60)>100,100,((T30*Paramétrages!$B$3)*100)/(((B30*1000)*R30)/60))","v":{"$error":"#DIV/0!"}},0,null,"Erreur",0,{"$f":"'Données élèves'!R27","v":""},{"$error":"#DIV/0!"},{"$f":"IF((AVERAGE(U30,P30,K30,F30))>97,Paramétrages!$F$3,IF((AVERAGE(U30,P30,K30,F30))>95,Paramétrages!$F$4,IF((AVERAGE(U30,P30,K30,F30))>92,Paramétrages!$F$5,IF((AVERAGE(U30,P30,K30,F30))>89,Paramétrages!$F$6,IF((AVERAGE(U30,P30,K30,F30))>85,Paramétrages!$F$7,IF((AVERAGE(U30,P30,K30,F30))>82,Paramétrages!$F$8,IF((AVERAGE(U30,P30,K30,F30))>79,Paramétrages!$F$9,IF((AVERAGE(U30,P30,K30,F30))<80,Paramétrages!$F$10,\"0\"))))))))","v":{"$error":"#DIV/0!"}},{"$f":"IF((SUM(V30,Q30,L30,G30))=Paramétrages!$H$3,Paramétrages!$I$3,IF((SUM(V30,Q30,L30,G30))=Paramétrages!$H$4,Paramétrages!$I$4,IF((SUM(V30,Q30,L30,G30))=Paramétrages!$H$5,Paramétrages!$I$5,IF((SUM(V30,Q30,L30,G30))=Paramétrages!$H$6,Paramétrages!$I$6,IF((SUM(V30,Q30,L30,G30))=Paramétrages!$H$7,Paramétrages!$I$7,IF((SUM(V30,Q30,L30,G30))=Paramétrages!$H$8,Paramétrages!$I$8,IF((SUM(V30,Q30,L30,G30))=Paramétrages!$H$9,Paramétrages!$I$9,IF((SUM(V30,Q30,L30,G30))=Paramétrages!$H$10,Paramétrages!$I$10,IF((SUM(V30,Q30,L30,G30))=Paramétrages!$H$11,Paramétrages!$I$11,IF((SUM(V30,Q30,L30,G30))=Paramétrages!$H$12,Paramétrages!$I$12,IF((SUM(V30,Q30,L30,G30))>Paramétrages!$H$13,Paramétrages!$I$13,\"0\")))))))))))","v":8},0,{"$error":"#DIV/0!"}]
[{"$f":"'Données élèves'!A28","v":0},{"$f":"'Données élèves'!B28","v":0},{"$f":"'Données élèves'!C28","v":0},{"$f":"'Données élèves'!E28","v":0},null,{"$f":"IF(((E31*Paramétrages!$B$3)*100)/(((B31*1000)*C31)/60)>100,100,((E31*Paramétrages!$B$3)*100)/(((B31*1000)*C31)/60))","v":{"$error":"#DIV/0!"}},0,{"$f":"'Données élèves'!F28","v":0},{"$f":"'Données élèves'!H28","v":0},null,{"$f":"IF(((J31*Paramétrages!$B$3)*100)/(((B31*1000)*H31)/60)>100,100,((J31*Paramétrages!$B$3)*100)/(((B31*1000)*H31)/60))","v":{"$error":"#DIV/0!"}},0,{"$f":"'Données élèves'!I28","v":0},{"$f":"'Données élèves'!K28","v":0},null,{"$f":"IF(((O31*Paramétrages!$B$3)*100)/(((B31*1000)*M31)/60)>100,100,((O31*Paramétrages!$B$3)*100)/(((B31*1000)*M31)/60))","v":{"$error":"#DIV/0!"}},0,{"$f":"'Données élèves'!L28","v":0},{"$f":"'Données élèves'!N28","v":0},null,{"$f":"IF(((T31*Paramétrages!$B$3)*100)/(((B31*1000)*R31)/60)>100,100,((T31*Paramétrages!$B$3)*100)/(((B31*1000)*R31)/60))","v":{"$error":"#DIV/0!"}},0,null,"Erreur",0,{"$f":"'Données élèves'!R28","v":""},{"$error":"#DIV/0!"},{"$f":"IF((AVERAGE(U31,P31,K31,F31))>97,Paramétrages!$F$3,IF((AVERAGE(U31,P31,K31,F31))>95,Paramétrages!$F$4,IF((AVERAGE(U31,P31,K31,F31))>92,Paramétrages!$F$5,IF((AVERAGE(U31,P31,K31,F31))>89,Paramétrages!$F$6,IF((AVERAGE(U31,P31,K31,F31))>85,Paramétrages!$F$7,IF((AVERAGE(U31,P31,K31,F31))>82,Paramétrages!$F$8,IF((AVERAGE(U31,P31,K31,F31))>79,Paramétrages!$F$9,IF((AVERAGE(U31,P31,K31,F31))<80,Paramétrages!$F$10,\"0\"))))))))","v":{"$error":"#DIV/0!"}},{"$f":"IF((SUM(V31,Q31,L31,G31))=Paramétrages!$H$3,Paramétrages!$I$3,IF((SUM(V31,Q31,L31,G31))=Paramétrages!$H$4,Paramétrages!$I$4,IF((SUM(V31,Q31,L31,G31))=Paramétrages!$H$5,Paramétrages!$I$5,IF((SUM(V31,Q31,L31,G31))=Paramétrages!$H$6,Paramétrages!$I$6,IF((SUM(V31,Q31,L31,G31))=Paramétrages!$H$7,Paramétrages!$I$7,IF((SUM(V31,Q31,L31,G31))=Paramétrages!$H$8,Paramétrages!$I$8,IF((SUM(V31,Q31,L31,G31))=Paramétrages!$H$9,Paramétrages!$I$9,IF((SUM(V31,Q31,L31,G31))=Paramétrages!$H$10,Paramétrages!$I$10,IF((SUM(V31,Q31,L31,G31))=Paramétrages!$H$11,Paramétrages!$I$11,IF((SUM(V31,Q31,L31,G31))=Paramétrages!$H$12,Paramétrages!$I$12,IF((SUM(V31,Q31,L31,G31))>Paramétrages!$H$13,Paramétrages!$I$13,\"0\")))))))))))","v":8},0,{"$error":"#DIV/0!"}]
[{"$f":"'Données élèves'!A29","v":0},{"$f":"'Données élèves'!B29","v":0},{"$f":"'Données élèves'!C29","v":0},{"$f":"'Données élèves'!E29","v":0},null,{"$f":"IF(((E32*Paramétrages!$B$3)*100)/(((B32*1000)*C32)/60)>100,100,((E32*Paramétrages!$B$3)*100)/(((B32*1000)*C32)/60))","v":{"$error":"#DIV/0!"}},0,{"$f":"'Données élèves'!F29","v":0},{"$f":"'Données élèves'!H29","v":0},null,{"$f":"IF(((J32*Paramétrages!$B$3)*100)/(((B32*1000)*H32)/60)>100,100,((J32*Paramétrages!$B$3)*100)/(((B32*1000)*H32)/60))","v":{"$error":"#DIV/0!"}},0,{"$f":"'Données élèves'!I29","v":0},{"$f":"'Données élèves'!K29","v":0},null,{"$f":"IF(((O32*Paramétrages!$B$3)*100)/(((B32*1000)*M32)/60)>100,100,((O32*Paramétrages!$B$3)*100)/(((B32*1000)*M32)/60))","v":{"$error":"#DIV/0!"}},0,{"$f":"'Données élèves'!L29","v":0},{"$f":"'Données élèves'!N29","v":0},null,{"$f":"IF(((T32*Paramétrages!$B$3)*100)/(((B32*1000)*R32)/60)>100,100,((T32*Paramétrages!$B$3)*100)/(((B32*1000)*R32)/60))","v":{"$error":"#DIV/0!"}},0,null,"Erreur",0,{"$f":"'Données élèves'!R29","v":""},{"$error":"#DIV/0!"},{"$f":"IF((AVERAGE(U32,P32,K32,F32))>97,Paramétrages!$F$3,IF((AVERAGE(U32,P32,K32,F32))>95,Paramétrages!$F$4,IF((AVERAGE(U32,P32,K32,F32))>92,Paramétrages!$F$5,IF((AVERAGE(U32,P32,K32,F32))>89,Paramétrages!$F$6,IF((AVERAGE(U32,P32,K32,F32))>85,Paramétrages!$F$7,IF((AVERAGE(U32,P32,K32,F32))>82,Paramétrages!$F$8,IF((AVERAGE(U32,P32,K32,F32))>79,Paramétrages!$F$9,IF((AVERAGE(U32,P32,K32,F32))<80,Paramétrages!$F$10,\"0\"))))))))","v":{"$error":"#DIV/0!"}},{"$f":"IF((SUM(V32,Q32,L32,G32))=Paramétrages!$H$3,Paramétrages!$I$3,IF((SUM(V32,Q32,L32,G32))=Paramétrages!$H$4,Paramétrages!$I$4,IF((SUM(V32,Q32,L32,G32))=Paramétrages!$H$5,Paramétrages!$I$5,IF((SUM(V32,Q32,L32,G32))=Paramétrages!$H$6,Paramétrages!$I$6,IF((SUM(V32,Q32,L32,G32))=Paramétrages!$H$7,Paramétrages!$I$7,IF((SUM(V32,Q32,L32,G32))=Paramétrages!$H$8,Paramétrages!$I$8,IF((SUM(V32,Q32,L32,G32))=Paramétrages!$H$9,Paramétrages!$I$9,IF((SUM(V32,Q32,L32,G32))=Paramétrages!$H$10,Paramétrages!$I$10,IF((SUM(V32,Q32,L32,G32))=Paramétrages!$H$11,Paramétrages!$I$11,IF((SUM(V32,Q32,L32,G32))=Paramétrages!$H$12,Paramétrages!$I$12,IF((SUM(V32,Q32,L32,G32))>Paramétrages!$H$13,Paramétrages!$I$13,\"0\")))))))))))","v":8},0,{"$error":"#DIV/0!"}]
[{"$f":"'Données élèves'!A30","v":0},{"$f":"'Données élèves'!B30","v":0},{"$f":"'Données élèves'!C30","v":0},{"$f":"'Données élèves'!E30","v":0},null,{"$f":"IF(((E33*Paramétrages!$B$3)*100)/(((B33*1000)*C33)/60)>100,100,((E33*Paramétrages!$B$3)*100)/(((B33*1000)*C33)/60))","v":{"$error":"#DIV/0!"}},0,{"$f":"'Données élèves'!F30","v":0},{"$f":"'Données élèves'!H30","v":0},null,{"$f":"IF(((J33*Paramétrages!$B$3)*100)/(((B33*1000)*H33)/60)>100,100,((J33*Paramétrages!$B$3)*100)/(((B33*1000)*H33)/60))","v":{"$error":"#DIV/0!"}},0,{"$f":"'Données élèves'!I30","v":0},{"$f":"'Données élèves'!K30","v":0},null,{"$f":"IF(((O33*Paramétrages!$B$3)*100)/(((B33*1000)*M33)/60)>100,100,((O33*Paramétrages!$B$3)*100)/(((B33*1000)*M33)/60))","v":{"$error":"#DIV/0!"}},0,{"$f":"'Données élèves'!L30","v":0},{"$f":"'Données élèves'!N30","v":0},null,{"$f":"IF(((T33*Paramétrages!$B$3)*100)/(((B33*1000)*R33)/60)>100,100,((T33*Paramétrages!$B$3)*100)/(((B33*1000)*R33)/60))","v":{"$error":"#DIV/0!"}},0,null,"Erreur",0,{"$f":"'Données élèves'!R30","v":""},{"$error":"#DIV/0!"},{"$f":"IF((AVERAGE(U33,P33,K33,F33))>97,Paramétrages!$F$3,IF((AVERAGE(U33,P33,K33,F33))>95,Paramétrages!$F$4,IF((AVERAGE(U33,P33,K33,F33))>92,Paramétrages!$F$5,IF((AVERAGE(U33,P33,K33,F33))>89,Paramétrages!$F$6,IF((AVERAGE(U33,P33,K33,F33))>85,Paramétrages!$F$7,IF((AVERAGE(U33,P33,K33,F33))>82,Paramétrages!$F$8,IF((AVERAGE(U33,P33,K33,F33))>79,Paramétrages!$F$9,IF((AVERAGE(U33,P33,K33,F33))<80,Paramétrages!$F$10,\"0\"))))))))","v":{"$error":"#DIV/0!"}},{"$f":"IF((SUM(V33,Q33,L33,G33))=Paramétrages!$H$3,Paramétrages!$I$3,IF((SUM(V33,Q33,L33,G33))=Paramétrages!$H$4,Paramétrages!$I$4,IF((SUM(V33,Q33,L33,G33))=Paramétrages!$H$5,Paramétrages!$I$5,IF((SUM(V33,Q33,L33,G33))=Paramétrages!$H$6,Paramétrages!$I$6,IF((SUM(V33,Q33,L33,G33))=Paramétrages!$H$7,Paramétrages!$I$7,IF((SUM(V33,Q33,L33,G33))=Paramétrages!$H$8,Paramétrages!$I$8,IF((SUM(V33,Q33,L33,G33))=Paramétrages!$H$9,Paramétrages!$I$9,IF((SUM(V33,Q33,L33,G33))=Paramétrages!$H$10,Paramétrages!$I$10,IF((SUM(V33,Q33,L33,G33))=Paramétrages!$H$11,Paramétrages!$I$11,IF((SUM(V33,Q33,L33,G33))=Paramétrages!$H$12,Paramétrages!$I$12,IF((SUM(V33,Q33,L33,G33))>Paramétrages!$H$13,Paramétrages!$I$13,\"0\")))))))))))","v":8},0,{"$error":"#DIV/0!"}]
[{"$f":"'Données élèves'!A31","v":0},{"$f":"'Données élèves'!B31","v":0},{"$f":"'Données élèves'!C31","v":0},{"$f":"'Données élèves'!E31","v":0},null,{"$f":"IF(((E34*Paramétrages!$B$3)*100)/(((B34*1000)*C34)/60)>100,100,((E34*Paramétrages!$B$3)*100)/(((B34*1000)*C34)/60))","v":{"$error":"#DIV/0!"}},0,{"$f":"'Données élèves'!F31","v":0},{"$f":"'Données élèves'!H31","v":0},null,{"$f":"IF(((J34*Paramétrages!$B$3)*100)/(((B34*1000)*H34)/60)>100,100,((J34*Paramétrages!$B$3)*100)/(((B34*1000)*H34)/60))","v":{"$error":"#DIV/0!"}},0,{"$f":"'Données élèves'!I31","v":0},{"$f":"'Données élèves'!K31","v":0},null,{"$f":"IF(((O34*Paramétrages!$B$3)*100)/(((B34*1000)*M34)/60)>100,100,((O34*Paramétrages!$B$3)*100)/(((B34*1000)*M34)/60))","v":{"$error":"#DIV/0!"}},0,{"$f":"'Données élèves'!L31","v":0},{"$f":"'Données élèves'!N31","v":0},null,{"$f":"IF(((T34*Paramétrages!$B$3)*100)/(((B34*1000)*R34)/60)>100,100,((T34*Paramétrages!$B$3)*100)/(((B34*1000)*R34)/60))","v":{"$error":"#DIV/0!"}},0,null,"Erreur",0,{"$f":"'Données élèves'!R31","v":""},{"$error":"#DIV/0!"},{"$f":"IF((AVERAGE(U34,P34,K34,F34))>97,Paramétrages!$F$3,IF((AVERAGE(U34,P34,K34,F34))>95,Paramétrages!$F$4,IF((AVERAGE(U34,P34,K34,F34))>92,Paramétrages!$F$5,IF((AVERAGE(U34,P34,K34,F34))>89,Paramétrages!$F$6,IF((AVERAGE(U34,P34,K34,F34))>85,Paramétrages!$F$7,IF((AVERAGE(U34,P34,K34,F34))>82,Paramétrages!$F$8,IF((AVERAGE(U34,P34,K34,F34))>79,Paramétrages!$F$9,IF((AVERAGE(U34,P34,K34,F34))<80,Paramétrages!$F$10,\"0\"))))))))","v":{"$error":"#DIV/0!"}},{"$f":"IF((SUM(V34,Q34,L34,G34))=Paramétrages!$H$3,Paramétrages!$I$3,IF((SUM(V34,Q34,L34,G34))=Paramétrages!$H$4,Paramétrages!$I$4,IF((SUM(V34,Q34,L34,G34))=Paramétrages!$H$5,Paramétrages!$I$5,IF((SUM(V34,Q34,L34,G34))=Paramétrages!$H$6,Paramétrages!$I$6,IF((SUM(V34,Q34,L34,G34))=Paramétrages!$H$7,Paramétrages!$I$7,IF((SUM(V34,Q34,L34,G34))=Paramétrages!$H$8,Paramétrages!$I$8,IF((SUM(V34,Q34,L34,G34))=Paramétrages!$H$9,Paramétrages!$I$9,IF((SUM(V34,Q34,L34,G34))=Paramétrages!$H$10,Paramétrages!$I$10,IF((SUM(V34,Q34,L34,G34))=Paramétrages!$H$11,Paramétrages!$I$11,IF((SUM(V34,Q34,L34,G34))=Paramétrages!$H$12,Paramétrages!$I$12,IF((SUM(V34,Q34,L34,G34))>Paramétrages!$H$13,Paramétrages!$I$13,\"0\")))))))))))","v":8},0,{"$error":"#DIV/0!"}]
[{"$f":"'Données élèves'!A32","v":0},{"$f":"'Données élèves'!B32","v":0},{"$f":"'Données élèves'!C32","v":0},{"$f":"'Données élèves'!E32","v":0},null,{"$f":"IF(((E35*Paramétrages!$B$3)*100)/(((B35*1000)*C35)/60)>100,100,((E35*Paramétrages!$B$3)*100)/(((B35*1000)*C35)/60))","v":{"$error":"#DIV/0!"}},0,{"$f":"'Données élèves'!F32","v":0},{"$f":"'Données élèves'!H32","v":0},null,{"$f":"IF(((J35*Paramétrages!$B$3)*100)/(((B35*1000)*H35)/60)>100,100,((J35*Paramétrages!$B$3)*100)/(((B35*1000)*H35)/60))","v":{"$error":"#DIV/0!"}},0,{"$f":"'Données élèves'!I32","v":0},{"$f":"'Données élèves'!K32","v":0},null,{"$f":"IF(((O35*Paramétrages!$B$3)*100)/(((B35*1000)*M35)/60)>100,100,((O35*Paramétrages!$B$3)*100)/(((B35*1000)*M35)/60))","v":{"$error":"#DIV/0!"}},0,{"$f":"'Données élèves'!L32","v":0},{"$f":"'Données élèves'!N32","v":0},null,{"$f":"IF(((T35*Paramétrages!$B$3)*100)/(((B35*1000)*R35)/60)>100,100,((T35*Paramétrages!$B$3)*100)/(((B35*1000)*R35)/60))","v":{"$error":"#DIV/0!"}},0,null,"Erreur",0,{"$f":"'Données élèves'!R32","v":""},{"$error":"#DIV/0!"},{"$f":"IF((AVERAGE(U35,P35,K35,F35))>97,Paramétrages!$F$3,IF((AVERAGE(U35,P35,K35,F35))>95,Paramétrages!$F$4,IF((AVERAGE(U35,P35,K35,F35))>92,Paramétrages!$F$5,IF((AVERAGE(U35,P35,K35,F35))>89,Paramétrages!$F$6,IF((AVERAGE(U35,P35,K35,F35))>85,Paramétrages!$F$7,IF((AVERAGE(U35,P35,K35,F35))>82,Paramétrages!$F$8,IF((AVERAGE(U35,P35,K35,F35))>79,Paramétrages!$F$9,IF((AVERAGE(U35,P35,K35,F35))<80,Paramétrages!$F$10,\"0\"))))))))","v":{"$error":"#DIV/0!"}},{"$f":"IF((SUM(V35,Q35,L35,G35))=Paramétrages!$H$3,Paramétrages!$I$3,IF((SUM(V35,Q35,L35,G35))=Paramétrages!$H$4,Paramétrages!$I$4,IF((SUM(V35,Q35,L35,G35))=Paramétrages!$H$5,Paramétrages!$I$5,IF((SUM(V35,Q35,L35,G35))=Paramétrages!$H$6,Paramétrages!$I$6,IF((SUM(V35,Q35,L35,G35))=Paramétrages!$H$7,Paramétrages!$I$7,IF((SUM(V35,Q35,L35,G35))=Paramétrages!$H$8,Paramétrages!$I$8,IF((SUM(V35,Q35,L35,G35))=Paramétrages!$H$9,Paramétrages!$I$9,IF((SUM(V35,Q35,L35,G35))=Paramétrages!$H$10,Paramétrages!$I$10,IF((SUM(V35,Q35,L35,G35))=Paramétrages!$H$11,Paramétrages!$I$11,IF((SUM(V35,Q35,L35,G35))=Paramétrages!$H$12,Paramétrages!$I$12,IF((SUM(V35,Q35,L35,G35))>Paramétrages!$H$13,Paramétrages!$I$13,\"0\")))))))))))","v":8},0,{"$error":"#DIV/0!"}]
[{"$f":"'Données élèves'!A33","v":0},{"$f":"'Données élèves'!B33","v":0},{"$f":"'Données élèves'!C33","v":0},{"$f":"'Données élèves'!E33","v":0},null,{"$f":"IF(((E36*Paramétrages!$B$3)*100)/(((B36*1000)*C36)/60)>100,100,((E36*Paramétrages!$B$3)*100)/(((B36*1000)*C36)/60))","v":{"$error":"#DIV/0!"}},0,{"$f":"'Données élèves'!F33","v":0},{"$f":"'Données élèves'!H33","v":0},null,{"$f":"IF(((J36*Paramétrages!$B$3)*100)/(((B36*1000)*H36)/60)>100,100,((J36*Paramétrages!$B$3)*100)/(((B36*1000)*H36)/60))","v":{"$error":"#DIV/0!"}},0,{"$f":"'Données élèves'!I33","v":0},{"$f":"'Données élèves'!K33","v":0},null,{"$f":"IF(((O36*Paramétrages!$B$3)*100)/(((B36*1000)*M36)/60)>100,100,((O36*Paramétrages!$B$3)*100)/(((B36*1000)*M36)/60))","v":{"$error":"#DIV/0!"}},0,{"$f":"'Données élèves'!L33","v":0},{"$f":"'Données élèves'!N33","v":0},null,{"$f":"IF(((T36*Paramétrages!$B$3)*100)/(((B36*1000)*R36)/60)>100,100,((T36*Paramétrages!$B$3)*100)/(((B36*1000)*R36)/60))","v":{"$error":"#DIV/0!"}},0,null,"Erreur",0,{"$f":"'Données élèves'!R33","v":""},{"$error":"#DIV/0!"},{"$f":"IF((AVERAGE(U36,P36,K36,F36))>97,Paramétrages!$F$3,IF((AVERAGE(U36,P36,K36,F36))>95,Paramétrages!$F$4,IF((AVERAGE(U36,P36,K36,F36))>92,Paramétrages!$F$5,IF((AVERAGE(U36,P36,K36,F36))>89,Paramétrages!$F$6,IF((AVERAGE(U36,P36,K36,F36))>85,Paramétrages!$F$7,IF((AVERAGE(U36,P36,K36,F36))>82,Paramétrages!$F$8,IF((AVERAGE(U36,P36,K36,F36))>79,Paramétrages!$F$9,IF((AVERAGE(U36,P36,K36,F36))<80,Paramétrages!$F$10,\"0\"))))))))","v":{"$error":"#DIV/0!"}},{"$f":"IF((SUM(V36,Q36,L36,G36))=Paramétrages!$H$3,Paramétrages!$I$3,IF((SUM(V36,Q36,L36,G36))=Paramétrages!$H$4,Paramétrages!$I$4,IF((SUM(V36,Q36,L36,G36))=Paramétrages!$H$5,Paramétrages!$I$5,IF((SUM(V36,Q36,L36,G36))=Paramétrages!$H$6,Paramétrages!$I$6,IF((SUM(V36,Q36,L36,G36))=Paramétrages!$H$7,Paramétrages!$I$7,IF((SUM(V36,Q36,L36,G36))=Paramétrages!$H$8,Paramétrages!$I$8,IF((SUM(V36,Q36,L36,G36))=Paramétrages!$H$9,Paramétrages!$I$9,IF((SUM(V36,Q36,L36,G36))=Paramétrages!$H$10,Paramétrages!$I$10,IF((SUM(V36,Q36,L36,G36))=Paramétrages!$H$11,Paramétrages!$I$11,IF((SUM(V36,Q36,L36,G36))=Paramétrages!$H$12,Paramétrages!$I$12,IF((SUM(V36,Q36,L36,G36))>Paramétrages!$H$13,Paramétrages!$I$13,\"0\")))))))))))","v":8},0,{"$error":"#DIV/0!"}]
[{"$f":"'Données élèves'!A34","v":0},{"$f":"'Données élèves'!B34","v":0},{"$f":"'Données élèves'!C34","v":0},{"$f":"'Données élèves'!E34","v":0},null,{"$f":"IF(((E37*Paramétrages!$B$3)*100)/(((B37*1000)*C37)/60)>100,100,((E37*Paramétrages!$B$3)*100)/(((B37*1000)*C37)/60))","v":{"$error":"#DIV/0!"}},0,{"$f":"'Données élèves'!F34","v":0},{"$f":"'Données élèves'!H34","v":0},null,{"$f":"IF(((J37*Paramétrages!$B$3)*100)/(((B37*1000)*H37)/60)>100,100,((J37*Paramétrages!$B$3)*100)/(((B37*1000)*H37)/60))","v":{"$error":"#DIV/0!"}},0,{"$f":"'Données élèves'!I34","v":0},{"$f":"'Données élèves'!K34","v":0},null,{"$f":"IF(((O37*Paramétrages!$B$3)*100)/(((B37*1000)*M37)/60)>100,100,((O37*Paramétrages!$B$3)*100)/(((B37*1000)*M37)/60))","v":{"$error":"#DIV/0!"}},0,{"$f":"'Données élèves'!L34","v":0},{"$f":"'Données élèves'!N34","v":0},null,{"$f":"IF(((T37*Paramétrages!$B$3)*100)/(((B37*1000)*R37)/60)>100,100,((T37*Paramétrages!$B$3)*100)/(((B37*1000)*R37)/60))","v":{"$error":"#DIV/0!"}},0,null,"Erreur",0,{"$f":"'Données élèves'!R34","v":""},{"$error":"#DIV/0!"},{"$f":"IF((AVERAGE(U37,P37,K37,F37))>97,Paramétrages!$F$3,IF((AVERAGE(U37,P37,K37,F37))>95,Paramétrages!$F$4,IF((AVERAGE(U37,P37,K37,F37))>92,Paramétrages!$F$5,IF((AVERAGE(U37,P37,K37,F37))>89,Paramétrages!$F$6,IF((AVERAGE(U37,P37,K37,F37))>85,Paramétrages!$F$7,IF((AVERAGE(U37,P37,K37,F37))>82,Paramétrages!$F$8,IF((AVERAGE(U37,P37,K37,F37))>79,Paramétrages!$F$9,IF((AVERAGE(U37,P37,K37,F37))<80,Paramétrages!$F$10,\"0\"))))))))","v":{"$error":"#DIV/0!"}},{"$f":"IF((SUM(V37,Q37,L37,G37))=Paramétrages!$H$3,Paramétrages!$I$3,IF((SUM(V37,Q37,L37,G37))=Paramétrages!$H$4,Paramétrages!$I$4,IF((SUM(V37,Q37,L37,G37))=Paramétrages!$H$5,Paramétrages!$I$5,IF((SUM(V37,Q37,L37,G37))=Paramétrages!$H$6,Paramétrages!$I$6,IF((SUM(V37,Q37,L37,G37))=Paramétrages!$H$7,Paramétrages!$I$7,IF((SUM(V37,Q37,L37,G37))=Paramétrages!$H$8,Paramétrages!$I$8,IF((SUM(V37,Q37,L37,G37))=Paramétrages!$H$9,Paramétrages!$I$9,IF((SUM(V37,Q37,L37,G37))=Paramétrages!$H$10,Paramétrages!$I$10,IF((SUM(V37,Q37,L37,G37))=Paramétrages!$H$11,Paramétrages!$I$11,IF((SUM(V37,Q37,L37,G37))=Paramétrages!$H$12,Paramétrages!$I$12,IF((SUM(V37,Q37,L37,G37))>Paramétrages!$H$13,Paramétrages!$I$13,\"0\")))))))))))","v":8},0,{"$error":"#DIV/0!"}]
[{"$f":"'Données élèves'!A35","v":0},{"$f":"'Données élèves'!B35","v":0},{"$f":"'Données élèves'!C35","v":0},{"$f":"'Données élèves'!E35","v":0},null,{"$f":"IF(((E38*Paramétrages!$B$3)*100)/(((B38*1000)*C38)/60)>100,100,((E38*Paramétrages!$B$3)*100)/(((B38*1000)*C38)/60))","v":{"$error":"#DIV/0!"}},0,{"$f":"'Données élèves'!F35","v":0},{"$f":"'Données élèves'!H35","v":0},null,{"$f":"IF(((J38*Paramétrages!$B$3)*100)/(((B38*1000)*H38)/60)>100,100,((J38*Paramétrages!$B$3)*100)/(((B38*1000)*H38)/60))","v":{"$error":"#DIV/0!"}},0,{"$f":"'Données élèves'!I35","v":0},{"$f":"'Données élèves'!K35","v":0},null,{"$f":"IF(((O38*Paramétrages!$B$3)*100)/(((B38*1000)*M38)/60)>100,100,((O38*Paramétrages!$B$3)*100)/(((B38*1000)*M38)/60))","v":{"$error":"#DIV/0!"}},0,{"$f":"'Données élèves'!L35","v":0},{"$f":"'Données élèves'!N35","v":0},null,{"$f":"IF(((T38*Paramétrages!$B$3)*100)/(((B38*1000)*R38)/60)>100,100,((T38*Paramétrages!$B$3)*100)/(((B38*1000)*R38)/60))","v":{"$error":"#DIV/0!"}},0,null,"Erreur",0,{"$f":"'Données élèves'!R35","v":""},{"$error":"#DIV/0!"},{"$f":"IF((AVERAGE(U38,P38,K38,F38))>97,Paramétrages!$F$3,IF((AVERAGE(U38,P38,K38,F38))>95,Paramétrages!$F$4,IF((AVERAGE(U38,P38,K38,F38))>92,Paramétrages!$F$5,IF((AVERAGE(U38,P38,K38,F38))>89,Paramétrages!$F$6,IF((AVERAGE(U38,P38,K38,F38))>85,Paramétrages!$F$7,IF((AVERAGE(U38,P38,K38,F38))>82,Paramétrages!$F$8,IF((AVERAGE(U38,P38,K38,F38))>79,Paramétrages!$F$9,IF((AVERAGE(U38,P38,K38,F38))<80,Paramétrages!$F$10,\"0\"))))))))","v":{"$error":"#DIV/0!"}},{"$f":"IF((SUM(V38,Q38,L38,G38))=Paramétrages!$H$3,Paramétrages!$I$3,IF((SUM(V38,Q38,L38,G38))=Paramétrages!$H$4,Paramétrages!$I$4,IF((SUM(V38,Q38,L38,G38))=Paramétrages!$H$5,Paramétrages!$I$5,IF((SUM(V38,Q38,L38,G38))=Paramétrages!$H$6,Paramétrages!$I$6,IF((SUM(V38,Q38,L38,G38))=Paramétrages!$H$7,Paramétrages!$I$7,IF((SUM(V38,Q38,L38,G38))=Paramétrages!$H$8,Paramétrages!$I$8,IF((SUM(V38,Q38,L38,G38))=Paramétrages!$H$9,Paramétrages!$I$9,IF((SUM(V38,Q38,L38,G38))=Paramétrages!$H$10,Paramétrages!$I$10,IF((SUM(V38,Q38,L38,G38))=Paramétrages!$H$11,Paramétrages!$I$11,IF((SUM(V38,Q38,L38,G38))=Paramétrages!$H$12,Paramétrages!$I$12,IF((SUM(V38,Q38,L38,G38))>Paramétrages!$H$13,Paramétrages!$I$13,\"0\")))))))))))","v":8},0,{"$error":"#DIV/0!"}]
[{"$f":"'Données élèves'!A36","v":0},{"$f":"'Données élèves'!B36","v":0},{"$f":"'Données élèves'!C36","v":0},{"$f":"'Données élèves'!E36","v":0},null,{"$f":"IF(((E39*Paramétrages!$B$3)*100)/(((B39*1000)*C39)/60)>100,100,((E39*Paramétrages!$B$3)*100)/(((B39*1000)*C39)/60))","v":{"$error":"#DIV/0!"}},0,{"$f":"'Données élèves'!F36","v":0},{"$f":"'Données élèves'!H36","v":0},null,{"$f":"IF(((J39*Paramétrages!$B$3)*100)/(((B39*1000)*H39)/60)>100,100,((J39*Paramétrages!$B$3)*100)/(((B39*1000)*H39)/60))","v":{"$error":"#DIV/0!"}},0,{"$f":"'Données élèves'!I36","v":0},{"$f":"'Données élèves'!K36","v":0},null,{"$f":"IF(((O39*Paramétrages!$B$3)*100)/(((B39*1000)*M39)/60)>100,100,((O39*Paramétrages!$B$3)*100)/(((B39*1000)*M39)/60))","v":{"$error":"#DIV/0!"}},0,{"$f":"'Données élèves'!L36","v":0},{"$f":"'Données élèves'!N36","v":0},null,{"$f":"IF(((T39*Paramétrages!$B$3)*100)/(((B39*1000)*R39)/60)>100,100,((T39*Paramétrages!$B$3)*100)/(((B39*1000)*R39)/60))","v":{"$error":"#DIV/0!"}},0,null,"Erreur",0,{"$f":"'Données élèves'!R36","v":""},{"$error":"#DIV/0!"},{"$f":"IF((AVERAGE(U39,P39,K39,F39))>97,Paramétrages!$F$3,IF((AVERAGE(U39,P39,K39,F39))>95,Paramétrages!$F$4,IF((AVERAGE(U39,P39,K39,F39))>92,Paramétrages!$F$5,IF((AVERAGE(U39,P39,K39,F39))>89,Paramétrages!$F$6,IF((AVERAGE(U39,P39,K39,F39))>85,Paramétrages!$F$7,IF((AVERAGE(U39,P39,K39,F39))>82,Paramétrages!$F$8,IF((AVERAGE(U39,P39,K39,F39))>79,Paramétrages!$F$9,IF((AVERAGE(U39,P39,K39,F39))<80,Paramétrages!$F$10,\"0\"))))))))","v":{"$error":"#DIV/0!"}},{"$f":"IF((SUM(V39,Q39,L39,G39))=Paramétrages!$H$3,Paramétrages!$I$3,IF((SUM(V39,Q39,L39,G39))=Paramétrages!$H$4,Paramétrages!$I$4,IF((SUM(V39,Q39,L39,G39))=Paramétrages!$H$5,Paramétrages!$I$5,IF((SUM(V39,Q39,L39,G39))=Paramétrages!$H$6,Paramétrages!$I$6,IF((SUM(V39,Q39,L39,G39))=Paramétrages!$H$7,Paramétrages!$I$7,IF((SUM(V39,Q39,L39,G39))=Paramétrages!$H$8,Paramétrages!$I$8,IF((SUM(V39,Q39,L39,G39))=Paramétrages!$H$9,Paramétrages!$I$9,IF((SUM(V39,Q39,L39,G39))=Paramétrages!$H$10,Paramétrages!$I$10,IF((SUM(V39,Q39,L39,G39))=Paramétrages!$H$11,Paramétrages!$I$11,IF((SUM(V39,Q39,L39,G39))=Paramétrages!$H$12,Paramétrages!$I$12,IF((SUM(V39,Q39,L39,G39))>Paramétrages!$H$13,Paramétrages!$I$13,\"0\")))))))))))","v":8},0,{"$error":"#DIV/0!"}]
[{"$f":"'Données élèves'!A37","v":0},{"$f":"'Données élèves'!B37","v":0},{"$f":"'Données élèves'!C37","v":0},{"$f":"'Données élèves'!E37","v":0},null,{"$f":"IF(((E40*Paramétrages!$B$3)*100)/(((B40*1000)*C40)/60)>100,100,((E40*Paramétrages!$B$3)*100)/(((B40*1000)*C40)/60))","v":{"$error":"#DIV/0!"}},0,{"$f":"'Données élèves'!F37","v":0},{"$f":"'Données élèves'!H37","v":0},null,{"$f":"IF(((J40*Paramétrages!$B$3)*100)/(((B40*1000)*H40)/60)>100,100,((J40*Paramétrages!$B$3)*100)/(((B40*1000)*H40)/60))","v":{"$error":"#DIV/0!"}},0,{"$f":"'Données élèves'!I37","v":0},{"$f":"'Données élèves'!K37","v":0},null,{"$f":"IF(((O40*Paramétrages!$B$3)*100)/(((B40*1000)*M40)/60)>100,100,((O40*Paramétrages!$B$3)*100)/(((B40*1000)*M40)/60))","v":{"$error":"#DIV/0!"}},0,{"$f":"'Données élèves'!L37","v":0},{"$f":"'Données élèves'!N37","v":0},null,{"$f":"IF(((T40*Paramétrages!$B$3)*100)/(((B40*1000)*R40)/60)>100,100,((T40*Paramétrages!$B$3)*100)/(((B40*1000)*R40)/60))","v":{"$error":"#DIV/0!"}},0,null,"Erreur",0,{"$f":"'Données élèves'!R37","v":""},{"$error":"#DIV/0!"},{"$f":"IF((AVERAGE(U40,P40,K40,F40))>97,Paramétrages!$F$3,IF((AVERAGE(U40,P40,K40,F40))>95,Paramétrages!$F$4,IF((AVERAGE(U40,P40,K40,F40))>92,Paramétrages!$F$5,IF((AVERAGE(U40,P40,K40,F40))>89,Paramétrages!$F$6,IF((AVERAGE(U40,P40,K40,F40))>85,Paramétrages!$F$7,IF((AVERAGE(U40,P40,K40,F40))>82,Paramétrages!$F$8,IF((AVERAGE(U40,P40,K40,F40))>79,Paramétrages!$F$9,IF((AVERAGE(U40,P40,K40,F40))<80,Paramétrages!$F$10,\"0\"))))))))","v":{"$error":"#DIV/0!"}},{"$f":"IF((SUM(V40,Q40,L40,G40))=Paramétrages!$H$3,Paramétrages!$I$3,IF((SUM(V40,Q40,L40,G40))=Paramétrages!$H$4,Paramétrages!$I$4,IF((SUM(V40,Q40,L40,G40))=Paramétrages!$H$5,Paramétrages!$I$5,IF((SUM(V40,Q40,L40,G40))=Paramétrages!$H$6,Paramétrages!$I$6,IF((SUM(V40,Q40,L40,G40))=Paramétrages!$H$7,Paramétrages!$I$7,IF((SUM(V40,Q40,L40,G40))=Paramétrages!$H$8,Paramétrages!$I$8,IF((SUM(V40,Q40,L40,G40))=Paramétrages!$H$9,Paramétrages!$I$9,IF((SUM(V40,Q40,L40,G40))=Paramétrages!$H$10,Paramétrages!$I$10,IF((SUM(V40,Q40,L40,G40))=Paramétrages!$H$11,Paramétrages!$I$11,IF((SUM(V40,Q40,L40,G40))=Paramétrages!$H$12,Paramétrages!$I$12,IF((SUM(V40,Q40,L40,G40))>Paramétrages!$H$13,Paramétrages!$I$13,\"0\")))))))))))","v":8},0,{"$error":"#DIV/0!"}]
[{"$f":"'Données élèves'!A38","v":0},{"$f":"'Données élèves'!B38","v":0},{"$f":"'Données élèves'!C38","v":0},{"$f":"'Données élèves'!E38","v":0},null,{"$f":"IF(((E41*Paramétrages!$B$3)*100)/(((B41*1000)*C41)/60)>100,100,((E41*Paramétrages!$B$3)*100)/(((B41*1000)*C41)/60))","v":{"$error":"#DIV/0!"}},0,{"$f":"'Données élèves'!F38","v":0},{"$f":"'Données élèves'!H38","v":0},null,{"$f":"IF(((J41*Paramétrages!$B$3)*100)/(((B41*1000)*H41)/60)>100,100,((J41*Paramétrages!$B$3)*100)/(((B41*1000)*H41)/60))","v":{"$error":"#DIV/0!"}},0,{"$f":"'Données élèves'!I38","v":0},{"$f":"'Données élèves'!K38","v":0},null,{"$f":"IF(((O41*Paramétrages!$B$3)*100)/(((B41*1000)*M41)/60)>100,100,((O41*Paramétrages!$B$3)*100)/(((B41*1000)*M41)/60))","v":{"$error":"#DIV/0!"}},0,{"$f":"'Données élèves'!L38","v":0},{"$f":"'Données élèves'!N38","v":0},null,{"$f":"IF(((T41*Paramétrages!$B$3)*100)/(((B41*1000)*R41)/60)>100,100,((T41*Paramétrages!$B$3)*100)/(((B41*1000)*R41)/60))","v":{"$error":"#DIV/0!"}},0,null,"Erreur",0,{"$f":"'Données élèves'!R38","v":""},{"$error":"#DIV/0!"},{"$f":"IF((AVERAGE(U41,P41,K41,F41))>97,Paramétrages!$F$3,IF((AVERAGE(U41,P41,K41,F41))>95,Paramétrages!$F$4,IF((AVERAGE(U41,P41,K41,F41))>92,Paramétrages!$F$5,IF((AVERAGE(U41,P41,K41,F41))>89,Paramétrages!$F$6,IF((AVERAGE(U41,P41,K41,F41))>85,Paramétrages!$F$7,IF((AVERAGE(U41,P41,K41,F41))>82,Paramétrages!$F$8,IF((AVERAGE(U41,P41,K41,F41))>79,Paramétrages!$F$9,IF((AVERAGE(U41,P41,K41,F41))<80,Paramétrages!$F$10,\"0\"))))))))","v":{"$error":"#DIV/0!"}},{"$f":"IF((SUM(V41,Q41,L41,G41))=Paramétrages!$H$3,Paramétrages!$I$3,IF((SUM(V41,Q41,L41,G41))=Paramétrages!$H$4,Paramétrages!$I$4,IF((SUM(V41,Q41,L41,G41))=Paramétrages!$H$5,Paramétrages!$I$5,IF((SUM(V41,Q41,L41,G41))=Paramétrages!$H$6,Paramétrages!$I$6,IF((SUM(V41,Q41,L41,G41))=Paramétrages!$H$7,Paramétrages!$I$7,IF((SUM(V41,Q41,L41,G41))=Paramétrages!$H$8,Paramétrages!$I$8,IF((SUM(V41,Q41,L41,G41))=Paramétrages!$H$9,Paramétrages!$I$9,IF((SUM(V41,Q41,L41,G41))=Paramétrages!$H$10,Paramétrages!$I$10,IF((SUM(V41,Q41,L41,G41))=Paramétrages!$H$11,Paramétrages!$I$11,IF((SUM(V41,Q41,L41,G41))=Paramétrages!$H$12,Paramétrages!$I$12,IF((SUM(V41,Q41,L41,G41))>Paramétrages!$H$13,Paramétrages!$I$13,\"0\")))))))))))","v":8},0,{"$error":"#DIV/0!"}]
[{"$f":"'Données élèves'!A39","v":0},{"$f":"'Données élèves'!B39","v":0},{"$f":"'Données élèves'!C39","v":0},{"$f":"'Données élèves'!E39","v":0},null,{"$f":"IF(((E42*Paramétrages!$B$3)*100)/(((B42*1000)*C42)/60)>100,100,((E42*Paramétrages!$B$3)*100)/(((B42*1000)*C42)/60))","v":{"$error":"#DIV/0!"}},0,{"$f":"'Données élèves'!F39","v":0},{"$f":"'Données élèves'!H39","v":0},null,{"$f":"IF(((J42*Paramétrages!$B$3)*100)/(((B42*1000)*H42)/60)>100,100,((J42*Paramétrages!$B$3)*100)/(((B42*1000)*H42)/60))","v":{"$error":"#DIV/0!"}},0,{"$f":"'Données élèves'!I39","v":0},{"$f":"'Données élèves'!K39","v":0},null,{"$f":"IF(((O42*Paramétrages!$B$3)*100)/(((B42*1000)*M42)/60)>100,100,((O42*Paramétrages!$B$3)*100)/(((B42*1000)*M42)/60))","v":{"$error":"#DIV/0!"}},0,{"$f":"'Données élèves'!L39","v":0},{"$f":"'Données élèves'!N39","v":0},null,{"$f":"IF(((T42*Paramétrages!$B$3)*100)/(((B42*1000)*R42)/60)>100,100,((T42*Paramétrages!$B$3)*100)/(((B42*1000)*R42)/60))","v":{"$error":"#DIV/0!"}},0,null,"Erreur",0,{"$f":"'Données élèves'!R39","v":""},{"$error":"#DIV/0!"},{"$f":"IF((AVERAGE(U42,P42,K42,F42))>97,Paramétrages!$F$3,IF((AVERAGE(U42,P42,K42,F42))>95,Paramétrages!$F$4,IF((AVERAGE(U42,P42,K42,F42))>92,Paramétrages!$F$5,IF((AVERAGE(U42,P42,K42,F42))>89,Paramétrages!$F$6,IF((AVERAGE(U42,P42,K42,F42))>85,Paramétrages!$F$7,IF((AVERAGE(U42,P42,K42,F42))>82,Paramétrages!$F$8,IF((AVERAGE(U42,P42,K42,F42))>79,Paramétrages!$F$9,IF((AVERAGE(U42,P42,K42,F42))<80,Paramétrages!$F$10,\"0\"))))))))","v":{"$error":"#DIV/0!"}},{"$f":"IF((SUM(V42,Q42,L42,G42))=Paramétrages!$H$3,Paramétrages!$I$3,IF((SUM(V42,Q42,L42,G42))=Paramétrages!$H$4,Paramétrages!$I$4,IF((SUM(V42,Q42,L42,G42))=Paramétrages!$H$5,Paramétrages!$I$5,IF((SUM(V42,Q42,L42,G42))=Paramétrages!$H$6,Paramétrages!$I$6,IF((SUM(V42,Q42,L42,G42))=Paramétrages!$H$7,Paramétrages!$I$7,IF((SUM(V42,Q42,L42,G42))=Paramétrages!$H$8,Paramétrages!$I$8,IF((SUM(V42,Q42,L42,G42))=Paramétrages!$H$9,Paramétrages!$I$9,IF((SUM(V42,Q42,L42,G42))=Paramétrages!$H$10,Paramétrages!$I$10,IF((SUM(V42,Q42,L42,G42))=Paramétrages!$H$11,Paramétrages!$I$11,IF((SUM(V42,Q42,L42,G42))=Paramétrages!$H$12,Paramétrages!$I$12,IF((SUM(V42,Q42,L42,G42))>Paramétrages!$H$13,Paramétrages!$I$13,\"0\")))))))))))","v":8},0,{"$error":"#DIV/0!"}]
[{"$f":"'Données élèves'!A40","v":0},{"$f":"'Données élèves'!B40","v":0},{"$f":"'Données élèves'!C40","v":0},{"$f":"'Données élèves'!E40","v":0},null,{"$f":"IF(((E43*Paramétrages!$B$3)*100)/(((B43*1000)*C43)/60)>100,100,((E43*Paramétrages!$B$3)*100)/(((B43*1000)*C43)/60))","v":{"$error":"#DIV/0!"}},0,{"$f":"'Données élèves'!F40","v":0},{"$f":"'Données élèves'!H40","v":0},null,{"$f":"IF(((J43*Paramétrages!$B$3)*100)/(((B43*1000)*H43)/60)>100,100,((J43*Paramétrages!$B$3)*100)/(((B43*1000)*H43)/60))","v":{"$error":"#DIV/0!"}},0,{"$f":"'Données élèves'!I40","v":0},{"$f":"'Données élèves'!K40","v":0},null,{"$f":"IF(((O43*Paramétrages!$B$3)*100)/(((B43*1000)*M43)/60)>100,100,((O43*Paramétrages!$B$3)*100)/(((B43*1000)*M43)/60))","v":{"$error":"#DIV/0!"}},0,{"$f":"'Données élèves'!L40","v":0},{"$f":"'Données élèves'!N40","v":0},null,{"$f":"IF(((T43*Paramétrages!$B$3)*100)/(((B43*1000)*R43)/60)>100,100,((T43*Paramétrages!$B$3)*100)/(((B43*1000)*R43)/60))","v":{"$error":"#DIV/0!"}},0,null,"Erreur",0,{"$f":"'Données élèves'!R40","v":""},{"$error":"#DIV/0!"},{"$f":"IF((AVERAGE(U43,P43,K43,F43))>97,Paramétrages!$F$3,IF((AVERAGE(U43,P43,K43,F43))>95,Paramétrages!$F$4,IF((AVERAGE(U43,P43,K43,F43))>92,Paramétrages!$F$5,IF((AVERAGE(U43,P43,K43,F43))>89,Paramétrages!$F$6,IF((AVERAGE(U43,P43,K43,F43))>85,Paramétrages!$F$7,IF((AVERAGE(U43,P43,K43,F43))>82,Paramétrages!$F$8,IF((AVERAGE(U43,P43,K43,F43))>79,Paramétrages!$F$9,IF((AVERAGE(U43,P43,K43,F43))<80,Paramétrages!$F$10,\"0\"))))))))","v":{"$error":"#DIV/0!"}},{"$f":"IF((SUM(V43,Q43,L43,G43))=Paramétrages!$H$3,Paramétrages!$I$3,IF((SUM(V43,Q43,L43,G43))=Paramétrages!$H$4,Paramétrages!$I$4,IF((SUM(V43,Q43,L43,G43))=Paramétrages!$H$5,Paramétrages!$I$5,IF((SUM(V43,Q43,L43,G43))=Paramétrages!$H$6,Paramétrages!$I$6,IF((SUM(V43,Q43,L43,G43))=Paramétrages!$H$7,Paramétrages!$I$7,IF((SUM(V43,Q43,L43,G43))=Paramétrages!$H$8,Paramétrages!$I$8,IF((SUM(V43,Q43,L43,G43))=Paramétrages!$H$9,Paramétrages!$I$9,IF((SUM(V43,Q43,L43,G43))=Paramétrages!$H$10,Paramétrages!$I$10,IF((SUM(V43,Q43,L43,G43))=Paramétrages!$H$11,Paramétrages!$I$11,IF((SUM(V43,Q43,L43,G43))=Paramétrages!$H$12,Paramétrages!$I$12,IF((SUM(V43,Q43,L43,G43))>Paramétrages!$H$13,Paramétrages!$I$13,\"0\")))))))))))","v":8},0,{"$error":"#DIV/0!"}]

{"sheet":"Données élèves 3 courses","index":5,"n_rows":40,"n_cols":16,"rows_kept":40,"cut":false,"hidden":false,"merged":[[4,15,4,16],[1,11,1,14],[1,0,2,0],[1,1,2,1],[1,2,1,4],[1,5,1,7],[1,8,1,10]]}
[]
["Nom et prénom","VMA de l'élève","Course 1",null,null,"Course 2",null,null,"Course 3",null,null,"Total"]
[null,null,"Durée","% VMA","Projet ","Durée","% VMA","Projet ","Durée","% VMA","Projet ","Durée ","Projet","Distance totale en Mètres","VMA moyenne envisagée"]
[null,null,null,{"$f":"IF(OR(E4=\"\",C4=\"\",B4=\"\"),\"\",(((E4*Paramétrages!$B$3)*100)/(((B4*1000)*C4)/60)))","v":""},null,null,{"$f":"IF(OR(H4=\"\",F4=\"\",B4=\"\"),\"\",(((H4*Paramétrages!$B$3)*100)/(((B4*1000)*F4)/60)))","v":""},null,null,{"$f":"IF(OR(K4=\"\",I4=\"\",B4=\"\"),\"\",(((K4*Paramétrages!$B$3)*100)/(((B4*1000)*I4)/60)))","v":""},null,{"$f":"IF((SUM(I4,F4,C4))>15,\"Erreur\",IF((SUM(I4,F4,C4))<12,\"Erreur\",(SUM(I4,F4,C4))))","v":"Erreur"},{"$f":"IF(OR(K4=\"\",H4=\"\",E4=\"\"),\"\",SUM(K4,H4,E4))","v":""},{"$f":"IF(OR(M4=\"\"),\"\",M4*Paramétrages!$B$3)","v":""},{"$f":"IF(OR(N4=\"\",B4=\"\",L4=\"\"),\"\",((N4*100)/(((B4*1000)*L4)/60)))","v":""},"Ne remplir que les cellules en "]
[null,null,null,{"$f":"IF(OR(E5=\"\",C5=\"\",B5=\"\"),\"\",(((E5*Paramétrages!$B$3)*100)/(((B5*1000)*C5)/60)))","v":""},null,null,{"$f":"IF(OR(H5=\"\",F5=\"\",B5=\"\"),\"\",(((H5*Paramétrages!$B$3)*100)/(((B5*1000)*F5)/60)))","v":""},null,null,{"$f":"IF(OR(K5=\"\",I5=\"\",B5=\"\"),\"\",(((K5*Paramétrages!$B$3)*100)/(((B5*1000)*I5)/60)))","v":""},null,"Erreur",{"$f":"IF(OR(K5=\"\",H5=\"\",E5=\"\"),\"\",SUM(K5,H5,E5))","v":""},{"$f":"IF(OR(M5=\"\"),\"\",M5*Paramétrages!$B$3)","v":""},{"$f":"IF(OR(N5=\"\",B5=\"\",L5=\"\"),\"\",((N5*100)/(((B5*1000)*L5)/60)))","v":""},"(projets réalisés et les différents rôles)"]
[null,null,null,{"$f":"IF(OR(E6=\"\",C6=\"\",B6=\"\"),\"\",(((E6*Paramétrages!$B$3)*100)/(((B6*1000)*C6)/60)))","v":""},null,null,{"$f":"IF(OR(H6=\"\",F6=\"\",B6=\"\"),\"\",(((H6*Paramétrages!$B$3)*100)/(((B6*1000)*F6)/60)))","v":""},null,null,{"$f":"IF(OR(K6=\"\",I6=\"\",B6=\"\"),\"\",(((K6*Paramétrages!$B$3)*100)/(((B6*1000)*I6)/60)))","v":""},null,"Erreur","",{"$f":"IF(OR(M6=\"\"),\"\",M6*Paramétrages!$B$3)","v":""},""]
[null,null,null,{"$f":"IF(OR(E7=\"\",C7=\"\",B7=\"\"),\"\",(((E7*Paramétrages!$B$3)*100)/(((B7*1000)*C7)/60)))","v":""},null,null,{"$f":"IF(OR(H7=\"\",F7=\"\",B7=\"\"),\"\",(((H7*Paramétrages!$B$3)*100)/(((B7*1000)*F7)/60)))","v":""},null,null,{"$f":"IF(OR(K7=\"\",I7=\"\",B7=\"\"),\"\",(((K7*Paramétrages!$B$3)*100)/(((B7*1000)*I7)/60)))","v":""},null,"Erreur","",{"$f":"IF(OR(M7=\"\"),\"\",M7*Paramétrages!$B$3)","v":""},""]
[null,null,null,{"$f":"IF(OR(E8=\"\",C8=\"\",B8=\"\"),\"\",(((E8*Paramétrages!$B$3)*100)/(((B8*1000)*C8)/60)))","v":""},null,null,{"$f":"IF(OR(H8=\"\",F8=\"\",B8=\"\"),\"\",(((H8*Paramétrages!$B$3)*100)/(((B8*1000)*F8)/60)))","v":""},null,null,{"$f":"IF(OR(K8=\"\",I8=\"\",B8=\"\"),\"\",(((K8*Paramétrages!$B$3)*100)/(((B8*1000)*I8)/60)))","v":""},null,"Erreur","",{"$f":"IF(OR(M8=\"\"),\"\",M8*Paramétrages!$B$3)","v":""},""]
[null,null,null,{"$f":"IF(OR(E9=\"\",C9=\"\",B9=\"\"),\"\",(((E9*Paramétrages!$B$3)*100)/(((B9*1000)*C9)/60)))","v":""},null,null,{"$f":"IF(OR(H9=\"\",F9=\"\",B9=\"\"),\"\",(((H9*Paramétrages!$B$3)*100)/(((B9*1000)*F9)/60)))","v":""},null,null,{"$f":"IF(OR(K9=\"\",I9=\"\",B9=\"\"),\"\",(((K9*Paramétrages!$B$3)*100)/(((B9*1000)*I9)/60)))","v":""},null,"Erreur","",{"$f":"IF(OR(M9=\"\"),\"\",M9*Paramétrages!$B$3)","v":""},""]
[null,null,null,{"$f":"IF(OR(E10=\"\",C10=\"\",B10=\"\"),\"\",(((E10*Paramétrages!$B$3)*100)/(((B10*1000)*C10)/60)))","v":""},null,null,{"$f":"IF(OR(H10=\"\",F10=\"\",B10=\"\"),\"\",(((H10*Paramétrages!$B$3)*100)/(((B10*1000)*F10)/60)))","v":""},null,null,{"$f":"IF(OR(K10=\"\",I10=\"\",B10=\"\"),\"\",(((K10*Paramétrages!$B$3)*100)/(((B10*1000)*I10)/60)))","v":""},null,"Erreur","",{"$f":"IF(OR(M10=\"\"),\"\",M10*Paramétrages!$B$3)","v":""},""]
[null,null,null,{"$f":"IF(OR(E11=\"\",C11=\"\",B11=\"\"),\"\",(((E11*Paramétrages!$B$3)*100)/(((B11*1000)*C11)/60)))","v":""},null,null,{"$f":"IF(OR(H11=\"\",F11=\"\",B11=\"\"),\"\",(((H11*Paramétrages!$B$3)*100)/(((B11*1000)*F11)/60)))","v":""},null,null,{"$f":"IF(OR(K11=\"\",I11=\"\",B11=\"\"),\"\",(((K11*Paramétrages!$B$3)*100)/(((B11*1000)*I11)/60)))","v":""},null,"Erreur","",{"$f":"IF(OR(M11=\"\"),\"\",M11*Paramétrages!$B$3)","v":""},""]
[null,null,null,{"$f":"IF(OR(E12=\"\",C12=\"\",B12=\"\"),\"\",(((E12*Paramétrages!$B$3)*100)/(((B12*1000)*C12)/60)))","v":""},null,null,{"$f":"IF(OR(H12=\"\",F12=\"\",B12=\"\"),\"\",(((H12*Paramétrages!$B$3)*100)/(((B12*1000)*F12)/60)))","v":""},null,null,{"$f":"IF(OR(K12=\"\",I12=\"\",B12=\"\"),\"\",(((K12*Paramétrages!$B$3)*100)/(((B12*1000)*I12)/60)))","v":""},null,"Erreur","",{"$f":"IF(OR(M12=\"\"),\"\",M12*Paramétrages!$B$3)","v":""},""]
[null,null,null,{"$f":"IF(OR(E13=\"\",C13=\"\",B13=\"\"),\"\",(((E13*Paramétrages!$B$3)*100)/(((B13*1000)*C13)/60)))","v":""},null,null,{"$f":"IF(OR(H13=\"\",F13=\"\",B13=\"\"),\"\",(((H13*Paramétrages!$B$3)*100)/(((B13*1000)*F13)/60)))","v":""},null,null,{"$f":"IF(OR(K13=\"\",I13=\"\",B13=\"\"),\"\",(((K13*Paramétrages!$B$3)*100)/(((B13*1000)*I13)/60)))","v":""},null,"Erreur","",{"$f":"IF(OR(M13=\"\"),\"\",M13*Paramétrages!$B$3)","v":""},""]
[null,null,null,{"$f":"IF(OR(E14=\"\",C14=\"\",B14=\"\"),\"\",(((E14*Paramétrages!$B$3)*100)/(((B14*1000)*C14)/60)))","v":""},null,null,{"$f":"IF(OR(H14=\"\",F14=\"\",B14=\"\"),\"\",(((H14*Paramétrages!$B$3)*100)/(((B14*1000)*F14)/60)))","v":""},null,null,{"$f":"IF(OR(K14=\"\",I14=\"\",B14=\"\"),\"\",(((K14*Paramétrages!$B$3)*100)/(((B14*1000)*I14)/60)))","v":""},null,"Erreur","",{"$f":"IF(OR(M14=\"\"),\"\",M14*Paramétrages!$B$3)","v":""},""]
[null,null,null,{"$f":"IF(OR(E15=\"\",C15=\"\",B15=\"\"),\"\",(((E15*Paramétrages!$B$3)*100)/(((B15*1000)*C15)/60)))","v":""},null,null,{"$f":"IF(OR(H15=\"\",F15=\"\",B15=\"\"),\"\",(((H15*Paramétrages!$B$3)*100)/(((B15*1000)*F15)/60)))","v":""},null,null,{"$f":"IF(OR(K15=\"\",I15=\"\",B15=\"\"),\"\",(((K15*Paramétrages!$B$3)*100)/(((B15*1000)*I15)/60)))","v":""},null,"Erreur","",{"$f":"IF(OR(M15=\"\"),\"\",M15*Paramétrages!$B$3)","v":""},""]
[null,null,null,{"$f":"IF(OR(E16=\"\",C16=\"\",B16=\"\"),\"\",(((E16*Paramétrages!$B$3)*100)/(((B16*1000)*C16)/60)))","v":""},null,null,{"$f":"IF(OR(H16=\"\",F16=\"\",B16=\"\"),\"\",(((H16*Paramétrages!$B$3)*100)/(((B16*1000)*F16)/60)))","v":""},null,null,{"$f":"IF(OR(K16=\"\",I16=\"\",B16=\"\"),\"\",(((K16*Paramétrages!$B$3)*100)/(((B16*1000)*I16)/60)))","v":""},null,"Erreur","",{"$f":"IF(OR(M16=\"\"),\"\",M16*Paramétrages!$B$3)","v":""},""]
[null,null,null,{"$f":"IF(OR(E17=\"\",C17=\"\",B17=\"\"),\"\",(((E17*Paramétrages!$B$3)*100)/(((B17*1000)*C17)/60)))","v":""},null,null,{"$f":"IF(OR(H17=\"\",F17=\"\",B17=\"\"),\"\",(((H17*Paramétrages!$B$3)*100)/(((B17*1000)*F17)/60)))","v":""},null,null,{"$f":"IF(OR(K17=\"\",I17=\"\",B17=\"\"),\"\",(((K17*Paramétrages!$B$3)*100)/(((B17*1000)*I17)/60)))","v":""},null,"Erreur","",{"$f":"IF(OR(M17=\"\"),\"\",M17*Paramétrages!$B$3)","v":""},""]
[null,null,null,{"$f":"IF(OR(E18=\"\",C18=\"\",B18=\"\"),\"\",(((E18*Paramétrages!$B$3)*100)/(((B18*1000)*C18)/60)))","v":""},null,null,{"$f":"IF(OR(H18=\"\",F18=\"\",B18=\"\"),\"\",(((H18*Paramétrages!$B$3)*100)/(((B18*1000)*F18)/60)))","v":""},null,null,{"$f":"IF(OR(K18=\"\",I18=\"\",B18=\"\"),\"\",(((K18*Paramétrages!$B$3)*100)/(((B18*1000)*I18)/60)))","v":""},null,"Erreur","",{"$f":"IF(OR(M18=\"\"),\"\",M18*Paramétrages!$B$3)","v":""},""]
[null,null,null,{"$f":"IF(OR(E19=\"\",C19=\"\",B19=\"\"),\"\",(((E19*Paramétrages!$B$3)*100)/(((B19*1000)*C19)/60)))","v":""},null,null,{"$f":"IF(OR(H19=\"\",F19=\"\",B19=\"\"),\"\",(((H19*Paramétrages!$B$3)*100)/(((B19*1000)*F19)/60)))","v":""},null,null,{"$f":"IF(OR(K19=\"\",I19=\"\",B19=\"\"),\"\",(((K19*Paramétrages!$B$3)*100)/(((B19*1000)*I19)/60)))","v":""},null,"Erreur","",{"$f":"IF(OR(M19=\"\"),\"\",M19*Paramétrages!$B$3)","v":""},""]
[null,null,null,{"$f":"IF(OR(E20=\"\",C20=\"\",B20=\"\"),\"\",(((E20*Paramétrages!$B$3)*100)/(((B20*1000)*C20)/60)))","v":""},null,null,{"$f":"IF(OR(H20=\"\",F20=\"\",B20=\"\"),\"\",(((H20*Paramétrages!$B$3)*100)/(((B20*1000)*F20)/60)))","v":""},null,null,{"$f":"IF(OR(K20=\"\",I20=\"\",B20=\"\"),\"\",(((K20*Paramétrages!$B$3)*100)/(((B20*1000)*I20)/60)))","v":""},null,"Erreur","",{"$f":"IF(OR(M20=\"\"),\"\",M20*Paramétrages!$B$3)","v":""},""]
[null,null,null,{"$f":"IF(OR(E21=\"\",C21=\"\",B21=\"\"),\"\",(((E21*Paramétrages!$B$3)*100)/(((B21*1000)*C21)/60)))","v":""},null,null,{"$f":"IF(OR(H21=\"\",F21=\"\",B21=\"\"),\"\",(((H21*Paramétrages!$B$3)*100)/(((B21*1000)*F21)/60)))","v":""},null,null,{"$f":"IF(OR(K21=\"\",I21=\"\",B21=\"\"),\"\",(((K21*Paramétrages!$B$3)*100)/(((B21*1000)*I21)/60)))","v":""},null,"Erreur",{"$f":"IF(OR(K21=\"\",H21=\"\",E21=\"\"),\"\",SUM(K21,H21,E21))","v":""},{"$f":"IF(OR(M21=\"\"),\"\",M21*Paramétrages!$B$3)","v":""},""]
[null,null,null,{"$f":"IF(OR(E22=\"\",C22=\"\",B22=\"\"),\"\",(((E22*Paramétrages!$B$3)*100)/(((B22*1000)*C22)/60)))","v":""},null,null,{"$f":"IF(OR(H22=\"\",F22=\"\",B22=\"\"),\"\",(((H22*Paramétrages!$B$3)*100)/(((B22*1000)*F22)/60)))","v":""},null,null,{"$f":"IF(OR(K22=\"\",I22=\"\",B22=\"\"),\"\",(((K22*Paramétrages!$B$3)*100)/(((B22*1000)*I22)/60)))","v":""},null,"Erreur","",{"$f":"IF(OR(M22=\"\"),\"\",M22*Paramétrages!$B$3)","v":""},""]
[null,null,null,{"$f":"IF(OR(E23=\"\",C23=\"\",B23=\"\"),\"\",(((E23*Paramétrages!$B$3)*100)/(((B23*1000)*C23)/60)))","v":""},null,null,{"$f":"IF(OR(H23=\"\",F23=\"\",B23=\"\"),\"\",(((H23*Paramétrages!$B$3)*100)/(((B23*1000)*F23)/60)))","v":""},null,null,{"$f":"IF(OR(K23=\"\",I23=\"\",B23=\"\"),\"\",(((K23*Paramétrages!$B$3)*100)/(((B23*1000)*I23)/60)))","v":""},null,"Erreur","",{"$f":"IF(OR(M23=\"\"),\"\",M23*Paramétrages!$B$3)","v":""},""]
[null,null,null,{"$f":"IF(OR(E24=\"\",C24=\"\",B24=\"\"),\"\",(((E24*Paramétrages!$B$3)*100)/(((B24*1000)*C24)/60)))","v":""},null,null,{"$f":"IF(OR(H24=\"\",F24=\"\",B24=\"\"),\"\",(((H24*Paramétrages!$B$3)*100)/(((B24*1000)*F24)/60)))","v":""},null,null,{"$f":"IF(OR(K24=\"\",I24=\"\",B24=\"\"),\"\",(((K24*Paramétrages!$B$3)*100)/(((B24*1000)*I24)/60)))","v":""},null,"Erreur","",{"$f":"IF(OR(M24=\"\"),\"\",M24*Paramétrages!$B$3)","v":""},""]
[null,null,null,{"$f":"IF(OR(E25=\"\",C25=\"\",B25=\"\"),\"\",(((E25*Paramétrages!$B$3)*100)/(((B25*1000)*C25)/60)))","v":""},null,null,{"$f":"IF(OR(H25=\"\",F25=\"\",B25=\"\"),\"\",(((H25*Paramétrages!$B$3)*100)/(((B25*1000)*F25)/60)))","v":""},null,null,{"$f":"IF(OR(K25=\"\",I25=\"\",B25=\"\"),\"\",(((K25*Paramétrages!$B$3)*100)/(((B25*1000)*I25)/60)))","v":""},null,"Erreur","",{"$f":"IF(OR(M25=\"\"),\"\",M25*Paramétrages!$B$3)","v":""},""]
[null,null,null,{"$f":"IF(OR(E26=\"\",C26=\"\",B26=\"\"),\"\",(((E26*Paramétrages!$B$3)*100)/(((B26*1000)*C26)/60)))","v":""},null,null,{"$f":"IF(OR(H26=\"\",F26=\"\",B26=\"\"),\"\",(((H26*Paramétrages!$B$3)*100)/(((B26*1000)*F26)/60)))","v":""},null,null,{"$f":"IF(OR(K26=\"\",I26=\"\",B26=\"\"),\"\",(((K26*Paramétrages!$B$3)*100)/(((B26*1000)*I26)/60)))","v":""},null,"Erreur","",{"$f":"IF(OR(M26=\"\"),\"\",M26*Paramétrages!$B$3)","v":""},""]
[null,null,null,{"$f":"IF(OR(E27=\"\",C27=\"\",B27=\"\"),\"\",(((E27*Paramétrages!$B$3)*100)/(((B27*1000)*C27)/60)))","v":""},null,null,{"$f":"IF(OR(H27=\"\",F27=\"\",B27=\"\"),\"\",(((H27*Paramétrages!$B$3)*100)/(((B27*1000)*F27)/60)))","v":""},null,null,{"$f":"IF(OR(K27=\"\",I27=\"\",B27=\"\"),\"\",(((K27*Paramétrages!$B$3)*100)/(((B27*1000)*I27)/60)))","v":""},null,"Erreur","",{"$f":"IF(OR(M27=\"\"),\"\",M27*Paramétrages!$B$3)","v":""},""]
[null,null,null,{"$f":"IF(OR(E28=\"\",C28=\"\",B28=\"\"),\"\",(((E28*Paramétrages!$B$3)*100)/(((B28*1000)*C28)/60)))","v":""},null,null,{"$f":"IF(OR(H28=\"\",F28=\"\",B28=\"\"),\"\",(((H28*Paramétrages!$B$3)*100)/(((B28*1000)*F28)/60)))","v":""},null,null,{"$f":"IF(OR(K28=\"\",I28=\"\",B28=\"\"),\"\",(((K28*Paramétrages!$B$3)*100)/(((B28*1000)*I28)/60)))","v":""},null,"Erreur","",{"$f":"IF(OR(M28=\"\"),\"\",M28*Paramétrages!$B$3)","v":""},""]
[null,null,null,{"$f":"IF(OR(E29=\"\",C29=\"\",B29=\"\"),\"\",(((E29*Paramétrages!$B$3)*100)/(((B29*1000)*C29)/60)))","v":""},null,null,{"$f":"IF(OR(H29=\"\",F29=\"\",B29=\"\"),\"\",(((H29*Paramétrages!$B$3)*100)/(((B29*1000)*F29)/60)))","v":""},null,null,{"$f":"IF(OR(K29=\"\",I29=\"\",B29=\"\"),\"\",(((K29*Paramétrages!$B$3)*100)/(((B29*1000)*I29)/60)))","v":""},null,"Erreur","",{"$f":"IF(OR(M29=\"\"),\"\",M29*Paramétrages!$B$3)","v":""},""]
[null,null,null,{"$f":"IF(OR(E30=\"\",C30=\"\",B30=\"\"),\"\",(((E30*Paramétrages!$B$3)*100)/(((B30*1000)*C30)/60)))","v":""},null,null,{"$f":"IF(OR(H30=\"\",F30=\"\",B30=\"\"),\"\",(((H30*Paramétrages!$B$3)*100)/(((B30*1000)*F30)/60)))","v":""},null,null,{"$f":"IF(OR(K30=\"\",I30=\"\",B30=\"\"),\"\",(((K30*Paramétrages!$B$3)*100)/(((B30*1000)*I30)/60)))","v":""},null,"Erreur","",{"$f":"IF(OR(M30=\"\"),\"\",M30*Paramétrages!$B$3)","v":""},""]
[null,null,null,{"$f":"IF(OR(E31=\"\",C31=\"\",B31=\"\"),\"\",(((E31*Paramétrages!$B$3)*100)/(((B31*1000)*C31)/60)))","v":""},null,null,{"$f":"IF(OR(H31=\"\",F31=\"\",B31=\"\"),\"\",(((H31*Paramétrages!$B$3)*100)/(((B31*1000)*F31)/60)))","v":""},null,null,{"$f":"IF(OR(K31=\"\",I31=\"\",B31=\"\"),\"\",(((K31*Paramétrages!$B$3)*100)/(((B31*1000)*I31)/60)))","v":""},null,"Erreur",{"$f":"IF(OR(K31=\"\",H31=\"\",E31=\"\"),\"\",SUM(K31,H31,E31))","v":""},{"$f":"IF(OR(M31=\"\"),\"\",M31*Paramétrages!$B$3)","v":""},""]
[null,null,null,{"$f":"IF(OR(E32=\"\",C32=\"\",B32=\"\"),\"\",(((E32*Paramétrages!$B$3)*100)/(((B32*1000)*C32)/60)))","v":""},null,null,{"$f":"IF(OR(H32=\"\",F32=\"\",B32=\"\"),\"\",(((H32*Paramétrages!$B$3)*100)/(((B32*1000)*F32)/60)))","v":""},null,null,{"$f":"IF(OR(K32=\"\",I32=\"\",B32=\"\"),\"\",(((K32*Paramétrages!$B$3)*100)/(((B32*1000)*I32)/60)))","v":""},null,"Erreur","",{"$f":"IF(OR(M32=\"\"),\"\",M32*Paramétrages!$B$3)","v":""},""]
[null,null,null,{"$f":"IF(OR(E33=\"\",C33=\"\",B33=\"\"),\"\",(((E33*Paramétrages!$B$3)*100)/(((B33*1000)*C33)/60)))","v":""},null,null,{"$f":"IF(OR(H33=\"\",F33=\"\",B33=\"\"),\"\",(((H33*Paramétrages!$B$3)*100)/(((B33*1000)*F33)/60)))","v":""},null,null,{"$f":"IF(OR(K33=\"\",I33=\"\",B33=\"\"),\"\",(((K33*Paramétrages!$B$3)*100)/(((B33*1000)*I33)/60)))","v":""},null,"Erreur","",{"$f":"IF(OR(M33=\"\"),\"\",M33*Paramétrages!$B$3)","v":""},""]
[null,null,null,{"$f":"IF(OR(E34=\"\",C34=\"\",B34=\"\"),\"\",(((E34*Paramétrages!$B$3)*100)/(((B34*1000)*C34)/60)))","v":""},null,null,{"$f":"IF(OR(H34=\"\",F34=\"\",B34=\"\"),\"\",(((H34*Paramétrages!$B$3)*100)/(((B34*1000)*F34)/60)))","v":""},null,null,{"$f":"IF(OR(K34=\"\",I34=\"\",B34=\"\"),\"\",(((K34*Paramétrages!$B$3)*100)/(((B34*1000)*I34)/60)))","v":""},null,"Erreur","",{"$f":"IF(OR(M34=\"\"),\"\",M34*Paramétrages!$B$3)","v":""},""]
[null,null,null,{"$f":"IF(OR(E35=\"\",C35=\"\",B35=\"\"),\"\",(((E35*Paramétrages!$B$3)*100)/(((B35*1000)*C35)/60)))","v":""},null,null,{"$f":"IF(OR(H35=\"\",F35=\"\",B35=\"\"),\"\",(((H35*Paramétrages!$B$3)*100)/(((B35*1000)*F35)/60)))","v":""},null,null,{"$f":"IF(OR(K35=\"\",I35=\"\",B35=\"\"),\"\",(((K35*Paramétrages!$B$3)*100)/(((B35*1000)*I35)/60)))","v":""},null,"Erreur","",{"$f":"IF(OR(M35=\"\"),\"\",M35*Paramétrages!$B$3)","v":""},""]
[null,null,null,{"$f":"IF(OR(E36=\"\",C36=\"\",B36=\"\"),\"\",(((E36*Paramétrages!$B$3)*100)/(((B36*1000)*C36)/60)))","v":""},null,null,{"$f":"IF(OR(H36=\"\",F36=\"\",B36=\"\"),\"\",(((H36*Paramétrages!$B$3)*100)/(((B36*1000)*F36)/60)))","v":""},null,null,{"$f":"IF(OR(K36=\"\",I36=\"\",B36=\"\"),\"\",(((K36*Paramétrages!$B$3)*100)/(((B36*1000)*I36)/60)))","v":""},null,"Erreur","",{"$f":"IF(OR(M36=\"\"),\"\",M36*Paramétrages!$B$3)","v":""},""]
[null,null,null,{"$f":"IF(OR(E37=\"\",C37=\"\",B37=\"\"),\"\",(((E37*Paramétrages!$B$3)*100)/(((B37*1000)*C37)/60)))","v":""},null,null,{"$f":"IF(OR(H37=\"\",F37=\"\",B37=\"\"),\"\",(((H37*Paramétrages!$B$3)*100)/(((B37*1000)*F37)/60)))","v":""},null,null,{"$f":"IF(OR(K37=\"\",I37=\"\",B37=\"\"),\"\",(((K37*Paramétrages!$B$3)*100)/(((B37*1000)*I37)/60)))","v":""},null,"Erreur","",{"$f":"IF(OR(M37=\"\"),\"\",M37*Paramétrages!$B$3)","v":""},""]
[null,null,null,{"$f":"IF(OR(E38=\"\",C38=\"\",B38=\"\"),\"\",(((E38*Paramétrages!$B$3)*100)/(((B38*1000)*C38)/60)))","v":""},null,null,{"$f":"IF(OR(H38=\"\",F38=\"\",B38=\"\"),\"\",(((H38*Paramétrages!$B$3)*100)/(((B38*1000)*F38)/60)))","v":""},null,null,{"$f":"IF(OR(K38=\"\",I38=\"\",B38=\"\"),\"\",(((K38*Paramétrages!$B$3)*100)/(((B38*1000)*I38)/60)))","v":""},null,"Erreur","",{"$f":"IF(OR(M38=\"\"),\"\",M38*Paramétrages!$B$3)","v":""},""]
[null,null,null,{"$f":"IF(OR(E39=\"\",C39=\"\",B39=\"\"),\"\",(((E39*Paramétrages!$B$3)*100)/(((B39*1000)*C39)/60)))","v":""},null,null,{"$f":"IF(OR(H39=\"\",F39=\"\",B39=\"\"),\"\",(((H39*Paramétrages!$B$3)*100)/(((B39*1000)*F39)/60)))","v":""},null,null,{"$f":"IF(OR(K39=\"\",I39=\"\",B39=\"\"),\"\",(((K39*Paramétrages!$B$3)*100)/(((B39*1000)*I39)/60)))","v":""},null,"Erreur","",{"$f":"IF(OR(M39=\"\"),\"\",M39*Paramétrages!$B$3)","v":""},""]
[null,null,null,{"$f":"IF(OR(E40=\"\",C40=\"\",B40=\"\"),\"\",(((E40*Paramétrages!$B$3)*100)/(((B40*1000)*C40)/60)))","v":""},null,null,{"$f":"IF(OR(H40=\"\",F40=\"\",B40=\"\"),\"\",(((H40*Paramétrages!$B$3)*100)/(((B40*1000)*F40)/60)))","v":""},null,null,{"$f":"IF(OR(K40=\"\",I40=\"\",B40=\"\"),\"\",(((K40*Paramétrages!$B$3)*100)/(((B40*1000)*I40)/60)))","v":""},null,"Erreur","",{"$f":"IF(OR(M40=\"\"),\"\",M40*Paramétrages!$B$3)","v":""},""]

{"sheet":"Résultats 3 courses","index":6,"n_rows":43,"n_cols":26,"rows_kept":43,"cut":false,"hidden":false,"merged":[[2,0,2,1],[4,0,5,0],[4,1,5,1],[4,2,4,6],[4,7,4,11],[4,12,4,16],[4,21,5,21],[4,17,5,17],[4,18,5,18],[4,19,5,19],[4,20,5,20]]}
[]
["Ne remplir que les cellules en "]
["(projets réalisés et les différents rôles)"]
[]
["Nom","VMA","Course 1",null,null,null,null,"Course 2",null,null,null,null,"Course 3",null,null,null,null,"Diff rôles /4 pts","Tps total de course","Ecart total","VMA moy envisagée","VMA moy réalisée",8,8,4]
[null,null,"Tps de course","Projet","Réalisé","%VMA","Ecart projet","Tps de course","Projet","Réalisé","%VMA","Ecart projet","Tps de course","Projet","Réalisé","%VMA","Ecart projet",null,null,null,null,null,"Perf","Projet","Obs","Note"]
[{"$f":"'Données élèves 3 courses'!A4","v":0},{"$f":"'Données élèves 3 courses'!B4","v":0},{"$f":"'Données élèves 3 courses'!C4","v":0},{"$f":"'Données élèves 3 courses'!E4","v":0},null,{"$f":"IF(((E7*Paramétrages!$B$3)*100)/(((B7*1000)*C7)/60)>100,100,((E7*Paramétrages!$B$3)*100)/(((B7*1000)*C7)/60))","v":{"$error":"#DIV/0!"}},{"$f":"ABS(D7-E7)","v":0},{"$f":"'Données élèves 3 courses'!F4","v":0},{"$f":"'Données élèves 3 courses'!H4","v":0},null,{"$f":"IF(((J7*Paramétrages!$B$3)*100)/(((B7*1000)*H7)/60)>100,100,((J7*Paramétrages!$B$3)*100)/(((B7*1000)*H7)/60))","v":{"$error":"#DIV/0!"}},{"$f":"ABS(I7-J7)","v":0},{"$f":"'Données élèves 3 courses'!I4","v":0},{"$f":"'Données élèves 3 courses'!K4","v":0},null,{"$f":"IF(((O7*Paramétrages!$B$3)*100)/(((B7*1000)*M7)/60)>100,100,((O7*Paramétrages!$B$3)*100)/(((B7*1000)*M7)/60))","v":{"$error":"#DIV/0!"}},{"$f":"ABS(N7-O7)","v":0},null,{"$f":"IF((SUM(C7,H7,M7))>15,\"Erreur\",IF((SUM(C7,H7,M7))<12,\"Erreur\",(SUM(C7,H7,M7))))","v":"Erreur"},{"$f":"(SUM(Q7,L7,G7))","v":0},{"$f":"'Données élèves 3 courses'!O4","v":""},{"$f":"AVERAGE(F7,K7,P7)","v":{"$error":"#DIV/0!"}},{"$f":"IF((AVERAGE(P7,K7,F7))>97,Paramétrages!$F$3,IF((AVERAGE(P7,K7,F7))>95,Paramétrages!$F$4,IF((AVERAGE(P7,K7,F7))>92,Paramétrages!$F$5,IF((AVERAGE(P7,K7,F7))>89,Paramétrages!$F$6,IF((AVERAGE(P7,K7,F7))>85,Paramétrages!$F$7,IF((AVERAGE(P7,K7,F7))>82,Paramétrages!$F$8,IF((AVERAGE(P7,K7,F7))>79,Paramétrages!$F$9,IF((AVERAGE(P7,K7,F7))<80,Paramétrages!$F$10,\"0\"))))))))","v":{"$error":"#DIV/0!"}},{"$f":"IF((SUM(Q7,L7,G7))=Paramétrages!$H$3,Paramétrages!$I$3,IF((SUM(Q7,L7,G7))=Paramétrages!$H$4,Paramétrages!$I$4,IF((SUM(Q7,L7,G7))=Paramétrages!$H$5,Paramétrages!$I$5,IF((SUM(Q7,L7,G7))=Paramétrages!$H$6,Paramétrages!$I$6,IF((SUM(Q7,L7,G7))=Paramétrages!$H$7,Paramétrages!$I$7,IF((SUM(Q7,L7,G7))=Paramétrages!$H$8,Paramétrages!$I$8,IF((SUM(Q7,L7,G7))=Paramétrages!$H$9,Paramétrages!$I$9,IF((SUM(Q7,L7,G7))=Paramétrages!$H$10,Paramétrages!$I$10,IF((SUM(Q7,L7,G7))=Paramétrages!$H$11,Paramétrages!$I$11,IF((SUM(Q7,L7,G7))=Paramétrages!$H$12,Paramétrages!$I$12,IF((SUM(Q7,L7,G7))>Paramétrages!$H$13,Paramétrages!$I$13,\"0\")))))))))))","v":8},{"$f":"R7","v":0},{"$f":"SUM(W7:Y7)","v":{"$error":"#DIV/0!"}}]
[{"$f":"'Données élèves 3 courses'!A5","v":0},{"$f":"'Données élèves 3 courses'!B5","v":0},{"$f":"'Données élèves 3 courses'!C5","v":0},{"$f":"'Données élèves 3 courses'!E5","v":0},null,{"$f":"IF(((E8*Paramétrages!$B$3)*100)/(((B8*1000)*C8)/60)>100,100,((E8*Paramétrages!$B$3)*100)/(((B8*1000)*C8)/60))","v":{"$error":"#DIV/0!"}},{"$f":"ABS(D8-E8)","v":0},{"$f":"'Données élèves 3 courses'!F5","v":0},{"$f":"'Données élèves 3 courses'!H5","v":0},null,{"$f":"IF(((J8*Paramétrages!$B$3)*100)/(((B8*1000)*H8)/60)>100,100,((J8*Paramétrages!$B$3)*100)/(((B8*1000)*H8)/60))","v":{"$error":"#DIV/0!"}},{"$f":"ABS(I8-J8)","v":0},{"$f":"'Données élèves 3 courses'!I5","v":0},{"$f":"'Données élèves 3 courses'!K5","v":0},null,{"$f":"IF(((O8*Paramétrages!$B$3)*100)/(((B8*1000)*M8)/60)>100,100,((O8*Paramétrages!$B$3)*100)/(((B8*1000)*M8)/60))","v":{"$error":"#DIV/0!"}},{"$f":"ABS(N8-O8)","v":0},null,{"$f":"IF((SUM(C8,H8,M8))>15,\"Erreur\",IF((SUM(C8,H8,M8))<12,\"Erreur\",(SUM(C8,H8,M8))))","v":"Erreur"},{"$f":"(SUM(Q8,L8,G8))","v":0},{"$f":"'Données élèves 3 courses'!O5","v":""},{"$f":"AVERAGE(F8,K8,P8)","v":{"$error":"#DIV/0!"}},{"$f":"IF((AVERAGE(P8,K8,F8))>97,Paramétrages!$F$3,IF((AVERAGE(P8,K8,F8))>95,Paramétrages!$F$4,IF((AVERAGE(P8,K8,F8))>92,Paramétrages!$F$5,IF((AVERAGE(P8,K8,F8))>89,Paramétrages!$F$6,IF((AVERAGE(P8,K8,F8))>85,Paramétrages!$F$7,IF((AVERAGE(P8,K8,F8))>82,Paramétrages!$F$8,IF((AVERAGE(P8,K8,F8))>79,Paramétrages!$F$9,IF((AVERAGE(P8,K8,F8))<80,Paramétrages!$F$10,\"0\"))))))))","v":{"$error":"#DIV/0!"}},{"$f":"IF((SUM(Q8,L8,G8))=Paramétrages!$H$3,Paramétrages!$I$3,IF((SUM(Q8,L8,G8))=Paramétrages!$H$4,Paramétrages!$I$4,IF((SUM(Q8,L8,G8))=Paramétrages!$H$5,Paramétrages!$I$5,IF((SUM(Q8,L8,G8))=Paramétrages!$H$6,Paramétrages!$I$6,IF((SUM(Q8,L8,G8))=Paramétrages!$H$7,Paramétrages!$I$7,IF((SUM(Q8,L8,G8))=Paramétrages!$H$8,Paramétrages!$I$8,IF((SUM(Q8,L8,G8))=Paramétrages!$H$9,Paramétrages!$I$9,IF((SUM(Q8,L8,G8))=Paramétrages!$H$10,Paramétrages!$I$10,IF((SUM(Q8,L8,G8))=Paramétrages!$H$11,Paramétrages!$I$11,IF((SUM(Q8,L8,G8))=Paramétrages!$H$12,Paramétrages!$I$12,IF((SUM(Q8,L8,G8))>Paramétrages!$H$13,Paramétrages!$I$13,\"0\")))))))))))","v":8},{"$f":"R8","v":0},{"$error":"#DIV/0!"}]
[{"$f":"'Données élèves 3 courses'!A6","v":0},{"$f":"'Données élèves 3 courses'!B6","v":0},{"$f":"'Données élèves 3 courses'!C6","v":0},{"$f":"'Données élèves 3 courses'!E6","v":0},null,{"$f":"IF(((E9*Paramétrages!$B$3)*100)/(((B9*1000)*C9)/60)>100,100,((E9*Paramétrages!$B$3)*100)/(((B9*1000)*C9)/60))","v":{"$error":"#DIV/0!"}},0,{"$f":"'Données élèves 3 courses'!F6","v":0},{"$f":"'Données élèves 3 courses'!H6","v":0},null,{"$f":"IF(((J9*Paramétrages!$B$3)*100)/(((B9*1000)*H9)/60)>100,100,((J9*Paramétrages!$B$3)*100)/(((B9*1000)*H9)/60))","v":{"$error":"#DIV/0!"}},0,{"$f":"'Données élèves 3 courses'!I6","v":0},{"$f":"'Données élèves 3 courses'!K6","v":0},null,{"$f":"IF(((O9*Paramétrages!$B$3)*100)/(((B9*1000)*M9)/60)>100,100,((O9*Paramétrages!$B$3)*100)/(((B9*1000)*M9)/60))","v":{"$error":"#DIV/0!"}},0,null,"Erreur",0,{"$f":"'Données élèves 3 courses'!O6","v":""},{"$error":"#DIV/0!"},{"$f":"IF((AVERAGE(P9,K9,F9))>97,Paramétrages!$F$3,IF((AVERAGE(P9,K9,F9))>95,Paramétrages!$F$4,IF((AVERAGE(P9,K9,F9))>92,Paramétrages!$F$5,IF((AVERAGE(P9,K9,F9))>89,Paramétrages!$F$6,IF((AVERAGE(P9,K9,F9))>85,Paramétrages!$F$7,IF((AVERAGE(P9,K9,F9))>82,Paramétrages!$F$8,IF((AVERAGE(P9,K9,F9))>79,Paramétrages!$F$9,IF((AVERAGE(P9,K9,F9))<80,Paramétrages!$F$10,\"0\"))))))))","v":{"$error":"#DIV/0!"}},{"$f":"IF((SUM(Q9,L9,G9))=Paramétrages!$H$3,Paramétrages!$I$3,IF((SUM(Q9,L9,G9))=Paramétrages!$H$4,Paramétrages!$I$4,IF((SUM(Q9,L9,G9))=Paramétrages!$H$5,Paramétrages!$I$5,IF((SUM(Q9,L9,G9))=Paramétrages!$H$6,Paramétrages!$I$6,IF((SUM(Q9,L9,G9))=Paramétrages!$H$7,Paramétrages!$I$7,IF((SUM(Q9,L9,G9))=Paramétrages!$H$8,Paramétrages!$I$8,IF((SUM(Q9,L9,G9))=Paramétrages!$H$9,Paramétrages!$I$9,IF((SUM(Q9,L9,G9))=Paramétrages!$H$10,Paramétrages!$I$10,IF((SUM(Q9,L9,G9))=Paramétrages!$H$11,Paramétrages!$I$11,IF((SUM(Q9,L9,G9))=Paramétrages!$H$12,Paramétrages!$I$12,IF((SUM(Q9,L9,G9))>Paramétrages!$H$13,Paramétrages!$I$13,\"0\")))))))))))","v":8},0,{"$error":"#DIV/0!"}]
[{"$f":"'Données élèves 3 courses'!A7","v":0},{"$f":"'Données élèves 3 courses'!B7","v":0},{"$f":"'Données élèves 3 courses'!C7","v":0},{"$f":"'Données élèves 3 courses'!E7","v":0},null,{"$f":"IF(((E10*Paramétrages!$B$3)*100)/(((B10*1000)*C10)/60)>100,100,((E10*Paramétrages!$B$3)*100)/(((B10*1000)*C10)/60))","v":{"$error":"#DIV/0!"}},0,{"$f":"'Données élèves 3 courses'!F7","v":0},{"$f":"'Données élèves 3 courses'!H7","v":0},null,{"$f":"IF(((J10*Paramétrages!$B$3)*100)/(((B10*1000)*H10)/60)>100,100,((J10*Paramétrages!$B$3)*100)/(((B10*1000)*H10)/60))","v":{"$error":"#DIV/0!"}},0,{"$f":"'Données élèves 3 courses'!I7","v":0},{"$f":"'Données élèves 3 courses'!K7","v":0},null,{"$f":"IF(((O10*Paramétrages!$B$3)*100)/(((B10*1000)*M10)/60)>100,100,((O10*Paramétrages!$B$3)*100)/(((B10*1000)*M10)/60))","v":{"$error":"#DIV/0!"}},0,null,"Erreur",0,{"$f":"'Données élèves 3 courses'!O7","v":""},{"$error":"#DIV/0!"},{"$f":"IF((AVERAGE(P10,K10,F10))>97,Paramétrages!$F$3,IF((AVERAGE(P10,K10,F10))>95,Paramétrages!$F$4,IF((AVERAGE(P10,K10,F10))>92,Paramétrages!$F$5,IF((AVERAGE(P10,K10,F10))>89,Paramétrages!$F$6,IF((AVERAGE(P10,K10,F10))>85,Paramétrages!$F$7,IF((AVERAGE(P10,K10,F10))>82,Paramétrages!$F$8,IF((AVERAGE(P10,K10,F10))>79,Paramétrages!$F$9,IF((AVERAGE(P10,K10,F10))<80,Paramétrages!$F$10,\"0\"))))))))","v":{"$error":"#DIV/0!"}},{"$f":"IF((SUM(Q10,L10,G10))=Paramétrages!$H$3,Paramétrages!$I$3,IF((SUM(Q10,L10,G10))=Paramétrages!$H$4,Paramétrages!$I$4,IF((SUM(Q10,L10,G10))=Paramétrages!$H$5,Paramétrages!$I$5,IF((SUM(Q10,L10,G10))=Paramétrages!$H$6,Paramétrages!$I$6,IF((SUM(Q10,L10,G10))=Paramétrages!$H$7,Paramétrages!$I$7,IF((SUM(Q10,L10,G10))=Paramétrages!$H$8,Paramétrages!$I$8,IF((SUM(Q10,L10,G10))=Paramétrages!$H$9,Paramétrages!$I$9,IF((SUM(Q10,L10,G10))=Paramétrages!$H$10,Paramétrages!$I$10,IF((SUM(Q10,L10,G10))=Paramétrages!$H$11,Paramétrages!$I$11,IF((SUM(Q10,L10,G10))=Paramétrages!$H$12,Paramétrages!$I$12,IF((SUM(Q10,L10,G10))>Paramétrages!$H$13,Paramétrages!$I$13,\"0\")))))))))))","v":8},0,{"$error":"#DIV/0!"}]
[{"$f":"'Données élèves 3 courses'!A8","v":0},{"$f":"'Données élèves 3 courses'!B8","v":0},{"$f":"'Données élèves 3 courses'!C8","v":0},{"$f":"'Données élèves 3 courses'!E8","v":0},null,{"$f":"IF(((E11*Paramétrages!$B$3)*100)/(((B11*1000)*C11)/60)>100,100,((E11*Paramétrages!$B$3)*100)/(((B11*1000)*C11)/60))","v":{"$error":"#DIV/0!"}},0,{"$f":"'Données élèves 3 courses'!F8","v":0},{"$f":"'Données élèves 3 courses'!H8","v":0},null,{"$f":"IF(((J11*Paramétrages!$B$3)*100)/(((B11*1000)*H11)/60)>100,100,((J11*Paramétrages!$B$3)*100)/(((B11*1000)*H11)/60))","v":{"$error":"#DIV/0!"}},0,{"$f":"'Données élèves 3 courses'!I8","v":0},{"$f":"'Données élèves 3 courses'!K8","v":0},null,{"$f":"IF(((O11*Paramétrages!$B$3)*100)/(((B11*1000)*M11)/60)>100,100,((O11*Paramétrages!$B$3)*100)/(((B11*1000)*M11)/60))","v":{"$error":"#DIV/0!"}},0,null,"Erreur",0,{"$f":"'Données élèves 3 courses'!O8","v":""},{"$error":"#DIV/0!"},{"$f":"IF((AVERAGE(P11,K11,F11))>97,Paramétrages!$F$3,IF((AVERAGE(P11,K11,F11))>95,Paramétrages!$F$4,IF((AVERAGE(P11,K11,F11))>92,Paramétrages!$F$5,IF((AVERAGE(P11,K11,F11))>89,Paramétrages!$F$6,IF((AVERAGE(P11,K11,F11))>85,Paramétrages!$F$7,IF((AVERAGE(P11,K11,F11))>82,Paramétrages!$F$8,IF((AVERAGE(P11,K11,F11))>79,Paramétrages!$F$9,IF((AVERAGE(P11,K11,F11))<80,Paramétrages!$F$10,\"0\"))))))))","v":{"$error":"#DIV/0!"}},{"$f":"IF((SUM(Q11,L11,G11))=Paramétrages!$H$3,Paramétrages!$I$3,IF((SUM(Q11,L11,G11))=Paramétrages!$H$4,Paramétrages!$I$4,IF((SUM(Q11,L11,G11))=Paramétrages!$H$5,Paramétrages!$I$5,IF((SUM(Q11,L11,G11))=Paramétrages!$H$6,Paramétrages!$I$6,IF((SUM(Q11,L11,G11))=Paramétrages!$H$7,Paramétrages!$I$7,IF((SUM(Q11,L11,G11))=Paramétrages!$H$8,Paramétrages!$I$8,IF((SUM(Q11,L11,G11))=Paramétrages!$H$9,Paramétrages!$I$9,IF((SUM(Q11,L11,G11))=Paramétrages!$H$10,Paramétrages!$I$10,IF((SUM(Q11,L11,G11))=Paramétrages!$H$11,Paramétrages!$I$11,IF((SUM(Q11,L11,G11))=Paramétrages!$H$12,Paramétrages!$I$12,IF((SUM(Q11,L11,G11))>Paramétrages!$H$13,Paramétrages!$I$13,\"0\")))))))))))","v":8},0,{"$error":"#DIV/0!"}]
[{"$f":"'Données élèves 3 courses'!A9","v":0},{"$f":"'Données élèves 3 courses'!B9","v":0},{"$f":"'Données élèves 3 courses'!C9","v":0},{"$f":"'Données élèves 3 courses'!E9","v":0},null,{"$f":"IF(((E12*Paramétrages!$B$3)*100)/(((B12*1000)*C12)/60)>100,100,((E12*Paramétrages!$B$3)*100)/(((B12*1000)*C12)/60))","v":{"$error":"#DIV/0!"}},0,{"$f":"'Données élèves 3 courses'!F9","v":0},{"$f":"'Données élèves 3 courses'!H9","v":0},null,{"$f":"IF(((J12*Paramétrages!$B$3)*100)/(((B12*1000)*H12)/60)>100,100,((J12*Paramétrages!$B$3)*100)/(((B12*1000)*H12)/60))","v":{"$error":"#DIV/0!"}},0,{"$f":"'Données élèves 3 courses'!I9","v":0},{"$f":"'Données élèves 3 courses'!K9","v":0},null,{"$f":"IF(((O12*Paramétrages!$B$3)*100)/(((B12*1000)*M12)/60)>100,100,((O12*Paramétrages!$B$3)*100)/(((B12*1000)*M12)/60))","v":{"$error":"#DIV/0!"}},0,null,"Erreur",0,{"$f":"'Données élèves 3 courses'!O9","v":""},{"$error":"#DIV/0!"},{"$f":"IF((AVERAGE(P12,K12,F12))>97,Paramétrages!$F$3,IF((AVERAGE(P12,K12,F12))>95,Paramétrages!$F$4,IF((AVERAGE(P12,K12,F12))>92,Paramétrages!$F$5,IF((AVERAGE(P12,K12,F12))>89,Paramétrages!$F$6,IF((AVERAGE(P12,K12,F12))>85,Paramétrages!$F$7,IF((AVERAGE(P12,K12,F12))>82,Paramétrages!$F$8,IF((AVERAGE(P12,K12,F12))>79,Paramétrages!$F$9,IF((AVERAGE(P12,K12,F12))<80,Paramétrages!$F$10,\"0\"))))))))","v":{"$error":"#DIV/0!"}},{"$f":"IF((SUM(Q12,L12,G12))=Paramétrages!$H$3,Paramétrages!$I$3,IF((SUM(Q12,L12,G12))=Paramétrages!$H$4,Paramétrages!$I$4,IF((SUM(Q12,L12,G12))=Paramétrages!$H$5,Paramétrages!$I$5,IF((SUM(Q12,L12,G12))=Paramétrages!$H$6,Paramétrages!$I$6,IF((SUM(Q12,L12,G12))=Paramétrages!$H$7,Paramétrages!$I$7,IF((SUM(Q12,L12,G12))=Paramétrages!$H$8,Paramétrages!$I$8,IF((SUM(Q12,L12,G12))=Paramétrages!$H$9,Paramétrages!$I$9,IF((SUM(Q12,L12,G12))=Paramétrages!$H$10,Paramétrages!$I$10,IF((SUM(Q12,L12,G12))=Paramétrages!$H$11,Paramétrages!$I$11,IF((SUM(Q12,L12,G12))=Paramétrages!$H$12,Paramétrages!$I$12,IF((SUM(Q12,L12,G12))>Paramétrages!$H$13,Paramétrages!$I$13,\"0\")))))))))))","v":8},0,{"$error":"#DIV/0!"}]
[{"$f":"'Données élèves 3 courses'!A10","v":0},{"$f":"'Données élèves 3 courses'!B10","v":0},{"$f":"'Données élèves 3 courses'!C10","v":0},{"$f":"'Données élèves 3 courses'!E10","v":0},null,{"$f":"IF(((E13*Paramétrages!$B$3)*100)/(((B13*1000)*C13)/60)>100,100,((E13*Paramétrages!$B$3)*100)/(((B13*1000)*C13)/60))","v":{"$error":"#DIV/0!"}},0,{"$f":"'Données élèves 3 courses'!F10","v":0},{"$f":"'Données élèves 3 courses'!H10","v":0},null,{"$f":"IF(((J13*Paramétrages!$B$3)*100)/(((B13*1000)*H13)/60)>100,100,((J13*Paramétrages!$B$3)*100)/(((B13*1000)*H13)/60))","v":{"$error":"#DIV/0!"}},0,{"$f":"'Données élèves 3 courses'!I10","v":0},{"$f":"'Données élèves 3 courses'!K10","v":0},null,{"$f":"IF(((O13*Paramétrages!$B$3)*100)/(((B13*1000)*M13)/60)>100,100,((O13*Paramétrages!$B$3)*100)/(((B13*1000)*M13)/60))","v":{"$error":"#DIV/0!"}},0,null,"Erreur",0,{"$f":"'Données élèves 3 courses'!O10","v":""},{"$error":"#DIV/0!"},{"$f":"IF((AVERAGE(P13,K13,F13))>97,Paramétrages!$F$3,IF((AVERAGE(P13,K13,F13))>95,Paramétrages!$F$4,IF((AVERAGE(P13,K13,F13))>92,Paramétrages!$F$5,IF((AVERAGE(P13,K13,F13))>89,Paramétrages!$F$6,IF((AVERAGE(P13,K13,F13))>85,Paramétrages!$F$7,IF((AVERAGE(P13,K13,F13))>82,Paramétrages!$F$8,IF((AVERAGE(P13,K13,F13))>79,Paramétrages!$F$9,IF((AVERAGE(P13,K13,F13))<80,Paramétrages!$F$10,\"0\"))))))))","v":{"$error":"#DIV/0!"}},{"$f":"IF((SUM(Q13,L13,G13))=Paramétrages!$H$3,Paramétrages!$I$3,IF((SUM(Q13,L13,G13))=Paramétrages!$H$4,Paramétrages!$I$4,IF((SUM(Q13,L13,G13))=Paramétrages!$H$5,Paramétrages!$I$5,IF((SUM(Q13,L13,G13))=Paramétrages!$H$6,Paramétrages!$I$6,IF((SUM(Q13,L13,G13))=Paramétrages!$H$7,Paramétrages!$I$7,IF((SUM(Q13,L13,G13))=Paramétrages!$H$8,Paramétrages!$I$8,IF((SUM(Q13,L13,G13))=Paramétrages!$H$9,Paramétrages!$I$9,IF((SUM(Q13,L13,G13))=Paramétrages!$H$10,Paramétrages!$I$10,IF((SUM(Q13,L13,G13))=Paramétrages!$H$11,Paramétrages!$I$11,IF((SUM(Q13,L13,G13))=Paramétrages!$H$12,Paramétrages!$I$12,IF((SUM(Q13,L13,G13))>Paramétrages!$H$13,Paramétrages!$I$13,\"0\")))))))))))","v":8},0,{"$error":"#DIV/0!"}]
[{"$f":"'Données élèves 3 courses'!A11","v":0},{"$f":"'Données élèves 3 courses'!B11","v":0},{"$f":"'Données élèves 3 courses'!C11","v":0},{"$f":"'Données élèves 3 courses'!E11","v":0},null,{"$f":"IF(((E14*Paramétrages!$B$3)*100)/(((B14*1000)*C14)/60)>100,100,((E14*Paramétrages!$B$3)*100)/(((B14*1000)*C14)/60))","v":{"$error":"#DIV/0!"}},0,{"$f":"'Données élèves 3 courses'!F11","v":0},{"$f":"'Données élèves 3 courses'!H11","v":0},null,{"$f":"IF(((J14*Paramétrages!$B$3)*100)/(((B14*1000)*H14)/60)>100,100,((J14*Paramétrages!$B$3)*100)/(((B14*1000)*H14)/60))","v":{"$error":"#DIV/0!"}},0,{"$f":"'Données élèves 3 courses'!I11","v":0},{"$f":"'Données élèves 3 courses'!K11","v":0},null,{"$f":"IF(((O14*Paramétrages!$B$3)*100)/(((B14*1000)*M14)/60)>100,100,((O14*Paramétrages!$B$3)*100)/(((B14*1000)*M14)/60))","v":{"$error":"#DIV/0!"}},0,null,"Erreur",0,{"$f":"'Données élèves 3 courses'!O11","v":""},{"$error":"#DIV/0!"},{"$f":"IF((AVERAGE(P14,K14,F14))>97,Paramétrages!$F$3,IF((AVERAGE(P14,K14,F14))>95,Paramétrages!$F$4,IF((AVERAGE(P14,K14,F14))>92,Paramétrages!$F$5,IF((AVERAGE(P14,K14,F14))>89,Paramétrages!$F$6,IF((AVERAGE(P14,K14,F14))>85,Paramétrages!$F$7,IF((AVERAGE(P14,K14,F14))>82,Paramétrages!$F$8,IF((AVERAGE(P14,K14,F14))>79,Paramétrages!$F$9,IF((AVERAGE(P14,K14,F14))<80,Paramétrages!$F$10,\"0\"))))))))","v":{"$error":"#DIV/0!"}},{"$f":"IF((SUM(Q14,L14,G14))=Paramétrages!$H$3,Paramétrages!$I$3,IF((SUM(Q14,L14,G14))=Paramétrages!$H$4,Paramétrages!$I$4,IF((SUM(Q14,L14,G14))=Paramétrages!$H$5,Paramétrages!$I$5,IF((SUM(Q14,L14,G14))=Paramétrages!$H$6,Paramétrages!$I$6,IF((SUM(Q14,L14,G14))=Paramétrages!$H$7,Paramétrages!$I$7,IF((SUM(Q14,L14,G14))=Paramétrages!$H$8,Paramétrages!$I$8,IF((SUM(Q14,L14,G14))=Paramétrages!$H$9,Paramétrages!$I$9,IF((SUM(Q14,L14,G14))=Paramétrages!$H$10,Paramétrages!$I$10,IF((SUM(Q14,L14,G14))=Paramétrages!$H$11,Paramétrages!$I$11,IF((SUM(Q14,L14,G14))=Paramétrages!$H$12,Paramétrages!$I$12,IF((SUM(Q14,L14,G14))>Paramétrages!$H$13,Paramétrages!$I$13,\"0\")))))))))))","v":8},0,{"$error":"#DIV/0!"}]
[{"$f":"'Données élèves 3 courses'!A12","v":0},{"$f":"'Données élèves 3 courses'!B12","v":0},{"$f":"'Données élèves 3 courses'!C12","v":0},{"$f":"'Données élèves 3 courses'!E12","v":0},null,{"$f":"IF(((E15*Paramétrages!$B$3)*100)/(((B15*1000)*C15)/60)>100,100,((E15*Paramétrages!$B$3)*100)/(((B15*1000)*C15)/60))","v":{"$error":"#DIV/0!"}},0,{"$f":"'Données élèves 3 courses'!F12","v":0},{"$f":"'Données élèves 3 courses'!H12","v":0},null,{"$f":"IF(((J15*Paramétrages!$B$3)*100)/(((B15*1000)*H15)/60)>100,100,((J15*Paramétrages!$B$3)*100)/(((B15*1000)*H15)/60))","v":{"$error":"#DIV/0!"}},0,{"$f":"'Données élèves 3 courses'!I12","v":0},{"$f":"'Données élèves 3 courses'!K12","v":0},null,{"$f":"IF(((O15*Paramétrages!$B$3)*100)/(((B15*1000)*M15)/60)>100,100,((O15*Paramétrages!$B$3)*100)/(((B15*1000)*M15)/60))","v":{"$error":"#DIV/0!"}},0,null,"Erreur",0,{"$f":"'Données élèves 3 courses'!O12","v":""},{"$error":"#DIV/0!"},{"$f":"IF((AVERAGE(P15,K15,F15))>97,Paramétrages!$F$3,IF((AVERAGE(P15,K15,F15))>95,Paramétrages!$F$4,IF((AVERAGE(P15,K15,F15))>92,Paramétrages!$F$5,IF((AVERAGE(P15,K15,F15))>89,Paramétrages!$F$6,IF((AVERAGE(P15,K15,F15))>85,Paramétrages!$F$7,IF((AVERAGE(P15,K15,F15))>82,Paramétrages!$F$8,IF((AVERAGE(P15,K15,F15))>79,Paramétrages!$F$9,IF((AVERAGE(P15,K15,F15))<80,Paramétrages!$F$10,\"0\"))))))))","v":{"$error":"#DIV/0!"}},{"$f":"IF((SUM(Q15,L15,G15))=Paramétrages!$H$3,Paramétrages!$I$3,IF((SUM(Q15,L15,G15))=Paramétrages!$H$4,Paramétrages!$I$4,IF((SUM(Q15,L15,G15))=Paramétrages!$H$5,Paramétrages!$I$5,IF((SUM(Q15,L15,G15))=Paramétrages!$H$6,Paramétrages!$I$6,IF((SUM(Q15,L15,G15))=Paramétrages!$H$7,Paramétrages!$I$7,IF((SUM(Q15,L15,G15))=Paramétrages!$H$8,Paramétrages!$I$8,IF((SUM(Q15,L15,G15))=Paramétrages!$H$9,Paramétrages!$I$9,IF((SUM(Q15,L15,G15))=Paramétrages!$H$10,Paramétrages!$I$10,IF((SUM(Q15,L15,G15))=Paramétrages!$H$11,Paramétrages!$I$11,IF((SUM(Q15,L15,G15))=Paramétrages!$H$12,Paramétrages!$I$12,IF((SUM(Q15,L15,G15))>Paramétrages!$H$13,Paramétrages!$I$13,\"0\")))))))))))","v":8},0,{"$error":"#DIV/0!"}]
[{"$f":"'Données élèves 3 courses'!A13","v":0},{"$f":"'Données élèves 3 courses'!B13","v":0},{"$f":"'Données élèves 3 courses'!C13","v":0},{"$f":"'Données élèves 3 courses'!E13","v":0},null,{"$f":"IF(((E16*Paramétrages!$B$3)*100)/(((B16*1000)*C16)/60)>100,100,((E16*Paramétrages!$B$3)*100)/(((B16*1000)*C16)/60))","v":{"$error":"#DIV/0!"}},0,{"$f":"'Données élèves 3 courses'!F13","v":0},{"$f":"'Données élèves 3 courses'!H13","v":0},null,{"$f":"IF(((J16*Paramétrages!$B$3)*100)/(((B16*1000)*H16)/60)>100,100,((J16*Paramétrages!$B$3)*100)/(((B16*1000)*H16)/60))","v":{"$error":"#DIV/0!"}},0,{"$f":"'Données élèves 3 courses'!I13","v":0},{"$f":"'Données élèves 3 courses'!K13","v":0},null,{"$f":"IF(((O16*Paramétrages!$B$3)*100)/(((B16*1000)*M16)/60)>100,100,((O16*Paramétrages!$B$3)*100)/(((B16*1000)*M16)/60))","v":{"$error":"#DIV/0!"}},0,null,"Erreur",0,{"$f":"'Données élèves 3 courses'!O13","v":""},{"$error":"#DIV/0!"},{"$f":"IF((AVERAGE(P16,K16,F16))>97,Paramétrages!$F$3,IF((AVERAGE(P16,K16,F16))>95,Paramétrages!$F$4,IF((AVERAGE(P16,K16,F16))>92,Paramétrages!$F$5,IF((AVERAGE(P16,K16,F16))>89,Paramétrages!$F$6,IF((AVERAGE(P16,K16,F16))>85,Paramétrages!$F$7,IF((AVERAGE(P16,K16,F16))>82,Paramétrages!$F$8,IF((AVERAGE(P16,K16,F16))>79,Paramétrages!$F$9,IF((AVERAGE(P16,K16,F16))<80,Paramétrages!$F$10,\"0\"))))))))","v":{"$error":"#DIV/0!"}},{"$f":"IF((SUM(Q16,L16,G16))=Paramétrages!$H$3,Paramétrages!$I$3,IF((SUM(Q16,L16,G16))=Paramétrages!$H$4,Paramétrages!$I$4,IF((SUM(Q16,L16,G16))=Paramétrages!$H$5,Paramétrages!$I$5,IF((SUM(Q16,L16,G16))=Paramétrages!$H$6,Paramétrages!$I$6,IF((SUM(Q16,L16,G16))=Paramétrages!$H$7,Paramétrages!$I$7,IF((SUM(Q16,L16,G16))=Paramétrages!$H$8,Paramétrages!$I$8,IF((SUM(Q16,L16,G16))=Paramétrages!$H$9,Paramétrages!$I$9,IF((SUM(Q16,L16,G16))=Paramétrages!$H$10,Paramétrages!$I$10,IF((SUM(Q16,L16,G16))=Paramétrages!$H$11,Paramétrages!$I$11,IF((SUM(Q16,L16,G16))=Paramétrages!$H$12,Paramétrages!$I$12,IF((SUM(Q16,L16,G16))>Paramétrages!$H$13,Paramétrages!$I$13,\"0\")))))))))))","v":8},0,{"$error":"#DIV/0!"}]
[{"$f":"'Données élèves 3 courses'!A14","v":0},{"$f":"'Données élèves 3 courses'!B14","v":0},{"$f":"'Données élèves 3 courses'!C14","v":0},{"$f":"'Données élèves 3 courses'!E14","v":0},null,{"$f":"IF(((E17*Paramétrages!$B$3)*100)/(((B17*1000)*C17)/60)>100,100,((E17*Paramétrages!$B$3)*100)/(((B17*1000)*C17)/60))","v":{"$error":"#DIV/0!"}},0,{"$f":"'Données élèves 3 courses'!F14","v":0},{"$f":"'Données élèves 3 courses'!H14","v":0},null,{"$f":"IF(((J17*Paramétrages!$B$3)*100)/(((B17*1000)*H17)/60)>100,100,((J17*Paramétrages!$B$3)*100)/(((B17*1000)*H17)/60))","v":{"$error":"#DIV/0!"}},0,{"$f":"'Données élèves 3 courses'!I14","v":0},{"$f":"'Données élèves 3 courses'!K14","v":0},null,{"$f":"IF(((O17*Paramétrages!$B$3)*100)/(((B17*1000)*M17)/60)>100,100,((O17*Paramétrages!$B$3)*100)/(((B17*1000)*M17)/60))","v":{"$error":"#DIV/0!"}},0,null,"Erreur",0,{"$f":"'Données élèves 3 courses'!O14","v":""},{"$error":"#DIV/0!"},{"$f":"IF((AVERAGE(P17,K17,F17))>97,Paramétrages!$F$3,IF((AVERAGE(P17,K17,F17))>95,Paramétrages!$F$4,IF((AVERAGE(P17,K17,F17))>92,Paramétrages!$F$5,IF((AVERAGE(P17,K17,F17))>89,Paramétrages!$F$6,IF((AVERAGE(P17,K17,F17))>85,Paramétrages!$F$7,IF((AVERAGE(P17,K17,F17))>82,Paramétrages!$F$8,IF((AVERAGE(P17,K17,F17))>79,Paramétrages!$F$9,IF((AVERAGE(P17,K17,F17))<80,Paramétrages!$F$10,\"0\"))))))))","v":{"$error":"#DIV/0!"}},{"$f":"IF((SUM(Q17,L17,G17))=Paramétrages!$H$3,Paramétrages!$I$3,IF((SUM(Q17,L17,G17))=Paramétrages!$H$4,Paramétrages!$I$4,IF((SUM(Q17,L17,G17))=Paramétrages!$H$5,Paramétrages!$I$5,IF((SUM(Q17,L17,G17))=Paramétrages!$H$6,Paramétrages!$I$6,IF((SUM(Q17,L17,G17))=Paramétrages!$H$7,Paramétrages!$I$7,IF((SUM(Q17,L17,G17))=Paramétrages!$H$8,Paramétrages!$I$8,IF((SUM(Q17,L17,G17))=Paramétrages!$H$9,Paramétrages!$I$9,IF((SUM(Q17,L17,G17))=Paramétrages!$H$10,Paramétrages!$I$10,IF((SUM(Q17,L17,G17))=Paramétrages!$H$11,Paramétrages!$I$11,IF((SUM(Q17,L17,G17))=Paramétrages!$H$12,Paramétrages!$I$12,IF((SUM(Q17,L17,G17))>Paramétrages!$H$13,Paramétrages!$I$13,\"0\")))))))))))","v":8},0,{"$error":"#DIV/0!"}]
[{"$f":"'Données élèves 3 courses'!A15","v":0},{"$f":"'Données élèves 3 courses'!B15","v":0},{"$f":"'Données élèves 3 courses'!C15","v":0},{"$f":"'Données élèves 3 courses'!E15","v":0},null,{"$f":"IF(((E18*Paramétrages!$B$3)*100)/(((B18*1000)*C18)/60)>100,100,((E18*Paramétrages!$B$3)*100)/(((B18*1000)*C18)/60))","v":{"$error":"#DIV/0!"}},0,{"$f":"'Données élèves 3 courses'!F15","v":0},{"$f":"'Données élèves 3 courses'!H15","v":0},null,{"$f":"IF(((J18*Paramétrages!$B$3)*100)/(((B18*1000)*H18)/60)>100,100,((J18*Paramétrages!$B$3)*100)/(((B18*1000)*H18)/60))","v":{"$error":"#DIV/0!"}},0,{"$f":"'Données élèves 3 courses'!I15","v":0},{"$f":"'Données élèves 3 courses'!K15","v":0},null,{"$f":"IF(((O18*Paramétrages!$B$3)*100)/(((B18*1000)*M18)/60)>100,100,((O18*Paramétrages!$B$3)*100)/(((B18*1000)*M18)/60))","v":{"$error":"#DIV/0!"}},0,null,"Erreur",0,{"$f":"'Données élèves 3 courses'!O15","v":""},{"$error":"#DIV/0!"},{"$f":"IF((AVERAGE(P18,K18,F18))>97,Paramétrages!$F$3,IF((AVERAGE(P18,K18,F18))>95,Paramétrages!$F$4,IF((AVERAGE(P18,K18,F18))>92,Paramétrages!$F$5,IF((AVERAGE(P18,K18,F18))>89,Paramétrages!$F$6,IF((AVERAGE(P18,K18,F18))>85,Paramétrages!$F$7,IF((AVERAGE(P18,K18,F18))>82,Paramétrages!$F$8,IF((AVERAGE(P18,K18,F18))>79,Paramétrages!$F$9,IF((AVERAGE(P18,K18,F18))<80,Paramétrages!$F$10,\"0\"))))))))","v":{"$error":"#DIV/0!"}},{"$f":"IF((SUM(Q18,L18,G18))=Paramétrages!$H$3,Paramétrages!$I$3,IF((SUM(Q18,L18,G18))=Paramétrages!$H$4,Paramétrages!$I$4,IF((SUM(Q18,L18,G18))=Paramétrages!$H$5,Paramétrages!$I$5,IF((SUM(Q18,L18,G18))=Paramétrages!$H$6,Paramétrages!$I$6,IF((SUM(Q18,L18,G18))=Paramétrages!$H$7,Paramétrages!$I$7,IF((SUM(Q18,L18,G18))=Paramétrages!$H$8,Paramétrages!$I$8,IF((SUM(Q18,L18,G18))=Paramétrages!$H$9,Paramétrages!$I$9,IF((SUM(Q18,L18,G18))=Paramétrages!$H$10,Paramétrages!$I$10,IF((SUM(Q18,L18,G18))=Paramétrages!$H$11,Paramétrages!$I$11,IF((SUM(Q18,L18,G18))=Paramétrages!$H$12,Paramétrages!$I$12,IF((SUM(Q18,L18,G18))>Paramétrages!$H$13,Paramétrages!$I$13,\"0\")))))))))))","v":8},0,{"$error":"#DIV/0!"}]
[{"$f":"'Données élèves 3 courses'!A16","v":0},{"$f":"'Données élèves 3 courses'!B16","v":0},{"$f":"'Données élèves 3 courses'!C16","v":0},{"$f":"'Données élèves 3 courses'!E16","v":0},null,{"$f":"IF(((E19*Paramétrages!$B$3)*100)/(((B19*1000)*C19)/60)>100,100,((E19*Paramétrages!$B$3)*100)/(((B19*1000)*C19)/60))","v":{"$error":"#DIV/0!"}},0,{"$f":"'Données élèves 3 courses'!F16","v":0},{"$f":"'Données élèves 3 courses'!H16","v":0},null,{"$f":"IF(((J19*Paramétrages!$B$3)*100)/(((B19*1000)*H19)/60)>100,100,((J19*Paramétrages!$B$3)*100)/(((B19*1000)*H19)/60))","v":{"$error":"#DIV/0!"}},0,{"$f":"'Données élèves 3 courses'!I16","v":0},{"$f":"'Données élèves 3 courses'!K16","v":0},null,{"$f":"IF(((O19*Paramétrages!$B$3)*100)/(((B19*1000)*M19)/60)>100,100,((O19*Paramétrages!$B$3)*100)/(((B19*1000)*M19)/60))","v":{"$error":"#DIV/0!"}},0,null,"Erreur",0,{"$f":"'Données élèves 3 courses'!O16","v":""},{"$error":"#DIV/0!"},{"$f":"IF((AVERAGE(P19,K19,F19))>97,Paramétrages!$F$3,IF((AVERAGE(P19,K19,F19))>95,Paramétrages!$F$4,IF((AVERAGE(P19,K19,F19))>92,Paramétrages!$F$5,IF((AVERAGE(P19,K19,F19))>89,Paramétrages!$F$6,IF((AVERAGE(P19,K19,F19))>85,Paramétrages!$F$7,IF((AVERAGE(P19,K19,F19))>82,Paramétrages!$F$8,IF((AVERAGE(P19,K19,F19))>79,Paramétrages!$F$9,IF((AVERAGE(P19,K19,F19))<80,Paramétrages!$F$10,\"0\"))))))))","v":{"$error":"#DIV/0!"}},{"$f":"IF((SUM(Q19,L19,G19))=Paramétrages!$H$3,Paramétrages!$I$3,IF((SUM(Q19,L19,G19))=Paramétrages!$H$4,Paramétrages!$I$4,IF((SUM(Q19,L19,G19))=Paramétrages!$H$5,Paramétrages!$I$5,IF((SUM(Q19,L19,G19))=Paramétrages!$H$6,Paramétrages!$I$6,IF((SUM(Q19,L19,G19))=Paramétrages!$H$7,Paramétrages!$I$7,IF((SUM(Q19,L19,G19))=Paramétrages!$H$8,Paramétrages!$I$8,IF((SUM(Q19,L19,G19))=Paramétrages!$H$9,Paramétrages!$I$9,IF((SUM(Q19,L19,G19))=Paramétrages!$H$10,Paramétrages!$I$10,IF((SUM(Q19,L19,G19))=Paramétrages!$H$11,Paramétrages!$I$11,IF((SUM(Q19,L19,G19))=Paramétrages!$H$12,Paramétrages!$I$12,IF((SUM(Q19,L19,G19))>Paramétrages!$H$13,Paramétrages!$I$13,\"0\")))))))))))","v":8},0,{"$error":"#DIV/0!"}]
[{"$f":"'Données élèves 3 courses'!A17","v":0},{"$f":"'Données élèves 3 courses'!B17","v":0},{"$f":"'Données élèves 3 courses'!C17","v":0},{"$f":"'Données élèves 3 courses'!E17","v":0},null,{"$f":"IF(((E20*Paramétrages!$B$3)*100)/(((B20*1000)*C20)/60)>100,100,((E20*Paramétrages!$B$3)*100)/(((B20*1000)*C20)/60))","v":{"$error":"#DIV/0!"}},0,{"$f":"'Données élèves 3 courses'!F17","v":0},{"$f":"'Données élèves 3 courses'!H17","v":0},null,{"$f":"IF(((J20*Paramétrages!$B$3)*100)/(((B20*1000)*H20)/60)>100,100,((J20*Paramétrages!$B$3)*100)/(((B20*1000)*H20)/60))","v":{"$error":"#DIV/0!"}},0,{"$f":"'Données élèves 3 courses'!I17","v":0},{"$f":"'Données élèves 3 courses'!K17","v":0},null,{"$f":"IF(((O20*Paramétrages!$B$3)*100)/(((B20*1000)*M20)/60)>100,100,((O20*Paramétrages!$B$3)*100)/(((B20*1000)*M20)/60))","v":{"$error":"#DIV/0!"}},0,null,"Erreur",0,{"$f":"'Données élèves 3 courses'!O17","v":""},{"$error":"#DIV/0!"},{"$f":"IF((AVERAGE(P20,K20,F20))>97,Paramétrages!$F$3,IF((AVERAGE(P20,K20,F20))>95,Paramétrages!$F$4,IF((AVERAGE(P20,K20,F20))>92,Paramétrages!$F$5,IF((AVERAGE(P20,K20,F20))>89,Paramétrages!$F$6,IF((AVERAGE(P20,K20,F20))>85,Paramétrages!$F$7,IF((AVERAGE(P20,K20,F20))>82,Paramétrages!$F$8,IF((AVERAGE(P20,K20,F20))>79,Paramétrages!$F$9,IF((AVERAGE(P20,K20,F20))<80,Paramétrages!$F$10,\"0\"))))))))","v":{"$error":"#DIV/0!"}},{"$f":"IF((SUM(Q20,L20,G20))=Paramétrages!$H$3,Paramétrages!$I$3,IF((SUM(Q20,L20,G20))=Paramétrages!$H$4,Paramétrages!$I$4,IF((SUM(Q20,L20,G20))=Paramétrages!$H$5,Paramétrages!$I$5,IF((SUM(Q20,L20,G20))=Paramétrages!$H$6,Paramétrages!$I$6,IF((SUM(Q20,L20,G20))=Paramétrages!$H$7,Paramétrages!$I$7,IF((SUM(Q20,L20,G20))=Paramétrages!$H$8,Paramétrages!$I$8,IF((SUM(Q20,L20,G20))=Paramétrages!$H$9,Paramétrages!$I$9,IF((SUM(Q20,L20,G20))=Paramétrages!$H$10,Paramétrages!$I$10,IF((SUM(Q20,L20,G20))=Paramétrages!$H$11,Paramétrages!$I$11,IF((SUM(Q20,L20,G20))=Paramétrages!$H$12,Paramétrages!$I$12,IF((SUM(Q20,L20,G20))>Paramétrages!$H$13,Paramétrages!$I$13,\"0\")))))))))))","v":8},0,{"$error":"#DIV/0!"}]
[{"$f":"'Données élèves 3 courses'!A18","v":0},{"$f":"'Données élèves 3 courses'!B18","v":0},{"$f":"'Données élèves 3 courses'!C18","v":0},{"$f":"'Données élèves 3 courses'!E18","v":0},null,{"$f":"IF(((E21*Paramétrages!$B$3)*100)/(((B21*1000)*C21)/60)>100,100,((E21*Paramétrages!$B$3)*100)/(((B21*1000)*C21)/60))","v":{"$error":"#DIV/0!"}},0,{"$f":"'Données élèves 3 courses'!F18","v":0},{"$f":"'Données élèves 3 courses'!H18","v":0},null,{"$f":"IF(((J21*Paramétrages!$B$3)*100)/(((B21*1000)*H21)/60)>100,100,((J21*Paramétrages!$B$3)*100)/(((B21*1000)*H21)/60))","v":{"$error":"#DIV/0!"}},0,{"$f":"'Données élèves 3 courses'!I18","v":0},{"$f":"'Données élèves 3 courses'!K18","v":0},null,{"$f":"IF(((O21*Paramétrages!$B$3)*100)/(((B21*1000)*M21)/60)>100,100,((O21*Paramétrages!$B$3)*100)/(((B21*1000)*M21)/60))","v":{"$error":"#DIV/0!"}},0,null,"Erreur",0,{"$f":"'Données élèves 3 courses'!O18","v":""},{"$error":"#DIV/0!"},{"$f":"IF((AVERAGE(P21,K21,F21))>97,Paramétrages!$F$3,IF((AVERAGE(P21,K21,F21))>95,Paramétrages!$F$4,IF((AVERAGE(P21,K21,F21))>92,Paramétrages!$F$5,IF((AVERAGE(P21,K21,F21))>89,Paramétrages!$F$6,IF((AVERAGE(P21,K21,F21))>85,Paramétrages!$F$7,IF((AVERAGE(P21,K21,F21))>82,Paramétrages!$F$8,IF((AVERAGE(P21,K21,F21))>79,Paramétrages!$F$9,IF((AVERAGE(P21,K21,F21))<80,Paramétrages!$F$10,\"0\"))))))))","v":{"$error":"#DIV/0!"}},{"$f":"IF((SUM(Q21,L21,G21))=Paramétrages!$H$3,Paramétrages!$I$3,IF((SUM(Q21,L21,G21))=Paramétrages!$H$4,Paramétrages!$I$4,IF((SUM(Q21,L21,G21))=Paramétrages!$H$5,Paramétrages!$I$5,IF((SUM(Q21,L21,G21))=Paramétrages!$H$6,Paramétrages!$I$6,IF((SUM(Q21,L21,G21))=Paramétrages!$H$7,Paramétrages!$I$7,IF((SUM(Q21,L21,G21))=Paramétrages!$H$8,Paramétrages!$I$8,IF((SUM(Q21,L21,G21))=Paramétrages!$H$9,Paramétrages!$I$9,IF((SUM(Q21,L21,G21))=Paramétrages!$H$10,Paramétrages!$I$10,IF((SUM(Q21,L21,G21))=Paramétrages!$H$11,Paramétrages!$I$11,IF((SUM(Q21,L21,G21))=Paramétrages!$H$12,Paramétrages!$I$12,IF((SUM(Q21,L21,G21))>Paramétrages!$H$13,Paramétrages!$I$13,\"0\")))))))))))","v":8},0,{"$error":"#DIV/0!"}]
[{"$f":"'Données élèves 3 courses'!A19","v":0},{"$f":"'Données élèves 3 courses'!B19","v":0},{"$f":"'Données élèves 3 courses'!C19","v":0},{"$f":"'Données élèves 3 courses'!E19","v":0},null,{"$f":"IF(((E22*Paramétrages!$B$3)*100)/(((B22*1000)*C22)/60)>100,100,((E22*Paramétrages!$B$3)*100)/(((B22*1000)*C22)/60))","v":{"$error":"#DIV/0!"}},0,{"$f":"'Données élèves 3 courses'!F19","v":0},{"$f":"'Données élèves 3 courses'!H19","v":0},null,{"$f":"IF(((J22*Paramétrages!$B$3)*100)/(((B22*1000)*H22)/60)>100,100,((J22*Paramétrages!$B$3)*100)/(((B22*1000)*H22)/60))","v":{"$error":"#DIV/0!"}},0,{"$f":"'Données élèves 3 courses'!I19","v":0},{"$f":"'Données élèves 3 courses'!K19","v":0},null,{"$f":"IF(((O22*Paramétrages!$B$3)*100)/(((B22*1000)*M22)/60)>100,100,((O22*Paramétrages!$B$3)*100)/(((B22*1000)*M22)/60))","v":{"$error":"#DIV/0!"}},0,null,"Erreur",0,{"$f":"'Données élèves 3 courses'!O19","v":""},{"$error":"#DIV/0!"},{"$f":"IF((AVERAGE(P22,K22,F22))>97,Paramétrages!$F$3,IF((AVERAGE(P22,K22,F22))>95,Paramétrages!$F$4,IF((AVERAGE(P22,K22,F22))>92,Paramétrages!$F$5,IF((AVERAGE(P22,K22,F22))>89,Paramétrages!$F$6,IF((AVERAGE(P22,K22,F22))>85,Paramétrages!$F$7,IF((AVERAGE(P22,K22,F22))>82,Paramétrages!$F$8,IF((AVERAGE(P22,K22,F22))>79,Paramétrages!$F$9,IF((AVERAGE(P22,K22,F22))<80,Paramétrages!$F$10,\"0\"))))))))","v":{"$error":"#DIV/0!"}},{"$f":"IF((SUM(Q22,L22,G22))=Paramétrages!$H$3,Paramétrages!$I$3,IF((SUM(Q22,L22,G22))=Paramétrages!$H$4,Paramétrages!$I$4,IF((SUM(Q22,L22,G22))=Paramétrages!$H$5,Paramétrages!$I$5,IF((SUM(Q22,L22,G22))=Paramétrages!$H$6,Paramétrages!$I$6,IF((SUM(Q22,L22,G22))=Paramétrages!$H$7,Paramétrages!$I$7,IF((SUM(Q22,L22,G22))=Paramétrages!$H$8,Paramétrages!$I$8,IF((SUM(Q22,L22,G22))=Paramétrages!$H$9,Paramétrages!$I$9,IF((SUM(Q22,L22,G22))=Paramétrages!$H$10,Paramétrages!$I$10,IF((SUM(Q22,L22,G22))=Paramétrages!$H$11,Paramétrages!$I$11,IF((SUM(Q22,L22,G22))=Paramétrages!$H$12,Paramétrages!$I$12,IF((SUM(Q22,L22,G22))>Paramétrages!$H$13,Paramétrages!$I$13,\"0\")))))))))))","v":8},0,{"$error":"#DIV/0!"}]
[{"$f":"'Données élèves 3 courses'!A20","v":0},{"$f":"'Données élèves 3 courses'!B20","v":0},{"$f":"'Données élèves 3 courses'!C20","v":0},{"$f":"'Données élèves 3 courses'!E20","v":0},null,{"$f":"IF(((E23*Paramétrages!$B$3)*100)/(((B23*1000)*C23)/60)>100,100,((E23*Paramétrages!$B$3)*100)/(((B23*1000)*C23)/60))","v":{"$error":"#DIV/0!"}},0,{"$f":"'Données élèves 3 courses'!F20","v":0},{"$f":"'Données élèves 3 courses'!H20","v":0},null,{"$f":"IF(((J23*Paramétrages!$B$3)*100)/(((B23*1000)*H23)/60)>100,100,((J23*Paramétrages!$B$3)*100)/(((B23*1000)*H23)/60))","v":{"$error":"#DIV/0!"}},0,{"$f":"'Données élèves 3 courses'!I20","v":0},{"$f":"'Données élèves 3 courses'!K20","v":0},null,{"$f":"IF(((O23*Paramétrages!$B$3)*100)/(((B23*1000)*M23)/60)>100,100,((O23*Paramétrages!$B$3)*100)/(((B23*1000)*M23)/60))","v":{"$error":"#DIV/0!"}},0,null,"Erreur",0,{"$f":"'Données élèves 3 courses'!O20","v":""},{"$error":"#DIV/0!"},{"$f":"IF((AVERAGE(P23,K23,F23))>97,Paramétrages!$F$3,IF((AVERAGE(P23,K23,F23))>95,Paramétrages!$F$4,IF((AVERAGE(P23,K23,F23))>92,Paramétrages!$F$5,IF((AVERAGE(P23,K23,F23))>89,Paramétrages!$F$6,IF((AVERAGE(P23,K23,F23))>85,Paramétrages!$F$7,IF((AVERAGE(P23,K23,F23))>82,Paramétrages!$F$8,IF((AVERAGE(P23,K23,F23))>79,Paramétrages!$F$9,IF((AVERAGE(P23,K23,F23))<80,Paramétrages!$F$10,\"0\"))))))))","v":{"$error":"#DIV/0!"}},{"$f":"IF((SUM(Q23,L23,G23))=Paramétrages!$H$3,Paramétrages!$I$3,IF((SUM(Q23,L23,G23))=Paramétrages!$H$4,Paramétrages!$I$4,IF((SUM(Q23,L23,G23))=Paramétrages!$H$5,Paramétrages!$I$5,IF((SUM(Q23,L23,G23))=Paramétrages!$H$6,Paramétrages!$I$6,IF((SUM(Q23,L23,G23))=Paramétrages!$H$7,Paramétrages!$I$7,IF((SUM(Q23,L23,G23))=Paramétrages!$H$8,Paramétrages!$I$8,IF((SUM(Q23,L23,G23))=Paramétrages!$H$9,Paramétrages!$I$9,IF((SUM(Q23,L23,G23))=Paramétrages!$H$10,Paramétrages!$I$10,IF((SUM(Q23,L23,G23))=Paramétrages!$H$11,Paramétrages!$I$11,IF((SUM(Q23,L23,G23))=Paramétrages!$H$12,Paramétrages!$I$12,IF((SUM(Q23,L23,G23))>Paramétrages!$H$13,Paramétrages!$I$13,\"0\")))))))))))","v":8},0,{"$error":"#DIV/0!"}]
[{"$f":"'Données élèves 3 courses'!A21","v":0},{"$f":"'Données élèves 3 courses'!B21","v":0},{"$f":"'Données élèves 3 courses'!C21","v":0},{"$f":"'Données élèves 3 courses'!E21","v":0},null,{"$f":"IF(((E24*Paramétrages!$B$3)*100)/(((B24*1000)*C24)/60)>100,100,((E24*Paramétrages!$B$3)*100)/(((B24*1000)*C24)/60))","v":{"$error":"#DIV/0!"}},0,{"$f":"'Données élèves 3 courses'!F21","v":0},{"$f":"'Données élèves 3 courses'!H21","v":0},null,{"$f":"IF(((J24*Paramétrages!$B$3)*100)/(((B24*1000)*H24)/60)>100,100,((J24*Paramétrages!$B$3)*100)/(((B24*1000)*H24)/60))","v":{"$error":"#DIV/0!"}},0,{"$f":"'Données élèves 3 courses'!I21","v":0},{"$f":"'Données élèves 3 courses'!K21","v":0},null,{"$f":"IF(((O24*Paramétrages!$B$3)*100)/(((B24*1000)*M24)/60)>100,100,((O24*Paramétrages!$B$3)*100)/(((B24*1000)*M24)/60))","v":{"$error":"#DIV/0!"}},0,null,"Erreur",0,{"$f":"'Données élèves 3 courses'!O21","v":""},{"$error":"#DIV/0!"},{"$f":"IF((AVERAGE(P24,K24,F24))>97,Paramétrages!$F$3,IF((AVERAGE(P24,K24,F24))>95,Paramétrages!$F$4,IF((AVERAGE(P24,K24,F24))>92,Paramétrages!$F$5,IF((AVERAGE(P24,K24,F24))>89,Paramétrages!$F$6,IF((AVERAGE(P24,K24,F24))>85,Paramétrages!$F$7,IF((AVERAGE(P24,K24,F24))>82,Paramétrages!$F$8,IF((AVERAGE(P24,K24,F24))>79,Paramétrages!$F$9,IF((AVERAGE(P24,K24,F24))<80,Paramétrages!$F$10,\"0\"))))))))","v":{"$error":"#DIV/0!"}},{"$f":"IF((SUM(Q24,L24,G24))=Paramétrages!$H$3,Paramétrages!$I$3,IF((SUM(Q24,L24,G24))=Paramétrages!$H$4,Paramétrages!$I$4,IF((SUM(Q24,L24,G24))=Paramétrages!$H$5,Paramétrages!$I$5,IF((SUM(Q24,L24,G24))=Paramétrages!$H$6,Paramétrages!$I$6,IF((SUM(Q24,L24,G24))=Paramétrages!$H$7,Paramétrages!$I$7,IF((SUM(Q24,L24,G24))=Paramétrages!$H$8,Paramétrages!$I$8,IF((SUM(Q24,L24,G24))=Paramétrages!$H$9,Paramétrages!$I$9,IF((SUM(Q24,L24,G24))=Paramétrages!$H$10,Paramétrages!$I$10,IF((SUM(Q24,L24,G24))=Paramétrages!$H$11,Paramétrages!$I$11,IF((SUM(Q24,L24,G24))=Paramétrages!$H$12,Paramétrages!$I$12,IF((SUM(Q24,L24,G24))>Paramétrages!$H$13,Paramétrages!$I$13,\"0\")))))))))))","v":8},0,{"$error":"#DIV/0!"}]
[{"$f":"'Données élèves 3 courses'!A22","v":0},{"$f":"'Données élèves 3 courses'!B22","v":0},{"$f":"'Données élèves 3 courses'!C22","v":0},{"$f":"'Données élèves 3 courses'!E22","v":0},null,{"$f":"IF(((E25*Paramétrages!$B$3)*100)/(((B25*1000)*C25)/60)>100,100,((E25*Paramétrages!$B$3)*100)/(((B25*1000)*C25)/60))","v":{"$error":"#DIV/0!"}},0,{"$f":"'Données élèves 3 courses'!F22","v":0},{"$f":"'Données élèves 3 courses'!H22","v":0},null,{"$f":"IF(((J25*Paramétrages!$B$3)*100)/(((B25*1000)*H25)/60)>100,100,((J25*Paramétrages!$B$3)*100)/(((B25*1000)*H25)/60))","v":{"$error":"#DIV/0!"}},0,{"$f":"'Données élèves 3 courses'!I22","v":0},{"$f":"'Données élèves 3 courses'!K22","v":0},null,{"$f":"IF(((O25*Paramétrages!$B$3)*100)/(((B25*1000)*M25)/60)>100,100,((O25*Paramétrages!$B$3)*100)/(((B25*1000)*M25)/60))","v":{"$error":"#DIV/0!"}},0,null,"Erreur",0,{"$f":"'Données élèves 3 courses'!O22","v":""},{"$error":"#DIV/0!"},{"$f":"IF((AVERAGE(P25,K25,F25))>97,Paramétrages!$F$3,IF((AVERAGE(P25,K25,F25))>95,Paramétrages!$F$4,IF((AVERAGE(P25,K25,F25))>92,Paramétrages!$F$5,IF((AVERAGE(P25,K25,F25))>89,Paramétrages!$F$6,IF((AVERAGE(P25,K25,F25))>85,Paramétrages!$F$7,IF((AVERAGE(P25,K25,F25))>82,Paramétrages!$F$8,IF((AVERAGE(P25,K25,F25))>79,Paramétrages!$F$9,IF((AVERAGE(P25,K25,F25))<80,Paramétrages!$F$10,\"0\"))))))))","v":{"$error":"#DIV/0!"}},{"$f":"IF((SUM(Q25,L25,G25))=Paramétrages!$H$3,Paramétrages!$I$3,IF((SUM(Q25,L25,G25))=Paramétrages!$H$4,Paramétrages!$I$4,IF((SUM(Q25,L25,G25))=Paramétrages!$H$5,Paramétrages!$I$5,IF((SUM(Q25,L25,G25))=Paramétrages!$H$6,Paramétrages!$I$6,IF((SUM(Q25,L25,G25))=Paramétrages!$H$7,Paramétrages!$I$7,IF((SUM(Q25,L25,G25))=Paramétrages!$H$8,Paramétrages!$I$8,IF((SUM(Q25,L25,G25))=Paramétrages!$H$9,Paramétrages!$I$9,IF((SUM(Q25,L25,G25))=Paramétrages!$H$10,Paramétrages!$I$10,IF((SUM(Q25,L25,G25))=Paramétrages!$H$11,Paramétrages!$I$11,IF((SUM(Q25,L25,G25))=Paramétrages!$H$12,Paramétrages!$I$12,IF((SUM(Q25,L25,G25))>Paramétrages!$H$13,Paramétrages!$I$13,\"0\")))))))))))","v":8},0,{"$error":"#DIV/0!"}]
[{"$f":"'Données élèves 3 courses'!A23","v":0},{"$f":"'Données élèves 3 courses'!B23","v":0},{"$f":"'Données élèves 3 courses'!C23","v":0},{"$f":"'Données élèves 3 courses'!E23","v":0},null,{"$f":"IF(((E26*Paramétrages!$B$3)*100)/(((B26*1000)*C26)/60)>100,100,((E26*Paramétrages!$B$3)*100)/(((B26*1000)*C26)/60))","v":{"$error":"#DIV/0!"}},0,{"$f":"'Données élèves 3 courses'!F23","v":0},{"$f":"'Données élèves 3 courses'!H23","v":0},null,{"$f":"IF(((J26*Paramétrages!$B$3)*100)/(((B26*1000)*H26)/60)>100,100,((J26*Paramétrages!$B$3)*100)/(((B26*1000)*H26)/60))","v":{"$error":"#DIV/0!"}},0,{"$f":"'Données élèves 3 courses'!I23","v":0},{"$f":"'Données élèves 3 courses'!K23","v":0},null,{"$f":"IF(((O26*Paramétrages!$B$3)*100)/(((B26*1000)*M26)/60)>100,100,((O26*Paramétrages!$B$3)*100)/(((B26*1000)*M26)/60))","v":{"$error":"#DIV/0!"}},0,null,"Erreur",0,{"$f":"'Données élèves 3 courses'!O23","v":""},{"$error":"#DIV/0!"},{"$f":"IF((AVERAGE(P26,K26,F26))>97,Paramétrages!$F$3,IF((AVERAGE(P26,K26,F26))>95,Paramétrages!$F$4,IF((AVERAGE(P26,K26,F26))>92,Paramétrages!$F$5,IF((AVERAGE(P26,K26,F26))>89,Paramétrages!$F$6,IF((AVERAGE(P26,K26,F26))>85,Paramétrages!$F$7,IF((AVERAGE(P26,K26,F26))>82,Paramétrages!$F$8,IF((AVERAGE(P26,K26,F26))>79,Paramétrages!$F$9,IF((AVERAGE(P26,K26,F26))<80,Paramétrages!$F$10,\"0\"))))))))","v":{"$error":"#DIV/0!"}},{"$f":"IF((SUM(Q26,L26,G26))=Paramétrages!$H$3,Paramétrages!$I$3,IF((SUM(Q26,L26,G26))=Paramétrages!$H$4,Paramétrages!$I$4,IF((SUM(Q26,L26,G26))=Paramétrages!$H$5,Paramétrages!$I$5,IF((SUM(Q26,L26,G26))=Paramétrages!$H$6,Paramétrages!$I$6,IF((SUM(Q26,L26,G26))=Paramétrages!$H$7,Paramétrages!$I$7,IF((SUM(Q26,L26,G26))=Paramétrages!$H$8,Paramétrages!$I$8,IF((SUM(Q26,L26,G26))=Paramétrages!$H$9,Paramétrages!$I$9,IF((SUM(Q26,L26,G26))=Paramétrages!$H$10,Paramétrages!$I$10,IF((SUM(Q26,L26,G26))=Paramétrages!$H$11,Paramétrages!$I$11,IF((SUM(Q26,L26,G26))=Paramétrages!$H$12,Paramétrages!$I$12,IF((SUM(Q26,L26,G26))>Paramétrages!$H$13,Paramétrages!$I$13,\"0\")))))))))))","v":8},0,{"$error":"#DIV/0!"}]
[{"$f":"'Données élèves 3 courses'!A24","v":0},{"$f":"'Données élèves 3 courses'!B24","v":0},{"$f":"'Données élèves 3 courses'!C24","v":0},{"$f":"'Données élèves 3 courses'!E24","v":0},null,{"$f":"IF(((E27*Paramétrages!$B$3)*100)/(((B27*1000)*C27)/60)>100,100,((E27*Paramétrages!$B$3)*100)/(((B27*1000)*C27)/60))","v":{"$error":"#DIV/0!"}},0,{"$f":"'Données élèves 3 courses'!F24","v":0},{"$f":"'Données élèves 3 courses'!H24","v":0},null,{"$f":"IF(((J27*Paramétrages!$B$3)*100)/(((B27*1000)*H27)/60)>100,100,((J27*Paramétrages!$B$3)*100)/(((B27*1000)*H27)/60))","v":{"$error":"#DIV/0!"}},0,{"$f":"'Données élèves 3 courses'!I24","v":0},{"$f":"'Données élèves 3 courses'!K24","v":0},null,{"$f":"IF(((O27*Paramétrages!$B$3)*100)/(((B27*1000)*M27)/60)>100,100,((O27*Paramétrages!$B$3)*100)/(((B27*1000)*M27)/60))","v":{"$error":"#DIV/0!"}},0,null,"Erreur",0,{"$f":"'Données élèves 3 courses'!O24","v":""},{"$error":"#DIV/0!"},{"$f":"IF((AVERAGE(P27,K27,F27))>97,Paramétrages!$F$3,IF((AVERAGE(P27,K27,F27))>95,Paramétrages!$F$4,IF((AVERAGE(P27,K27,F27))>92,Paramétrages!$F$5,IF((AVERAGE(P27,K27,F27))>89,Paramétrages!$F$6,IF((AVERAGE(P27,K27,F27))>85,Paramétrages!$F$7,IF((AVERAGE(P27,K27,F27))>82,Paramétrages!$F$8,IF((AVERAGE(P27,K27,F27))>79,Paramétrages!$F$9,IF((AVERAGE(P27,K27,F27))<80,Paramétrages!$F$10,\"0\"))))))))","v":{"$error":"#DIV/0!"}},{"$f":"IF((SUM(Q27,L27,G27))=Paramétrages!$H$3,Paramétrages!$I$3,IF((SUM(Q27,L27,G27))=Paramétrages!$H$4,Paramétrages!$I$4,IF((SUM(Q27,L27,G27))=Paramétrages!$H$5,Paramétrages!$I$5,IF((SUM(Q27,L27,G27))=Paramétrages!$H$6,Paramétrages!$I$6,IF((SUM(Q27,L27,G27))=Paramétrages!$H$7,Paramétrages!$I$7,IF((SUM(Q27,L27,G27))=Paramétrages!$H$8,Paramétrages!$I$8,IF((SUM(Q27,L27,G27))=Paramétrages!$H$9,Paramétrages!$I$9,IF((SUM(Q27,L27,G27))=Paramétrages!$H$10,Paramétrages!$I$10,IF((SUM(Q27,L27,G27))=Paramétrages!$H$11,Paramétrages!$I$11,IF((SUM(Q27,L27,G27))=Paramétrages!$H$12,Paramétrages!$I$12,IF((SUM(Q27,L27,G27))>Paramétrages!$H$13,Paramétrages!$I$13,\"0\")))))))))))","v":8},0,{"$error":"#DIV/0!"}]
[{"$f":"'Données élèves 3 courses'!A25","v":0},{"$f":"'Données élèves 3 courses'!B25","v":0},{"$f":"'Données élèves 3 courses'!C25","v":0},{"$f":"'Données élèves 3 courses'!E25","v":0},null,{"$f":"IF(((E28*Paramétrages!$B$3)*100)/(((B28*1000)*C28)/60)>100,100,((E28*Paramétrages!$B$3)*100)/(((B28*1000)*C28)/60))","v":{"$error":"#DIV/0!"}},0,{"$f":"'Données élèves 3 courses'!F25","v":0},{"$f":"'Données élèves 3 courses'!H25","v":0},null,{"$f":"IF(((J28*Paramétrages!$B$3)*100)/(((B28*1000)*H28)/60)>100,100,((J28*Paramétrages!$B$3)*100)/(((B28*1000)*H28)/60))","v":{"$error":"#DIV/0!"}},0,{"$f":"'Données élèves 3 courses'!I25","v":0},{"$f":"'Données élèves 3 courses'!K25","v":0},null,{"$f":"IF(((O28*Paramétrages!$B$3)*100)/(((B28*1000)*M28)/60)>100,100,((O28*Paramétrages!$B$3)*100)/(((B28*1000)*M28)/60))","v":{"$error":"#DIV/0!"}},0,null,"Erreur",0,{"$f":"'Données élèves 3 courses'!O25","v":""},{"$error":"#DIV/0!"},{"$f":"IF((AVERAGE(P28,K28,F28))>97,Paramétrages!$F$3,IF((AVERAGE(P28,K28,F28))>95,Paramétrages!$F$4,IF((AVERAGE(P28,K28,F28))>92,Paramétrages!$F$5,IF((AVERAGE(P28,K28,F28))>89,Paramétrages!$F$6,IF((AVERAGE(P28,K28,F28))>85,Paramétrages!$F$7,IF((AVERAGE(P28,K28,F28))>82,Paramétrages!$F$8,IF((AVERAGE(P28,K28,F28))>79,Paramétrages!$F$9,IF((AVERAGE(P28,K28,F28))<80,Paramétrages!$F$10,\"0\"))))))))","v":{"$error":"#DIV/0!"}},{"$f":"IF((SUM(Q28,L28,G28))=Paramétrages!$H$3,Paramétrages!$I$3,IF((SUM(Q28,L28,G28))=Paramétrages!$H$4,Paramétrages!$I$4,IF((SUM(Q28,L28,G28))=Paramétrages!$H$5,Paramétrages!$I$5,IF((SUM(Q28,L28,G28))=Paramétrages!$H$6,Paramétrages!$I$6,IF((SUM(Q28,L28,G28))=Paramétrages!$H$7,Paramétrages!$I$7,IF((SUM(Q28,L28,G28))=Paramétrages!$H$8,Paramétrages!$I$8,IF((SUM(Q28,L28,G28))=Paramétrages!$H$9,Paramétrages!$I$9,IF((SUM(Q28,L28,G28))=Paramétrages!$H$10,Paramétrages!$I$10,IF((SUM(Q28,L28,G28))=Paramétrages!$H$11,Paramétrages!$I$11,IF((SUM(Q28,L28,G28))=Paramétrages!$H$12,Paramétrages!$I$12,IF((SUM(Q28,L28,G28))>Paramétrages!$H$13,Paramétrages!$I$13,\"0\")))))))))))","v":8},0,{"$error":"#DIV/0!"}]
[{"$f":"'Données élèves 3 courses'!A26","v":0},{"$f":"'Données élèves 3 courses'!B26","v":0},{"$f":"'Données élèves 3 courses'!C26","v":0},{"$f":"'Données élèves 3 courses'!E26","v":0},null,{"$f":"IF(((E29*Paramétrages!$B$3)*100)/(((B29*1000)*C29)/60)>100,100,((E29*Paramétrages!$B$3)*100)/(((B29*1000)*C29)/60))","v":{"$error":"#DIV/0!"}},0,{"$f":"'Données élèves 3 courses'!F26","v":0},{"$f":"'Données élèves 3 courses'!H26","v":0},null,{"$f":"IF(((J29*Paramétrages!$B$3)*100)/(((B29*1000)*H29)/60)>100,100,((J29*Paramétrages!$B$3)*100)/(((B29*1000)*H29)/60))","v":{"$error":"#DIV/0!"}},0,{"$f":"'Données élèves 3 courses'!I26","v":0},{"$f":"'Données élèves 3 courses'!K26","v":0},null,{"$f":"IF(((O29*Paramétrages!$B$3)*100)/(((B29*1000)*M29)/60)>100,100,((O29*Paramétrages!$B$3)*100)/(((B29*1000)*M29)/60))","v":{"$error":"#DIV/0!"}},0,null,"Erreur",0,{"$f":"'Données élèves 3 courses'!O26","v":""},{"$error":"#DIV/0!"},{"$f":"IF((AVERAGE(P29,K29,F29))>97,Paramétrages!$F$3,IF((AVERAGE(P29,K29,F29))>95,Paramétrages!$F$4,IF((AVERAGE(P29,K29,F29))>92,Paramétrages!$F$5,IF((AVERAGE(P29,K29,F29))>89,Paramétrages!$F$6,IF((AVERAGE(P29,K29,F29))>85,Paramétrages!$F$7,IF((AVERAGE(P29,K29,F29))>82,Paramétrages!$F$8,IF((AVERAGE(P29,K29,F29))>79,Paramétrages!$F$9,IF((AVERAGE(P29,K29,F29))<80,Paramétrages!$F$10,\"0\"))))))))","v":{"$error":"#DIV/0!"}},{"$f":"IF((SUM(Q29,L29,G29))=Paramétrages!$H$3,Paramétrages!$I$3,IF((SUM(Q29,L29,G29))=Paramétrages!$H$4,Paramétrages!$I$4,IF((SUM(Q29,L29,G29))=Paramétrages!$H$5,Paramétrages!$I$5,IF((SUM(Q29,L29,G29))=Paramétrages!$H$6,Paramétrages!$I$6,IF((SUM(Q29,L29,G29))=Paramétrages!$H$7,Paramétrages!$I$7,IF((SUM(Q29,L29,G29))=Paramétrages!$H$8,Paramétrages!$I$8,IF((SUM(Q29,L29,G29))=Paramétrages!$H$9,Paramétrages!$I$9,IF((SUM(Q29,L29,G29))=Paramétrages!$H$10,Paramétrages!$I$10,IF((SUM(Q29,L29,G29))=Paramétrages!$H$11,Paramétrages!$I$11,IF((SUM(Q29,L29,G29))=Paramétrages!$H$12,Paramétrages!$I$12,IF((SUM(Q29,L29,G29))>Paramétrages!$H$13,Paramétrages!$I$13,\"0\")))))))))))","v":8},0,{"$error":"#DIV/0!"}]
[{"$f":"'Données élèves 3 courses'!A27","v":0},{"$f":"'Données élèves 3 courses'!B27","v":0},{"$f":"'Données élèves 3 courses'!C27","v":0},{"$f":"'Données élèves 3 courses'!E27","v":0},null,{"$f":"IF(((E30*Paramétrages!$B$3)*100)/(((B30*1000)*C30)/60)>100,100,((E30*Paramétrages!$B$3)*100)/(((B30*1000)*C30)/60))","v":{"$error":"#DIV/0!"}},0,{"$f":"'Données élèves 3 courses'!F27","v":0},{"$f":"'Données élèves 3 courses'!H27","v":0},null,{"$f":"IF(((J30*Paramétrages!$B$3)*100)/(((B30*1000)*H30)/60)>100,100,((J30*Paramétrages!$B$3)*100)/(((B30*1000)*H30)/60))","v":{"$error":"#DIV/0!"}},0,{"$f":"'Données élèves 3 courses'!I27","v":0},{"$f":"'Données élèves 3 courses'!K27","v":0},null,{"$f":"IF(((O30*Paramétrages!$B$3)*100)/(((B30*1000)*M30)/60)>100,100,((O30*Paramétrages!$B$3)*100)/(((B30*1000)*M30)/60))","v":{"$error":"#DIV/0!"}},0,null,"Erreur",0,{"$f":"'Données élèves 3 courses'!O27","v":""},{"$error":"#DIV/0!"},{"$f":"IF((AVERAGE(P30,K30,F30))>97,Paramétrages!$F$3,IF((AVERAGE(P30,K30,F30))>95,Paramétrages!$F$4,IF((AVERAGE(P30,K30,F30))>92,Paramétrages!$F$5,IF((AVERAGE(P30,K30,F30))>89,Paramétrages!$F$6,IF((AVERAGE(P30,K30,F30))>85,Paramétrages!$F$7,IF((AVERAGE(P30,K30,F30))>82,Paramétrages!$F$8,IF((AVERAGE(P30,K30,F30))>79,Paramétrages!$F$9,IF((AVERAGE(P30,K30,F30))<80,Paramétrages!$F$10,\"0\"))))))))","v":{"$error":"#DIV/0!"}},{"$f":"IF((SUM(Q30,L30,G30))=Paramétrages!$H$3,Paramétrages!$I$3,IF((SUM(Q30,L30,G30))=Paramétrages!$H$4,Paramétrages!$I$4,IF((SUM(Q30,L30,G30))=Paramétrages!$H$5,Paramétrages!$I$5,IF((SUM(Q30,L30,G30))=Paramétrages!$H$6,Paramétrages!$I$6,IF((SUM(Q30,L30,G30))=Paramétrages!$H$7,Paramétrages!$I$7,IF((SUM(Q30,L30,G30))=Paramétrages!$H$8,Paramétrages!$I$8,IF((SUM(Q30,L30,G30))=Paramétrages!$H$9,Paramétrages!$I$9,IF((SUM(Q30,L30,G30))=Paramétrages!$H$10,Paramétrages!$I$10,IF((SUM(Q30,L30,G30))=Paramétrages!$H$11,Paramétrages!$I$11,IF((SUM(Q30,L30,G30))=Paramétrages!$H$12,Paramétrages!$I$12,IF((SUM(Q30,L30,G30))>Paramétrages!$H$13,Paramétrages!$I$13,\"0\")))))))))))","v":8},0,{"$error":"#DIV/0!"}]
[{"$f":"'Données élèves 3 courses'!A28","v":0},{"$f":"'Données élèves 3 courses'!B28","v":0},{"$f":"'Données élèves 3 courses'!C28","v":0},{"$f":"'Données élèves 3 courses'!E28","v":0},null,{"$f":"IF(((E31*Paramétrages!$B$3)*100)/(((B31*1000)*C31)/60)>100,100,((E31*Paramétrages!$B$3)*100)/(((B31*1000)*C31)/60))","v":{"$error":"#DIV/0!"}},0,{"$f":"'Données élèves 3 courses'!F28","v":0},{"$f":"'Données élèves 3 courses'!H28","v":0},null,{"$f":"IF(((J31*Paramétrages!$B$3)*100)/(((B31*1000)*H31)/60)>100,100,((J31*Paramétrages!$B$3)*100)/(((B31*1000)*H31)/60))","v":{"$error":"#DIV/0!"}},0,{"$f":"'Données élèves 3 courses'!I28","v":0},{"$f":"'Données élèves 3 courses'!K28","v":0},null,{"$f":"IF(((O31*Paramétrages!$B$3)*100)/(((B31*1000)*M31)/60)>100,100,((O31*Paramétrages!$B$3)*100)/(((B31*1000)*M31)/60))","v":{"$error":"#DIV/0!"}},0,null,"Erreur",0,{"$f":"'Données élèves 3 courses'!O28","v":""},{"$error":"#DIV/0!"},{"$f":"IF((AVERAGE(P31,K31,F31))>97,Paramétrages!$F$3,IF((AVERAGE(P31,K31,F31))>95,Paramétrages!$F$4,IF((AVERAGE(P31,K31,F31))>92,Paramétrages!$F$5,IF((AVERAGE(P31,K31,F31))>89,Paramétrages!$F$6,IF((AVERAGE(P31,K31,F31))>85,Paramétrages!$F$7,IF((AVERAGE(P31,K31,F31))>82,Paramétrages!$F$8,IF((AVERAGE(P31,K31,F31))>79,Paramétrages!$F$9,IF((AVERAGE(P31,K31,F31))<80,Paramétrages!$F$10,\"0\"))))))))","v":{"$error":"#DIV/0!"}},{"$f":"IF((SUM(Q31,L31,G31))=Paramétrages!$H$3,Paramétrages!$I$3,IF((SUM(Q31,L31,G31))=Paramétrages!$H$4,Paramétrages!$I$4,IF((SUM(Q31,L31,G31))=Paramétrages!$H$5,Paramétrages!$I$5,IF((SUM(Q31,L31,G31))=Paramétrages!$H$6,Paramétrages!$I$6,IF((SUM(Q31,L31,G31))=Paramétrages!$H$7,Paramétrages!$I$7,IF((SUM(Q31,L31,G31))=Paramétrages!$H$8,Paramétrages!$I$8,IF((SUM(Q31,L31,G31))=Paramétrages!$H$9,Paramétrages!$I$9,IF((SUM(Q31,L31,G31))=Paramétrages!$H$10,Paramétrages!$I$10,IF((SUM(Q31,L31,G31))=Paramétrages!$H$11,Paramétrages!$I$11,IF((SUM(Q31,L31,G31))=Paramétrages!$H$12,Paramétrages!$I$12,IF((SUM(Q31,L31,G31))>Paramétrages!$H$13,Paramétrages!$I$13,\"0\")))))))))))","v":8},0,{"$error":"#DIV/0!"}]
[{"$f":"'Données élèves 3 courses'!A29","v":0},{"$f":"'Données élèves 3 courses'!B29","v":0},{"$f":"'Données élèves 3 courses'!C29","v":0},{"$f":"'Données élèves 3 courses'!E29","v":0},null,{"$f":"IF(((E32*Paramétrages!$B$3)*100)/(((B32*1000)*C32)/60)>100,100,((E32*Paramétrages!$B$3)*100)/(((B32*1000)*C32)/60))","v":{"$error":"#DIV/0!"}},0,{"$f":"'Données élèves 3 courses'!F29","v":0},{"$f":"'Données élèves 3 courses'!H29","v":0},null,{"$f":"IF(((J32*Paramétrages!$B$3)*100)/(((B32*1000)*H32)/60)>100,100,((J32*Paramétrages!$B$3)*100)/(((B32*1000)*H32)/60))","v":{"$error":"#DIV/0!"}},0,{"$f":"'Données élèves 3 courses'!I29","v":0},{"$f":"'Données élèves 3 courses'!K29","v":0},null,{"$f":"IF(((O32*Paramétrages!$B$3)*100)/(((B32*1000)*M32)/60)>100,100,((O32*Paramétrages!$B$3)*100)/(((B32*1000)*M32)/60))","v":{"$error":"#DIV/0!"}},0,null,"Erreur",0,{"$f":"'Données élèves 3 courses'!O29","v":""},{"$error":"#DIV/0!"},{"$f":"IF((AVERAGE(P32,K32,F32))>97,Paramétrages!$F$3,IF((AVERAGE(P32,K32,F32))>95,Paramétrages!$F$4,IF((AVERAGE(P32,K32,F32))>92,Paramétrages!$F$5,IF((AVERAGE(P32,K32,F32))>89,Paramétrages!$F$6,IF((AVERAGE(P32,K32,F32))>85,Paramétrages!$F$7,IF((AVERAGE(P32,K32,F32))>82,Paramétrages!$F$8,IF((AVERAGE(P32,K32,F32))>79,Paramétrages!$F$9,IF((AVERAGE(P32,K32,F32))<80,Paramétrages!$F$10,\"0\"))))))))","v":{"$error":"#DIV/0!"}},{"$f":"IF((SUM(Q32,L32,G32))=Paramétrages!$H$3,Paramétrages!$I$3,IF((SUM(Q32,L32,G32))=Paramétrages!$H$4,Paramétrages!$I$4,IF((SUM(Q32,L32,G32))=Paramétrages!$H$5,Paramétrages!$I$5,IF((SUM(Q32,L32,G32))=Paramétrages!$H$6,Paramétrages!$I$6,IF((SUM(Q32,L32,G32))=Paramétrages!$H$7,Paramétrages!$I$7,IF((SUM(Q32,L32,G32))=Paramétrages!$H$8,Paramétrages!$I$8,IF((SUM(Q32,L32,G32))=Paramétrages!$H$9,Paramétrages!$I$9,IF((SUM(Q32,L32,G32))=Paramétrages!$H$10,Paramétrages!$I$10,IF((SUM(Q32,L32,G32))=Paramétrages!$H$11,Paramétrages!$I$11,IF((SUM(Q32,L32,G32))=Paramétrages!$H$12,Paramétrages!$I$12,IF((SUM(Q32,L32,G32))>Paramétrages!$H$13,Paramétrages!$I$13,\"0\")))))))))))","v":8},0,{"$error":"#DIV/0!"}]
[{"$f":"'Données élèves 3 courses'!A30","v":0},{"$f":"'Données élèves 3 courses'!B30","v":0},{"$f":"'Données élèves 3 courses'!C30","v":0},{"$f":"'Données élèves 3 courses'!E30","v":0},null,{"$f":"IF(((E33*Paramétrages!$B$3)*100)/(((B33*1000)*C33)/60)>100,100,((E33*Paramétrages!$B$3)*100)/(((B33*1000)*C33)/60))","v":{"$error":"#DIV/0!"}},0,{"$f":"'Données élèves 3 courses'!F30","v":0},{"$f":"'Données élèves 3 courses'!H30","v":0},null,{"$f":"IF(((J33*Paramétrages!$B$3)*100)/(((B33*1000)*H33)/60)>100,100,((J33*Paramétrages!$B$3)*100)/(((B33*1000)*H33)/60))","v":{"$error":"#DIV/0!"}},0,{"$f":"'Données élèves 3 courses'!I30","v":0},{"$f":"'Données élèves 3 courses'!K30","v":0},null,{"$f":"IF(((O33*Paramétrages!$B$3)*100)/(((B33*1000)*M33)/60)>100,100,((O33*Paramétrages!$B$3)*100)/(((B33*1000)*M33)/60))","v":{"$error":"#DIV/0!"}},0,null,"Erreur",0,{"$f":"'Données élèves 3 courses'!O30","v":""},{"$error":"#DIV/0!"},{"$f":"IF((AVERAGE(P33,K33,F33))>97,Paramétrages!$F$3,IF((AVERAGE(P33,K33,F33))>95,Paramétrages!$F$4,IF((AVERAGE(P33,K33,F33))>92,Paramétrages!$F$5,IF((AVERAGE(P33,K33,F33))>89,Paramétrages!$F$6,IF((AVERAGE(P33,K33,F33))>85,Paramétrages!$F$7,IF((AVERAGE(P33,K33,F33))>82,Paramétrages!$F$8,IF((AVERAGE(P33,K33,F33))>79,Paramétrages!$F$9,IF((AVERAGE(P33,K33,F33))<80,Paramétrages!$F$10,\"0\"))))))))","v":{"$error":"#DIV/0!"}},{"$f":"IF((SUM(Q33,L33,G33))=Paramétrages!$H$3,Paramétrages!$I$3,IF((SUM(Q33,L33,G33))=Paramétrages!$H$4,Paramétrages!$I$4,IF((SUM(Q33,L33,G33))=Paramétrages!$H$5,Paramétrages!$I$5,IF((SUM(Q33,L33,G33))=Paramétrages!$H$6,Paramétrages!$I$6,IF((SUM(Q33,L33,G33))=Paramétrages!$H$7,Paramétrages!$I$7,IF((SUM(Q33,L33,G33))=Paramétrages!$H$8,Paramétrages!$I$8,IF((SUM(Q33,L33,G33))=Paramétrages!$H$9,Paramétrages!$I$9,IF((SUM(Q33,L33,G33))=Paramétrages!$H$10,Paramétrages!$I$10,IF((SUM(Q33,L33,G33))=Paramétrages!$H$11,Paramétrages!$I$11,IF((SUM(Q33,L33,G33))=Paramétrages!$H$12,Paramétrages!$I$12,IF((SUM(Q33,L33,G33))>Paramétrages!$H$13,Paramétrages!$I$13,\"0\")))))))))))","v":8},0,{"$error":"#DIV/0!"}]
[{"$f":"'Données élèves 3 courses'!A31","v":0},{"$f":"'Données élèves 3 courses'!B31","v":0},{"$f":"'Données élèves 3 courses'!C31","v":0},{"$f":"'Données élèves 3 courses'!E31","v":0},null,{"$f":"IF(((E34*Paramétrages!$B$3)*100)/(((B34*1000)*C34)/60)>100,100,((E34*Paramétrages!$B$3)*100)/(((B34*1000)*C34)/60))","v":{"$error":"#DIV/0!"}},0,{"$f":"'Données élèves 3 courses'!F31","v":0},{"$f":"'Données élèves 3 courses'!H31","v":0},null,{"$f":"IF(((J34*Paramétrages!$B$3)*100)/(((B34*1000)*H34)/60)>100,100,((J34*Paramétrages!$B$3)*100)/(((B34*1000)*H34)/60))","v":{"$error":"#DIV/0!"}},0,{"$f":"'Données élèves 3 courses'!I31","v":0},{"$f":"'Données élèves 3 courses'!K31","v":0},null,{"$f":"IF(((O34*Paramétrages!$B$3)*100)/(((B34*1000)*M34)/60)>100,100,((O34*Paramétrages!$B$3)*100)/(((B34*1000)*M34)/60))","v":{"$error":"#DIV/0!"}},0,null,"Erreur",0,{"$f":"'Données élèves 3 courses'!O31","v":""},{"$error":"#DIV/0!"},{"$f":"IF((AVERAGE(P34,K34,F34))>97,Paramétrages!$F$3,IF((AVERAGE(P34,K34,F34))>95,Paramétrages!$F$4,IF((AVERAGE(P34,K34,F34))>92,Paramétrages!$F$5,IF((AVERAGE(P34,K34,F34))>89,Paramétrages!$F$6,IF((AVERAGE(P34,K34,F34))>85,Paramétrages!$F$7,IF((AVERAGE(P34,K34,F34))>82,Paramétrages!$F$8,IF((AVERAGE(P34,K34,F34))>79,Paramétrages!$F$9,IF((AVERAGE(P34,K34,F34))<80,Paramétrages!$F$10,\"0\"))))))))","v":{"$error":"#DIV/0!"}},{"$f":"IF((SUM(Q34,L34,G34))=Paramétrages!$H$3,Paramétrages!$I$3,IF((SUM(Q34,L34,G34))=Paramétrages!$H$4,Paramétrages!$I$4,IF((SUM(Q34,L34,G34))=Paramétrages!$H$5,Paramétrages!$I$5,IF((SUM(Q34,L34,G34))=Paramétrages!$H$6,Paramétrages!$I$6,IF((SUM(Q34,L34,G34))=Paramétrages!$H$7,Paramétrages!$I$7,IF((SUM(Q34,L34,G34))=Paramétrages!$H$8,Paramétrages!$I$8,IF((SUM(Q34,L34,G34))=Paramétrages!$H$9,Paramétrages!$I$9,IF((SUM(Q34,L34,G34))=Paramétrages!$H$10,Paramétrages!$I$10,IF((SUM(Q34,L34,G34))=Paramétrages!$H$11,Paramétrages!$I$11,IF((SUM(Q34,L34,G34))=Paramétrages!$H$12,Paramétrages!$I$12,IF((SUM(Q34,L34,G34))>Paramétrages!$H$13,Paramétrages!$I$13,\"0\")))))))))))","v":8},0,{"$error":"#DIV/0!"}]
[{"$f":"'Données élèves 3 courses'!A32","v":0},{"$f":"'Données élèves 3 courses'!B32","v":0},{"$f":"'Données élèves 3 courses'!C32","v":0},{"$f":"'Données élèves 3 courses'!E32","v":0},null,{"$f":"IF(((E35*Paramétrages!$B$3)*100)/(((B35*1000)*C35)/60)>100,100,((E35*Paramétrages!$B$3)*100)/(((B35*1000)*C35)/60))","v":{"$error":"#DIV/0!"}},0,{"$f":"'Données élèves 3 courses'!F32","v":0},{"$f":"'Données élèves 3 courses'!H32","v":0},null,{"$f":"IF(((J35*Paramétrages!$B$3)*100)/(((B35*1000)*H35)/60)>100,100,((J35*Paramétrages!$B$3)*100)/(((B35*1000)*H35)/60))","v":{"$error":"#DIV/0!"}},0,{"$f":"'Données élèves 3 courses'!I32","v":0},{"$f":"'Données élèves 3 courses'!K32","v":0},null,{"$f":"IF(((O35*Paramétrages!$B$3)*100)/(((B35*1000)*M35)/60)>100,100,((O35*Paramétrages!$B$3)*100)/(((B35*1000)*M35)/60))","v":{"$error":"#DIV/0!"}},0,null,"Erreur",0,{"$f":"'Données élèves 3 courses'!O32","v":""},{"$error":"#DIV/0!"},{"$f":"IF((AVERAGE(P35,K35,F35))>97,Paramétrages!$F$3,IF((AVERAGE(P35,K35,F35))>95,Paramétrages!$F$4,IF((AVERAGE(P35,K35,F35))>92,Paramétrages!$F$5,IF((AVERAGE(P35,K35,F35))>89,Paramétrages!$F$6,IF((AVERAGE(P35,K35,F35))>85,Paramétrages!$F$7,IF((AVERAGE(P35,K35,F35))>82,Paramétrages!$F$8,IF((AVERAGE(P35,K35,F35))>79,Paramétrages!$F$9,IF((AVERAGE(P35,K35,F35))<80,Paramétrages!$F$10,\"0\"))))))))","v":{"$error":"#DIV/0!"}},{"$f":"IF((SUM(Q35,L35,G35))=Paramétrages!$H$3,Paramétrages!$I$3,IF((SUM(Q35,L35,G35))=Paramétrages!$H$4,Paramétrages!$I$4,IF((SUM(Q35,L35,G35))=Paramétrages!$H$5,Paramétrages!$I$5,IF((SUM(Q35,L35,G35))=Paramétrages!$H$6,Paramétrages!$I$6,IF((SUM(Q35,L35,G35))=Paramétrages!$H$7,Paramétrages!$I$7,IF((SUM(Q35,L35,G35))=Paramétrages!$H$8,Paramétrages!$I$8,IF((SUM(Q35,L35,G35))=Paramétrages!$H$9,Paramétrages!$I$9,IF((SUM(Q35,L35,G35))=Paramétrages!$H$10,Paramétrages!$I$10,IF((SUM(Q35,L35,G35))=Paramétrages!$H$11,Paramétrages!$I$11,IF((SUM(Q35,L35,G35))=Paramétrages!$H$12,Paramétrages!$I$12,IF((SUM(Q35,L35,G35))>Paramétrages!$H$13,Paramétrages!$I$13,\"0\")))))))))))","v":8},0,{"$error":"#DIV/0!"}]
[{"$f":"'Données élèves 3 courses'!A33","v":0},{"$f":"'Données élèves 3 courses'!B33","v":0},{"$f":"'Données élèves 3 courses'!C33","v":0},{"$f":"'Données élèves 3 courses'!E33","v":0},null,{"$f":"IF(((E36*Paramétrages!$B$3)*100)/(((B36*1000)*C36)/60)>100,100,((E36*Paramétrages!$B$3)*100)/(((B36*1000)*C36)/60))","v":{"$error":"#DIV/0!"}},0,{"$f":"'Données élèves 3 courses'!F33","v":0},{"$f":"'Données élèves 3 courses'!H33","v":0},null,{"$f":"IF(((J36*Paramétrages!$B$3)*100)/(((B36*1000)*H36)/60)>100,100,((J36*Paramétrages!$B$3)*100)/(((B36*1000)*H36)/60))","v":{"$error":"#DIV/0!"}},0,{"$f":"'Données élèves 3 courses'!I33","v":0},{"$f":"'Données élèves 3 courses'!K33","v":0},null,{"$f":"IF(((O36*Paramétrages!$B$3)*100)/(((B36*1000)*M36)/60)>100,100,((O36*Paramétrages!$B$3)*100)/(((B36*1000)*M36)/60))","v":{"$error":"#DIV/0!"}},0,null,"Erreur",0,{"$f":"'Données élèves 3 courses'!O33","v":""},{"$error":"#DIV/0!"},{"$f":"IF((AVERAGE(P36,K36,F36))>97,Paramétrages!$F$3,IF((AVERAGE(P36,K36,F36))>95,Paramétrages!$F$4,IF((AVERAGE(P36,K36,F36))>92,Paramétrages!$F$5,IF((AVERAGE(P36,K36,F36))>89,Paramétrages!$F$6,IF((AVERAGE(P36,K36,F36))>85,Paramétrages!$F$7,IF((AVERAGE(P36,K36,F36))>82,Paramétrages!$F$8,IF((AVERAGE(P36,K36,F36))>79,Paramétrages!$F$9,IF((AVERAGE(P36,K36,F36))<80,Paramétrages!$F$10,\"0\"))))))))","v":{"$error":"#DIV/0!"}},{"$f":"IF((SUM(Q36,L36,G36))=Paramétrages!$H$3,Paramétrages!$I$3,IF((SUM(Q36,L36,G36))=Paramétrages!$H$4,Paramétrages!$I$4,IF((SUM(Q36,L36,G36))=Paramétrages!$H$5,Paramétrages!$I$5,IF((SUM(Q36,L36,G36))=Paramétrages!$H$6,Paramétrages!$I$6,IF((SUM(Q36,L36,G36))=Paramétrages!$H$7,Paramétrages!$I$7,IF((SUM(Q36,L36,G36))=Paramétrages!$H$8,Paramétrages!$I$8,IF((SUM(Q36,L36,G36))=Paramétrages!$H$9,Paramétrages!$I$9,IF((SUM(Q36,L36,G36))=Paramétrages!$H$10,Paramétrages!$I$10,IF((SUM(Q36,L36,G36))=Paramétrages!$H$11,Paramétrages!$I$11,IF((SUM(Q36,L36,G36))=Paramétrages!$H$12,Paramétrages!$I$12,IF((SUM(Q36,L36,G36))>Paramétrages!$H$13,Paramétrages!$I$13,\"0\")))))))))))","v":8},0,{"$error":"#DIV/0!"}]
[{"$f":"'Données élèves 3 courses'!A34","v":0},{"$f":"'Données élèves 3 courses'!B34","v":0},{"$f":"'Données élèves 3 courses'!C34","v":0},{"$f":"'Données élèves 3 courses'!E34","v":0},null,{"$f":"IF(((E37*Paramétrages!$B$3)*100)/(((B37*1000)*C37)/60)>100,100,((E37*Paramétrages!$B$3)*100)/(((B37*1000)*C37)/60))","v":{"$error":"#DIV/0!"}},0,{"$f":"'Données élèves 3 courses'!F34","v":0},{"$f":"'Données élèves 3 courses'!H34","v":0},null,{"$f":"IF(((J37*Paramétrages!$B$3)*100)/(((B37*1000)*H37)/60)>100,100,((J37*Paramétrages!$B$3)*100)/(((B37*1000)*H37)/60))","v":{"$error":"#DIV/0!"}},0,{"$f":"'Données élèves 3 courses'!I34","v":0},{"$f":"'Données élèves 3 courses'!K34","v":0},null,{"$f":"IF(((O37*Paramétrages!$B$3)*100)/(((B37*1000)*M37)/60)>100,100,((O37*Paramétrages!$B$3)*100)/(((B37*1000)*M37)/60))","v":{"$error":"#DIV/0!"}},0,null,"Erreur",0,{"$f":"'Données élèves 3 courses'!O34","v":""},{"$error":"#DIV/0!"},{"$f":"IF((AVERAGE(P37,K37,F37))>97,Paramétrages!$F$3,IF((AVERAGE(P37,K37,F37))>95,Paramétrages!$F$4,IF((AVERAGE(P37,K37,F37))>92,Paramétrages!$F$5,IF((AVERAGE(P37,K37,F37))>89,Paramétrages!$F$6,IF((AVERAGE(P37,K37,F37))>85,Paramétrages!$F$7,IF((AVERAGE(P37,K37,F37))>82,Paramétrages!$F$8,IF((AVERAGE(P37,K37,F37))>79,Paramétrages!$F$9,IF((AVERAGE(P37,K37,F37))<80,Paramétrages!$F$10,\"0\"))))))))","v":{"$error":"#DIV/0!"}},{"$f":"IF((SUM(Q37,L37,G37))=Paramétrages!$H$3,Paramétrages!$I$3,IF((SUM(Q37,L37,G37))=Paramétrages!$H$4,Paramétrages!$I$4,IF((SUM(Q37,L37,G37))=Paramétrages!$H$5,Paramétrages!$I$5,IF((SUM(Q37,L37,G37))=Paramétrages!$H$6,Paramétrages!$I$6,IF((SUM(Q37,L37,G37))=Paramétrages!$H$7,Paramétrages!$I$7,IF((SUM(Q37,L37,G37))=Paramétrages!$H$8,Paramétrages!$I$8,IF((SUM(Q37,L37,G37))=Paramétrages!$H$9,Paramétrages!$I$9,IF((SUM(Q37,L37,G37))=Paramétrages!$H$10,Paramétrages!$I$10,IF((SUM(Q37,L37,G37))=Paramétrages!$H$11,Paramétrages!$I$11,IF((SUM(Q37,L37,G37))=Paramétrages!$H$12,Paramétrages!$I$12,IF((SUM(Q37,L37,G37))>Paramétrages!$H$13,Paramétrages!$I$13,\"0\")))))))))))","v":8},0,{"$error":"#DIV/0!"}]
[{"$f":"'Données élèves 3 courses'!A35","v":0},{"$f":"'Données élèves 3 courses'!B35","v":0},{"$f":"'Données élèves 3 courses'!C35","v":0},{"$f":"'Données élèves 3 courses'!E35","v":0},null,{"$f":"IF(((E38*Paramétrages!$B$3)*100)/(((B38*1000)*C38)/60)>100,100,((E38*Paramétrages!$B$3)*100)/(((B38*1000)*C38)/60))","v":{"$error":"#DIV/0!"}},0,{"$f":"'Données élèves 3 courses'!F35","v":0},{"$f":"'Données élèves 3 courses'!H35","v":0},null,{"$f":"IF(((J38*Paramétrages!$B$3)*100)/(((B38*1000)*H38)/60)>100,100,((J38*Paramétrages!$B$3)*100)/(((B38*1000)*H38)/60))","v":{"$error":"#DIV/0!"}},0,{"$f":"'Données élèves 3 courses'!I35","v":0},{"$f":"'Données élèves 3 courses'!K35","v":0},null,{"$f":"IF(((O38*Paramétrages!$B$3)*100)/(((B38*1000)*M38)/60)>100,100,((O38*Paramétrages!$B$3)*100)/(((B38*1000)*M38)/60))","v":{"$error":"#DIV/0!"}},0,null,"Erreur",0,{"$f":"'Données élèves 3 courses'!O35","v":""},{"$error":"#DIV/0!"},{"$f":"IF((AVERAGE(P38,K38,F38))>97,Paramétrages!$F$3,IF((AVERAGE(P38,K38,F38))>95,Paramétrages!$F$4,IF((AVERAGE(P38,K38,F38))>92,Paramétrages!$F$5,IF((AVERAGE(P38,K38,F38))>89,Paramétrages!$F$6,IF((AVERAGE(P38,K38,F38))>85,Paramétrages!$F$7,IF((AVERAGE(P38,K38,F38))>82,Paramétrages!$F$8,IF((AVERAGE(P38,K38,F38))>79,Paramétrages!$F$9,IF((AVERAGE(P38,K38,F38))<80,Paramétrages!$F$10,\"0\"))))))))","v":{"$error":"#DIV/0!"}},{"$f":"IF((SUM(Q38,L38,G38))=Paramétrages!$H$3,Paramétrages!$I$3,IF((SUM(Q38,L38,G38))=Paramétrages!$H$4,Paramétrages!$I$4,IF((SUM(Q38,L38,G38))=Paramétrages!$H$5,Paramétrages!$I$5,IF((SUM(Q38,L38,G38))=Paramétrages!$H$6,Paramétrages!$I$6,IF((SUM(Q38,L38,G38))=Paramétrages!$H$7,Paramétrages!$I$7,IF((SUM(Q38,L38,G38))=Paramétrages!$H$8,Paramétrages!$I$8,IF((SUM(Q38,L38,G38))=Paramétrages!$H$9,Paramétrages!$I$9,IF((SUM(Q38,L38,G38))=Paramétrages!$H$10,Paramétrages!$I$10,IF((SUM(Q38,L38,G38))=Paramétrages!$H$11,Paramétrages!$I$11,IF((SUM(Q38,L38,G38))=Paramétrages!$H$12,Paramétrages!$I$12,IF((SUM(Q38,L38,G38))>Paramétrages!$H$13,Paramétrages!$I$13,\"0\")))))))))))","v":8},0,{"$error":"#DIV/0!"}]
[{"$f":"'Données élèves 3 courses'!A36","v":0},{"$f":"'Données élèves 3 courses'!B36","v":0},{"$f":"'Données élèves 3 courses'!C36","v":0},{"$f":"'Données élèves 3 courses'!E36","v":0},null,{"$f":"IF(((E39*Paramétrages!$B$3)*100)/(((B39*1000)*C39)/60)>100,100,((E39*Paramétrages!$B$3)*100)/(((B39*1000)*C39)/60))","v":{"$error":"#DIV/0!"}},0,{"$f":"'Données élèves 3 courses'!F36","v":0},{"$f":"'Données élèves 3 courses'!H36","v":0},null,{"$f":"IF(((J39*Paramétrages!$B$3)*100)/(((B39*1000)*H39)/60)>100,100,((J39*Paramétrages!$B$3)*100)/(((B39*1000)*H39)/60))","v":{"$error":"#DIV/0!"}},0,{"$f":"'Données élèves 3 courses'!I36","v":0},{"$f":"'Données élèves 3 courses'!K36","v":0},null,{"$f":"IF(((O39*Paramétrages!$B$3)*100)/(((B39*1000)*M39)/60)>100,100,((O39*Paramétrages!$B$3)*100)/(((B39*1000)*M39)/60))","v":{"$error":"#DIV/0!"}},0,null,"Erreur",0,{"$f":"'Données élèves 3 courses'!O36","v":""},{"$error":"#DIV/0!"},{"$f":"IF((AVERAGE(P39,K39,F39))>97,Paramétrages!$F$3,IF((AVERAGE(P39,K39,F39))>95,Paramétrages!$F$4,IF((AVERAGE(P39,K39,F39))>92,Paramétrages!$F$5,IF((AVERAGE(P39,K39,F39))>89,Paramétrages!$F$6,IF((AVERAGE(P39,K39,F39))>85,Paramétrages!$F$7,IF((AVERAGE(P39,K39,F39))>82,Paramétrages!$F$8,IF((AVERAGE(P39,K39,F39))>79,Paramétrages!$F$9,IF((AVERAGE(P39,K39,F39))<80,Paramétrages!$F$10,\"0\"))))))))","v":{"$error":"#DIV/0!"}},{"$f":"IF((SUM(Q39,L39,G39))=Paramétrages!$H$3,Paramétrages!$I$3,IF((SUM(Q39,L39,G39))=Paramétrages!$H$4,Paramétrages!$I$4,IF((SUM(Q39,L39,G39))=Paramétrages!$H$5,Paramétrages!$I$5,IF((SUM(Q39,L39,G39))=Paramétrages!$H$6,Paramétrages!$I$6,IF((SUM(Q39,L39,G39))=Paramétrages!$H$7,Paramétrages!$I$7,IF((SUM(Q39,L39,G39))=Paramétrages!$H$8,Paramétrages!$I$8,IF((SUM(Q39,L39,G39))=Paramétrages!$H$9,Paramétrages!$I$9,IF((SUM(Q39,L39,G39))=Paramétrages!$H$10,Paramétrages!$I$10,IF((SUM(Q39,L39,G39))=Paramétrages!$H$11,Paramétrages!$I$11,IF((SUM(Q39,L39,G39))=Paramétrages!$H$12,Paramétrages!$I$12,IF((SUM(Q39,L39,G39))>Paramétrages!$H$13,Paramétrages!$I$13,\"0\")))))))))))","v":8},0,{"$error":"#DIV/0!"}]
[{"$f":"'Données élèves 3 courses'!A37","v":0},{"$f":"'Données élèves 3 courses'!B37","v":0},{"$f":"'Données élèves 3 courses'!C37","v":0},{"$f":"'Données élèves 3 courses'!E37","v":0},null,{"$f":"IF(((E40*Paramétrages!$B$3)*100)/(((B40*1000)*C40)/60)>100,100,((E40*Paramétrages!$B$3)*100)/(((B40*1000)*C40)/60))","v":{"$error":"#DIV/0!"}},0,{"$f":"'Données élèves 3 courses'!F37","v":0},{"$f":"'Données élèves 3 courses'!H37","v":0},null,{"$f":"IF(((J40*Paramétrages!$B$3)*100)/(((B40*1000)*H40)/60)>100,100,((J40*Paramétrages!$B$3)*100)/(((B40*1000)*H40)/60))","v":{"$error":"#DIV/0!"}},0,{"$f":"'Données élèves 3 courses'!I37","v":0},{"$f":"'Données élèves 3 courses'!K37","v":0},null,{"$f":"IF(((O40*Paramétrages!$B$3)*100)/(((B40*1000)*M40)/60)>100,100,((O40*Paramétrages!$B$3)*100)/(((B40*1000)*M40)/60))","v":{"$error":"#DIV/0!"}},0,null,"Erreur",0,{"$f":"'Données élèves 3 courses'!O37","v":""},{"$error":"#DIV/0!"},{"$f":"IF((AVERAGE(P40,K40,F40))>97,Paramétrages!$F$3,IF((AVERAGE(P40,K40,F40))>95,Paramétrages!$F$4,IF((AVERAGE(P40,K40,F40))>92,Paramétrages!$F$5,IF((AVERAGE(P40,K40,F40))>89,Paramétrages!$F$6,IF((AVERAGE(P40,K40,F40))>85,Paramétrages!$F$7,IF((AVERAGE(P40,K40,F40))>82,Paramétrages!$F$8,IF((AVERAGE(P40,K40,F40))>79,Paramétrages!$F$9,IF((AVERAGE(P40,K40,F40))<80,Paramétrages!$F$10,\"0\"))))))))","v":{"$error":"#DIV/0!"}},{"$f":"IF((SUM(Q40,L40,G40))=Paramétrages!$H$3,Paramétrages!$I$3,IF((SUM(Q40,L40,G40))=Paramétrages!$H$4,Paramétrages!$I$4,IF((SUM(Q40,L40,G40))=Paramétrages!$H$5,Paramétrages!$I$5,IF((SUM(Q40,L40,G40))=Paramétrages!$H$6,Paramétrages!$I$6,IF((SUM(Q40,L40,G40))=Paramétrages!$H$7,Paramétrages!$I$7,IF((SUM(Q40,L40,G40))=Paramétrages!$H$8,Paramétrages!$I$8,IF((SUM(Q40,L40,G40))=Paramétrages!$H$9,Paramétrages!$I$9,IF((SUM(Q40,L40,G40))=Paramétrages!$H$10,Paramétrages!$I$10,IF((SUM(Q40,L40,G40))=Paramétrages!$H$11,Paramétrages!$I$11,IF((SUM(Q40,L40,G40))=Paramétrages!$H$12,Paramétrages!$I$12,IF((SUM(Q40,L40,G40))>Paramétrages!$H$13,Paramétrages!$I$13,\"0\")))))))))))","v":8},0,{"$error":"#DIV/0!"}]
[{"$f":"'Données élèves 3 courses'!A38","v":0},{"$f":"'Données élèves 3 courses'!B38","v":0},{"$f":"'Données élèves 3 courses'!C38","v":0},{"$f":"'Données élèves 3 courses'!E38","v":0},null,{"$f":"IF(((E41*Paramétrages!$B$3)*100)/(((B41*1000)*C41)/60)>100,100,((E41*Paramétrages!$B$3)*100)/(((B41*1000)*C41)/60))","v":{"$error":"#DIV/0!"}},0,{"$f":"'Données élèves 3 courses'!F38","v":0},{"$f":"'Données élèves 3 courses'!H38","v":0},null,{"$f":"IF(((J41*Paramétrages!$B$3)*100)/(((B41*1000)*H41)/60)>100,100,((J41*Paramétrages!$B$3)*100)/(((B41*1000)*H41)/60))","v":{"$error":"#DIV/0!"}},0,{"$f":"'Données élèves 3 courses'!I38","v":0},{"$f":"'Données élèves 3 courses'!K38","v":0},null,{"$f":"IF(((O41*Paramétrages!$B$3)*100)/(((B41*1000)*M41)/60)>100,100,((O41*Paramétrages!$B$3)*100)/(((B41*1000)*M41)/60))","v":{"$error":"#DIV/0!"}},0,null,"Erreur",0,{"$f":"'Données élèves 3 courses'!O38","v":""},{"$error":"#DIV/0!"},{"$f":"IF((AVERAGE(P41,K41,F41))>97,Paramétrages!$F$3,IF((AVERAGE(P41,K41,F41))>95,Paramétrages!$F$4,IF((AVERAGE(P41,K41,F41))>92,Paramétrages!$F$5,IF((AVERAGE(P41,K41,F41))>89,Paramétrages!$F$6,IF((AVERAGE(P41,K41,F41))>85,Paramétrages!$F$7,IF((AVERAGE(P41,K41,F41))>82,Paramétrages!$F$8,IF((AVERAGE(P41,K41,F41))>79,Paramétrages!$F$9,IF((AVERAGE(P41,K41,F41))<80,Paramétrages!$F$10,\"0\"))))))))","v":{"$error":"#DIV/0!"}},{"$f":"IF((SUM(Q41,L41,G41))=Paramétrages!$H$3,Paramétrages!$I$3,IF((SUM(Q41,L41,G41))=Paramétrages!$H$4,Paramétrages!$I$4,IF((SUM(Q41,L41,G41))=Paramétrages!$H$5,Paramétrages!$I$5,IF((SUM(Q41,L41,G41))=Paramétrages!$H$6,Paramétrages!$I$6,IF((SUM(Q41,L41,G41))=Paramétrages!$H$7,Paramétrages!$I$7,IF((SUM(Q41,L41,G41))=Paramétrages!$H$8,Paramétrages!$I$8,IF((SUM(Q41,L41,G41))=Paramétrages!$H$9,Paramétrages!$I$9,IF((SUM(Q41,L41,G41))=Paramétrages!$H$10,Paramétrages!$I$10,IF((SUM(Q41,L41,G41))=Paramétrages!$H$11,Paramétrages!$I$11,IF((SUM(Q41,L41,G41))=Paramétrages!$H$12,Paramétrages!$I$12,IF((SUM(Q41,L41,G41))>Paramétrages!$H$13,Paramétrages!$I$13,\"0\")))))))))))","v":8},0,{"$error":"#DIV/0!"}]
[{"$f":"'Données élèves 3 courses'!A39","v":0},{"$f":"'Données élèves 3 courses'!B39","v":0},{"$f":"'Données élèves 3 courses'!C39","v":0},{"$f":"'Données élèves 3 courses'!E39","v":0},null,{"$f":"IF(((E42*Paramétrages!$B$3)*100)/(((B42*1000)*C42)/60)>100,100,((E42*Paramétrages!$B$3)*100)/(((B42*1000)*C42)/60))","v":{"$error":"#DIV/0!"}},0,{"$f":"'Données élèves 3 courses'!F39","v":0},{"$f":"'Données élèves 3 courses'!H39","v":0},null,{"$f":"IF(((J42*Paramétrages!$B$3)*100)/(((B42*1000)*H42)/60)>100,100,((J42*Paramétrages!$B$3)*100)/(((B42*1000)*H42)/60))","v":{"$error":"#DIV/0!"}},0,{"$f":"'Données élèves 3 courses'!I39","v":0},{"$f":"'Données élèves 3 courses'!K39","v":0},null,{"$f":"IF(((O42*Paramétrages!$B$3)*100)/(((B42*1000)*M42)/60)>100,100,((O42*Paramétrages!$B$3)*100)/(((B42*1000)*M42)/60))","v":{"$error":"#DIV/0!"}},0,null,"Erreur",0,{"$f":"'Données élèves 3 courses'!O39","v":""},{"$error":"#DIV/0!"},{"$f":"IF((AVERAGE(P42,K42,F42))>97,Paramétrages!$F$3,IF((AVERAGE(P42,K42,F42))>95,Paramétrages!$F$4,IF((AVERAGE(P42,K42,F42))>92,Paramétrages!$F$5,IF((AVERAGE(P42,K42,F42))>89,Paramétrages!$F$6,IF((AVERAGE(P42,K42,F42))>85,Paramétrages!$F$7,IF((AVERAGE(P42,K42,F42))>82,Paramétrages!$F$8,IF((AVERAGE(P42,K42,F42))>79,Paramétrages!$F$9,IF((AVERAGE(P42,K42,F42))<80,Paramétrages!$F$10,\"0\"))))))))","v":{"$error":"#DIV/0!"}},{"$f":"IF((SUM(Q42,L42,G42))=Paramétrages!$H$3,Paramétrages!$I$3,IF((SUM(Q42,L42,G42))=Paramétrages!$H$4,Paramétrages!$I$4,IF((SUM(Q42,L42,G42))=Paramétrages!$H$5,Paramétrages!$I$5,IF((SUM(Q42,L42,G42))=Paramétrages!$H$6,Paramétrages!$I$6,IF((SUM(Q42,L42,G42))=Paramétrages!$H$7,Paramétrages!$I$7,IF((SUM(Q42,L42,G42))=Paramétrages!$H$8,Paramétrages!$I$8,IF((SUM(Q42,L42,G42))=Paramétrages!$H$9,Paramétrages!$I$9,IF((SUM(Q42,L42,G42))=Paramétrages!$H$10,Paramétrages!$I$10,IF((SUM(Q42,L42,G42))=Paramétrages!$H$11,Paramétrages!$I$11,IF((SUM(Q42,L42,G42))=Paramétrages!$H$12,Paramétrages!$I$12,IF((SUM(Q42,L42,G42))>Paramétrages!$H$13,Paramétrages!$I$13,\"0\")))))))))))","v":8},0,{"$error":"#DIV/0!"}]
[{"$f":"'Données élèves 3 courses'!A40","v":0},{"$f":"'Données élèves 3 courses'!B40","v":0},{"$f":"'Données élèves 3 courses'!C40","v":0},{"$f":"'Données élèves 3 courses'!E40","v":0},null,{"$f":"IF(((E43*Paramétrages!$B$3)*100)/(((B43*1000)*C43)/60)>100,100,((E43*Paramétrages!$B$3)*100)/(((B43*1000)*C43)/60))","v":{"$error":"#DIV/0!"}},0,{"$f":"'Données élèves 3 courses'!F40","v":0},{"$f":"'Données élèves 3 courses'!H40","v":0},null,{"$f":"IF(((J43*Paramétrages!$B$3)*100)/(((B43*1000)*H43)/60)>100,100,((J43*Paramétrages!$B$3)*100)/(((B43*1000)*H43)/60))","v":{"$error":"#DIV/0!"}},0,{"$f":"'Données élèves 3 courses'!I40","v":0},{"$f":"'Données élèves 3 courses'!K40","v":0},null,{"$f":"IF(((O43*Paramétrages!$B$3)*100)/(((B43*1000)*M43)/60)>100,100,((O43*Paramétrages!$B$3)*100)/(((B43*1000)*M43)/60))","v":{"$error":"#DIV/0!"}},0,null,"Erreur",0,{"$f":"'Données élèves 3 courses'!O40","v":""},{"$error":"#DIV/0!"},{"$f":"IF((AVERAGE(P43,K43,F43))>97,Paramétrages!$F$3,IF((AVERAGE(P43,K43,F43))>95,Paramétrages!$F$4,IF((AVERAGE(P43,K43,F43))>92,Paramétrages!$F$5,IF((AVERAGE(P43,K43,F43))>89,Paramétrages!$F$6,IF((AVERAGE(P43,K43,F43))>85,Paramétrages!$F$7,IF((AVERAGE(P43,K43,F43))>82,Paramétrages!$F$8,IF((AVERAGE(P43,K43,F43))>79,Paramétrages!$F$9,IF((AVERAGE(P43,K43,F43))<80,Paramétrages!$F$10,\"0\"))))))))","v":{"$error":"#DIV/0!"}},{"$f":"IF((SUM(Q43,L43,G43))=Paramétrages!$H$3,Paramétrages!$I$3,IF((SUM(Q43,L43,G43))=Paramétrages!$H$4,Paramétrages!$I$4,IF((SUM(Q43,L43,G43))=Paramétrages!$H$5,Paramétrages!$I$5,IF((SUM(Q43,L43,G43))=Paramétrages!$H$6,Paramétrages!$I$6,IF((SUM(Q43,L43,G43))=Paramétrages!$H$7,Paramétrages!$I$7,IF((SUM(Q43,L43,G43))=Paramétrages!$H$8,Paramétrages!$I$8,IF((SUM(Q43,L43,G43))=Paramétrages!$H$9,Paramétrages!$I$9,IF((SUM(Q43,L43,G43))=Paramétrages!$H$10,Paramétrages!$I$10,IF((SUM(Q43,L43,G43))=Paramétrages!$H$11,Paramétrages!$I$11,IF((SUM(Q43,L43,G43))=Paramétrages!$H$12,Paramétrages!$I$12,IF((SUM(Q43,L43,G43))>Paramétrages!$H$13,Paramétrages!$I$13,\"0\")))))))))))","v":8},0,{"$error":"#DIV/0!"}]